 




﻿"Item Id","Item URI","Dublin Core:Title","Dublin Core:Subject","Dublin Core:Description","Dublin Core:Creator","Dublin Core:Source","Dublin Core:Publisher","Dublin Core:Date","Dublin Core:Contributor","Dublin Core:Rights","Dublin Core:Relation","Dublin Core:Format","Dublin Core:Language","Dublin Core:Type","Dublin Core:Identifier","Dublin Core:Coverage","Item Type Metadata:Text","Item Type Metadata:Interviewer","Item Type Metadata:Interviewee","Item Type Metadata:Location","Item Type Metadata:Transcription","Item Type Metadata:Local URL","Item Type Metadata:Original Format","Item Type Metadata:Physical Dimensions","Item Type Metadata:Duration","Item Type Metadata:Compression","Item Type Metadata:Producer","Item Type Metadata:Director","Item Type Metadata:Bit Rate/Frequency","Item Type Metadata:Time Summary","Item Type Metadata:Email Body","Item Type Metadata:Subject Line","Item Type Metadata:From","Item Type Metadata:To","Item Type Metadata:CC","Item Type Metadata:BCC","Item Type Metadata:Number of Attachments","Item Type Metadata:Standards","Item Type Metadata:Objectives","Item Type Metadata:Materials","Item Type Metadata:Lesson Plan Text","Item Type Metadata:URL","Item Type Metadata:Event Type","Item Type Metadata:Participants","Item Type Metadata:Birth Date","Item Type Metadata:Birthplace","Item Type Metadata:Death Date","Item Type Metadata:Occupation","Item Type Metadata:Biographical Text","Item Type Metadata:Bibliography","Item Type Metadata:Digital Reproduction Information","Item Type Metadata:Repository","Item Type Metadata:Repository Collection","Item Type Metadata:Contact information.","Item Type Metadata:File Name","Item Type Metadata:Notes","Item Type Metadata:Digital item created","Item Type Metadata:Digital item modified","Item Type Metadata:Executive Orders","Item Type Metadata:Record Created","Item Type Metadata:Record Modified","Item Type Metadata:Transcription2","Item Type Metadata:Source URL","Omeka Legacy File:Additional Creator","Omeka Legacy File:Transcriber","Omeka Legacy File:Producer","Omeka Legacy File:Render Device","Omeka Legacy File:Render Details","Omeka Legacy File:Capture Date","Omeka Legacy File:Capture Device","Omeka Legacy File:Capture Details","Omeka Legacy File:Change History","Omeka Legacy File:Watermark","Omeka Legacy File:Encryption","Omeka Legacy File:Compression","Omeka Legacy File:Post Processing","Omeka Image File:Width","Omeka Image File:Height","Omeka Image File:Bit Depth","Omeka Image File:Channels","Omeka Image File:Exif String","Omeka Image File:Exif Array","Omeka Image File:IPTC String","Omeka Image File:IPTC Array","Omeka Video File:Bitrate","Omeka Video File:Duration","Omeka Video File:Sample Rate","Omeka Video File:Codec","Omeka Video File:Width","Omeka Video File:Height",tags,file,itemType,collection,public,featured
8497,https://www.iowaheritage.org/items/show/8497,"What a wonderful difference thirty years can make.","Human nature|United States|Airplanes.|progress|aviation|skepticism|transportation|technology|London (England)|Rome (Italy)|Paris (France)|Cairo (Egypt)",,"Darling, Jay N. (Jay Norwood), 1876-1962","The Editorial cartoons of J.N. ""Ding"" Darling [electronic resource] : The Cowles Collection, Drake University, 1912-1962",,1939/08/03|1939,,"Copyright is owned by the ""Ding"" Darling Wildlife Society; it is administered on behalf of the Society by The University of Iowa. While use within the classroom is encouraged without specific authorization, publishing this cartoon in any format requires written permission. See policy and permissions procedure at: http://www.lib.uiowa.edu/spec-coll/services/dingdarling_fees.html","Cowles Library, Drake University, 2507 University Ave., Des Moines, IA 50311-4505.",,,,"390803.jpg|http://ddr.lib.drake.edu/u?/ddarling,5427",,,,,,,,,,,,,,,,,,,,,,,,,,,,,,,,,,,,,,,,,,,,,,,,"<a href=""http://ddr.lib.drake.edu/u?/ddarling,5427"" target=""_blank"">View this item in its source respository</a>",,,,,,,,,,,,,,,,,,,,,,,,,,,,,https://www.iowaheritage.org/files/original/8fd324f4c110d5fd8c5f76f89a794f3f.jpg,"Remote Item","Editorial Cartoons of J.N. ""Ding"" Darling, Drake University",1,0
8978,https://www.iowaheritage.org/items/show/8978,"Eventually why not now?","War|World War, 1939-1945|Airplane.|commerce|transportation|freight|air cargo|airplanes",,"Darling, Jay N. (Jay Norwood), 1876-1962","The Editorial cartoons of J.N. ""Ding"" Darling [electronic resource] : The Cowles Collection, Drake University, 1912-1962",,1942/07/27|1942,,"Copyright is owned by the ""Ding"" Darling Wildlife Society; it is administered on behalf of the Society by The University of Iowa. While use within the classroom is encouraged without specific authorization, publishing this cartoon in any format requires written permission. See policy and permissions procedure at: http://www.lib.uiowa.edu/spec-coll/services/dingdarling_fees.html","Cowles Library, Drake University, 2507 University Ave., Des Moines, IA 50311-4505.",,,,"420727.jpg|http://ddr.lib.drake.edu/u?/ddarling,5908",,,,,,,,,,,,,,,,,,,,,,,,,,,,,,,,,,,,,,,,,,,,,,,,"<a href=""http://ddr.lib.drake.edu/u?/ddarling,5908"" target=""_blank"">View this item in its source respository</a>",,,,,,,,,,,,,,,,,,,,,,,,,,,,,https://www.iowaheritage.org/files/original/7160b9da1f75b32875193971c90abda9.jpg,"Remote Item","Editorial Cartoons of J.N. ""Ding"" Darling, Drake University",1,0
64206,https://www.iowaheritage.org/items/show/64206,"I think I can","Congress|United States|Trains|2000-2010|Congressional spending|Budgets|Budgets -- United States|Trains|Travel|Travelers|Transportation|Transportation -- Rates|Engineers|Signs|People|Smoke","Ridership increases; Steep grade ahead; Amtrak; Fat chance, unless Congress comes through with some more cash","Duffy, Brian, 1955-",,"University of Iowa. Libraries. Special Collections Dept.",2001-09-26|2011-04,,"Educational use only, no other permissions given. Copyright to this digital object is owned by The Des Moines Register; it may not be downloaded, reproduced, or distributed without written permission. For more information, contact the Special Collections Department.","Editorial Cartoons of Brian Duffy; Des Moines Register Cartoonists|Papers of Brian Duffy|Des Moines Register",,English,"Still image|Editorial cartoons",MSC916|duffy-010926|http://digital.lib.uiowa.edu/cdm/ref/collection/duffy/id/44,,,,,,,,,,,,,,,,,,,,,,,,,,,,,,,,,,,,,,,,,,,,,,,,"<a href=""http://digital.lib.uiowa.edu/cdm/ref/collection/duffy/id/44"" target=""_blank"">View this item in its source respository</a>",,,,,,,,,,,,,,,,,,,,,,,,,,,,,https://www.iowaheritage.org/files/original/8ffa41c4f7dc495e941ff9ea26c2fbeb.jpg,"Remote Item","Editorial Cartoons of Brian Duffy",1,0
64366,https://www.iowaheritage.org/items/show/64366,"Look out! There's a cod on the tracks","England|England|Tunnels|1980-1990|France -- Foreign relations -- Great Britain|Trains|Transportation|Travel|Cooperation|France|Trains|Fish|Railroad tracks|Flags","England; France; Channel Express; Cod catcher","Duffy, Brian, 1955-",,"University of Iowa. Libraries. Special Collections Dept.",1986-01-26|2011-04,,"Educational use only, no other permissions given. Copyright to this digital object is owned by The Des Moines Register; it may not be downloaded, reproduced, or distributed without written permission. For more information, contact the Special Collections Department.","Editorial Cartoons of Brian Duffy; Des Moines Register Cartoonists|Papers of Brian Duffy|Des Moines Register",,English,"Still image|Editorial cartoons",MSC916|duffy-860126|http://digital.lib.uiowa.edu/cdm/ref/collection/duffy/id/204,,,,,,,,,,,,,,,,,,,,,,,,,,,,,,,,,,,,,,,,,,,,,,,,"<a href=""http://digital.lib.uiowa.edu/cdm/ref/collection/duffy/id/204"" target=""_blank"">View this item in its source respository</a>",,,,,,,,,,,,,,,,,,,,,,,,,,,,,https://www.iowaheritage.org/files/original/e07ab98b9d060afd0dae5829513464be.jpg,"Remote Item","Editorial Cartoons of Brian Duffy",1,0
64463,https://www.iowaheritage.org/items/show/64463,"Welcome to Iowa","Highways|Iowa|Automobiles|1990-2000|Rest stops|States|Transportation|Travel|Travelers|Tourists|Tourism|Signs|Families|Highways|Highway signs|Roads|Clouds","Next clean rest area 193 miles; Nebraska 293 miles; ?","Duffy, Brian, 1955-",,"University of Iowa. Libraries. Special Collections Dept.",1993-09-02|2011-04,,"Educational use only, no other permissions given. Copyright to this digital object is owned by The Des Moines Register; it may not be downloaded, reproduced, or distributed without written permission. For more information, contact the Special Collections Department.","Editorial Cartoons of Brian Duffy; Des Moines Register Cartoonists|Papers of Brian Duffy|Des Moines Register",,English,"Still image|Editorial cartoons",MSC916|duffy-930902|http://digital.lib.uiowa.edu/cdm/ref/collection/duffy/id/301,,,,,,,,,,,,,,,,,,,,,,,,,,,,,,,,,,,,,,,,,,,,,,,,"<a href=""http://digital.lib.uiowa.edu/cdm/ref/collection/duffy/id/301"" target=""_blank"">View this item in its source respository</a>",,,,,,,,,,,,,,,,,,,,,,,,,,,,,https://www.iowaheritage.org/files/original/4c8f0dc2e1b183834257c708657199e3.jpg,"Remote Item","Editorial Cartoons of Brian Duffy",1,0
64489,https://www.iowaheritage.org/items/show/64489,"I don't remember a tunnel?","Roads|United States|Holes|1990-2000|Highways|Maintenance|Repairs|Automobiles|Transportation|Tunnels|Automobile drivers|Automobiles|Men|Children|Rocks|Signs|Roads|Springs","Highways; Rough roads; Bumps","Duffy, Brian, 1955-",,"University of Iowa. Libraries. Special Collections Dept.",1997-09-18|2011-04,,"Educational use only, no other permissions given. Copyright to this digital object is owned by The Des Moines Register; it may not be downloaded, reproduced, or distributed without written permission. For more information, contact the Special Collections Department.","Editorial Cartoons of Brian Duffy; Des Moines Register Cartoonists|Papers of Brian Duffy|Des Moines Register",,English,"Still image|Editorial cartoons",MSC916|duffy-970918|http://digital.lib.uiowa.edu/cdm/ref/collection/duffy/id/327,,,,,,,,,,,,,,,,,,,,,,,,,,,,,,,,,,,,,,,,,,,,,,,,"<a href=""http://digital.lib.uiowa.edu/cdm/ref/collection/duffy/id/327"" target=""_blank"">View this item in its source respository</a>",,,,,,,,,,,,,,,,,,,,,,,,,,,,,https://www.iowaheritage.org/files/original/146b6bea8be0a4d8045165315fe946a3.jpg,"Remote Item","Editorial Cartoons of Brian Duffy",1,0
64599,https://www.iowaheritage.org/items/show/64599,"Federal transportation funding","Presidents|Bush, George, 1924-|United States|Presidents|1990-2000|Promises|States|Budgets|Budgets -- United States|Transportation|Funding|Hammers|Signs|Roads|Highway signs|Highways|Automobiles|People|Birds","Road closed; States; What'd that sign say?; I think it said, ""Read my lips""","Duffy, Brian, 1955-",,"University of Iowa. Libraries. Special Collections Dept.",1990-03|2011-04,,"Educational use only, no other permissions given. Copyright to this digital object is owned by The Des Moines Register; it may not be downloaded, reproduced, or distributed without written permission. For more information, contact the Special Collections Department.","Editorial Cartoons of Brian Duffy; Des Moines Register Cartoonists|Papers of Brian Duffy|Des Moines Register",,English,"Still image|Editorial cartoons","MSC916|duffy-9003xx 2|http://digital.lib.uiowa.edu/cdm/ref/collection/duffy/id/437",,,,,,,,,,,,,,,,,,,,,,,,,,,,,,,,,,,,,,,,,,,,,,,,"<a href=""http://digital.lib.uiowa.edu/cdm/ref/collection/duffy/id/437"" target=""_blank"">View this item in its source respository</a>",,,,,,,,,,,,,,,,,,,,,,,,,,,,,https://www.iowaheritage.org/files/original/198d490f8ec7adbb9e798ee971f4ca0b.jpg,"Remote Item","Editorial Cartoons of Brian Duffy",1,0
10953,https://www.iowaheritage.org/items/show/10953,"Set of 24 collages","Hands|United States -- New Jersey -- Hoboken|2000-2010|Women|Skeletons|Fossils|Tea bags|Sound equipment & supplies|Maps|Animals|Windows|Playing cards|Transportation|Fish|Clocks & watches|Boats|Men|Spoons","Set of collages made from cutouts and catalog cards.","Galloway, Gregory",,"University of Iowa. Libraries. Special Collections Dept.",2005|2006-12-14|https://digital.lib.uiowa.edu/,,"Educational use only, no other permissions given. Copyright to this resource is held by the University of Iowa Libraries' Special Collections Department, and is provided here for educational purposes only. It may not be reproduced or distributed in any format without written permission of the Special Collections Department.","cARTalog|cARTalog Collection|http://www.lib.uiowa.edu/collguides/?MSC0859",jpeg|27.8|21.5,eng,"Still image|Collages (Visual works)",173618284,,,,,,,,,,,,,,,,,,,,,,,,,,,,,,,,,,,,,,,,,,,,,,,,,,,,,,,,,,,,,,,,,,,,,,,,,,,,,,"Remote Item","African American Women in Iowa Collection",1,0
50202,https://www.iowaheritage.org/items/show/50202,"Street scene of general store, Homestead, Iowa,1900s","Buildings|Dwellings|United States -- Iowa -- Iowa County -- Homestead|Agriculture and Rural Life|General views|General stores|Horses|Roads|Business, Industry, and Trades|Religion|Transportation",,"Miller, F. W.",126.43,,-190,"Amana Heritage Society","U.S. and international copyright laws protect this digital image. Commercial use or distribution of the image is not permitted without prior permission of the copyright holder. For permission to use the digital image, please contact the Amana Heritage Society",,"1 photograph: b&w; 4.25 x 6.5 in.",,"Still image",,,,,,,,,,,,,,,,,,,,,,,,,,,,,,,,,,,,,"image/jpeg|32,197 bytes|Scanned with HP Scanjet 3400C at 300 ppi. Archival master image available in tiff format.","Amana Heritage Society Collection",,"Please contact the Amana Heritage Society: (319) 622-3567; amherit@juno.com ; http://www.amanaheritage.org/",126.43.jpg,,6/7/2006,,,,,,,,,,,,,,,,,,,,,,,,,,,,,,,,,,,https://www.iowaheritage.org/files/original/fec49defd9be0d89cd8016f439b30ebd.jpg,"Still Image","Amana Heritage Society Collection",1,0
69411,https://www.iowaheritage.org/items/show/69411," Billy Robinson seated in cockpit  ","Robinson, Billy, 1884-1916|Airplanes|Air pilots -- Iowa -- Grinnell|Aviation|Transportation","Billy Robinson, an early Grinnell (Iowa) aviator, piloting airplane. ","Photographer - Child Art Rooms (Grinnell, Ia.)  ",,," ca. 1915 "," Smith, Robert D."," This digital image may be used for educational purposes, as long as it is not altered in any way. No commercial reproduction or distribution of this file is permitted without written permission of Grinnell Public Library. See http://www.grinnell.lib.ia.us/files/copyright.htm  ",," 1 photograph : b&w ; 16 x 25 cm.  ",,"Still image; Studio portraits  ",,,,,,,,,,,,,,,,,,,,,,,,,,,,,,,,,,,,,"150 dpi resolution "," Grinnell Public Library Archives  ","Billy Robinson Collection ",," aeroplane10  ","Finding Aid - Collection 25, Box 2  ","May 3, 2004",,,,,,,,,,,,,,,,,,,,,,,,,,,,,,,,,,,https://www.iowaheritage.org/files/original/a1073a1903de16728cbe0fbdc8ce15cd.jpg,"Still Image","Billy Robinson Heritage Digital Photo Exhibit",1,0
