 




﻿"Item Id","Item URI","Dublin Core:Title","Dublin Core:Subject","Dublin Core:Description","Dublin Core:Creator","Dublin Core:Source","Dublin Core:Publisher","Dublin Core:Date","Dublin Core:Contributor","Dublin Core:Rights","Dublin Core:Relation","Dublin Core:Format","Dublin Core:Language","Dublin Core:Type","Dublin Core:Identifier","Dublin Core:Coverage","Item Type Metadata:Text","Item Type Metadata:Interviewer","Item Type Metadata:Interviewee","Item Type Metadata:Location","Item Type Metadata:Transcription","Item Type Metadata:Local URL","Item Type Metadata:Original Format","Item Type Metadata:Physical Dimensions","Item Type Metadata:Duration","Item Type Metadata:Compression","Item Type Metadata:Producer","Item Type Metadata:Director","Item Type Metadata:Bit Rate/Frequency","Item Type Metadata:Time Summary","Item Type Metadata:Email Body","Item Type Metadata:Subject Line","Item Type Metadata:From","Item Type Metadata:To","Item Type Metadata:CC","Item Type Metadata:BCC","Item Type Metadata:Number of Attachments","Item Type Metadata:Standards","Item Type Metadata:Objectives","Item Type Metadata:Materials","Item Type Metadata:Lesson Plan Text","Item Type Metadata:URL","Item Type Metadata:Event Type","Item Type Metadata:Participants","Item Type Metadata:Birth Date","Item Type Metadata:Birthplace","Item Type Metadata:Death Date","Item Type Metadata:Occupation","Item Type Metadata:Biographical Text","Item Type Metadata:Bibliography","Item Type Metadata:Digital Reproduction Information","Item Type Metadata:Repository","Item Type Metadata:Repository Collection","Item Type Metadata:Contact information.","Item Type Metadata:File Name","Item Type Metadata:Notes","Item Type Metadata:Digital item created","Item Type Metadata:Digital item modified","Item Type Metadata:Executive Orders","Item Type Metadata:Record Created","Item Type Metadata:Record Modified","Item Type Metadata:Transcription2","Item Type Metadata:Source URL","Omeka Legacy File:Additional Creator","Omeka Legacy File:Transcriber","Omeka Legacy File:Producer","Omeka Legacy File:Render Device","Omeka Legacy File:Render Details","Omeka Legacy File:Capture Date","Omeka Legacy File:Capture Device","Omeka Legacy File:Capture Details","Omeka Legacy File:Change History","Omeka Legacy File:Watermark","Omeka Legacy File:Encryption","Omeka Legacy File:Compression","Omeka Legacy File:Post Processing","Omeka Image File:Width","Omeka Image File:Height","Omeka Image File:Bit Depth","Omeka Image File:Channels","Omeka Image File:Exif String","Omeka Image File:Exif Array","Omeka Image File:IPTC String","Omeka Image File:IPTC Array","Omeka Video File:Bitrate","Omeka Video File:Duration","Omeka Video File:Sample Rate","Omeka Video File:Codec","Omeka Video File:Width","Omeka Video File:Height",tags,file,itemType,collection,public,featured
64355,http://www.iowaheritage.org/items/show/64355,"Gee, all I said was, who wants to be my new Secretary of Agriculture?","Presidents|Reagan, Ronald|United States|Presidents|1980-1990|Presidential appointees|Agriculture|Agriculture and state|Cabinets|Farm aid|Farming|Farms|Block, John R.|Cowboys|Saddles|Brands|Men|Running",RR,"Duffy, Brian, 1955-",,"University of Iowa. Libraries. Special Collections Dept.",1986-01-12|2011-04,,"Educational use only, no other permissions given. Copyright to this digital object is owned by The Des Moines Register; it may not be downloaded, reproduced, or distributed without written permission. For more information, contact the Special Collections Department.","Editorial Cartoons of Brian Duffy; Des Moines Register Cartoonists|Papers of Brian Duffy|Des Moines Register",,English,"Still image|Editorial cartoons",MSC916|duffy-860112(2)|http://digital.lib.uiowa.edu/cdm/ref/collection/duffy/id/193,,,,,,,,,,,,,,,,,,,,,,,,,,,,,,,,,,,,,,,,,,,,,,,,"<a href=""http://digital.lib.uiowa.edu/cdm/ref/collection/duffy/id/193"" target=""_blank"">View this item in its source respository</a>",,,,,,,,,,,,,,,,,,,,,,,,,,,,,http://www.iowaheritage.org/files/original/1602dd4713fbc02cb2b72493bab2f9bc.jpg,"Remote Item","Editorial Cartoons of Brian Duffy",1,0
64354,http://www.iowaheritage.org/items/show/64354,"Kick me","Presidents|Block, John R.|United States|Roads|1980-1990|Presidential appointees|Agriculture|Agriculture and state|Cabinets|Farm aid|Farming|Farms|Men|Pigs|Moon|Houses|Trees|Clouds",Block,"Duffy, Brian, 1955-",,"University of Iowa. Libraries. Special Collections Dept.",1986-01-10|2011-04,,"Educational use only, no other permissions given. Copyright to this digital object is owned by The Des Moines Register; it may not be downloaded, reproduced, or distributed without written permission. For more information, contact the Special Collections Department.","Editorial Cartoons of Brian Duffy; Des Moines Register Cartoonists|Papers of Brian Duffy|Des Moines Register",,English,"Still image|Editorial cartoons",MSC916|duffy-860110|http://digital.lib.uiowa.edu/cdm/ref/collection/duffy/id/192,,,,,,,,,,,,,,,,,,,,,,,,,,,,,,,,,,,,,,,,,,,,,,,,"<a href=""http://digital.lib.uiowa.edu/cdm/ref/collection/duffy/id/192"" target=""_blank"">View this item in its source respository</a>",,,,,,,,,,,,,,,,,,,,,,,,,,,,,http://www.iowaheritage.org/files/original/4e026a9e83ef973c1aa04d26078aa913.jpg,"Remote Item","Editorial Cartoons of Brian Duffy",1,0
64343,http://www.iowaheritage.org/items/show/64343,"He found a whole ear of corn on his land!","Farms|Iowa|Men|1980-1990|Farmers|Farming|Droughts|Crop failures|Crops|Corn|Farmers|Farms|Corn|Sun|Barns|Hats",,"Duffy, Brian, 1955-",,"University of Iowa. Libraries. Special Collections Dept.",1983-09-14|2011-04,,"Educational use only, no other permissions given. Copyright to this digital object is owned by The Des Moines Register; it may not be downloaded, reproduced, or distributed without written permission. For more information, contact the Special Collections Department.","Editorial Cartoons of Brian Duffy; Des Moines Register Cartoonists|Papers of Brian Duffy|Des Moines Register",,English,"Still image|Editorial cartoons",MSC916|duffy-830914|http://digital.lib.uiowa.edu/cdm/ref/collection/duffy/id/181,,,,,,,,,,,,,,,,,,,,,,,,,,,,,,,,,,,,,,,,,,,,,,,,"<a href=""http://digital.lib.uiowa.edu/cdm/ref/collection/duffy/id/181"" target=""_blank"">View this item in its source respository</a>",,,,,,,,,,,,,,,,,,,,,,,,,,,,,http://www.iowaheritage.org/files/original/ba37ed877209017b100f087e339737d7.jpg,"Remote Item","Editorial Cartoons of Brian Duffy",1,0
64337,http://www.iowaheritage.org/items/show/64337,"It says we'd better shape up or we'll soon be on someone's breakfast table","Farms|United States|Pigs|1980-1990|Farming|Barns|Trees|Sweating|Mud|Desks|Computers|Printers","Tick ... tick ... tickety","Duffy, Brian, 1955-",,"University of Iowa. Libraries. Special Collections Dept.",1983-09-01|2011-04,,"Educational use only, no other permissions given. Copyright to this digital object is owned by The Des Moines Register; it may not be downloaded, reproduced, or distributed without written permission. For more information, contact the Special Collections Department.","Editorial Cartoons of Brian Duffy; Des Moines Register Cartoonists|Papers of Brian Duffy|Des Moines Register",,English,"Still image|Editorial cartoons",MSC916|duffy-830901|http://digital.lib.uiowa.edu/cdm/ref/collection/duffy/id/175,,,,,,,,,,,,,,,,,,,,,,,,,,,,,,,,,,,,,,,,,,,,,,,,"<a href=""http://digital.lib.uiowa.edu/cdm/ref/collection/duffy/id/175"" target=""_blank"">View this item in its source respository</a>",,,,,,,,,,,,,,,,,,,,,,,,,,,,,http://www.iowaheritage.org/files/original/899bf40fda4541a585720fe9e8d43538.jpg,"Remote Item","Editorial Cartoons of Brian Duffy",1,0
64248,http://www.iowaheritage.org/items/show/64248,"Green Acres Sod Farm","Farming|Des Moines (Iowa)|Farmers|2000-2010|Farmers|Farms|Public works|Sustainable buildings|Farms|Signs|Men|Reading|Grass","The Des Moines Library cancelled their order for the grass roof; Maybe we can sell it to the Iowa Events Center. I hear they're looking for some cheap grass","Duffy, Brian, 1955-",,"University of Iowa. Libraries. Special Collections Dept.",2003-03-12|2011-04,,"Educational use only, no other permissions given. Copyright to this digital object is owned by The Des Moines Register; it may not be downloaded, reproduced, or distributed without written permission. For more information, contact the Special Collections Department.","Editorial Cartoons of Brian Duffy; Des Moines Register Cartoonists|Papers of Brian Duffy|Des Moines Register",,English,"Still image|Editorial cartoons",MSC916|duffy-030312|http://digital.lib.uiowa.edu/cdm/ref/collection/duffy/id/86,,,,,,,,,,,,,,,,,,,,,,,,,,,,,,,,,,,,,,,,,,,,,,,,"<a href=""http://digital.lib.uiowa.edu/cdm/ref/collection/duffy/id/86"" target=""_blank"">View this item in its source respository</a>",,,,,,,,,,,,,,,,,,,,,,,,,,,,,http://www.iowaheritage.org/files/original/2f20428c91a0bfc020cd0ec9fc2ede53.jpg,"Remote Item","Editorial Cartoons of Brian Duffy",1,0
64216,http://www.iowaheritage.org/items/show/64216,"Iowa tourism brochure","Farms|Iowa|Leaflets|2000-2010|Farming|Hogs|Factory farms|Pollution|Confinement farms|Farmers|Farms|Corn|Barns|Windmills|Pigs|Odors","Hog lots; Scratch and sniff","Duffy, Brian, 1955-",,"University of Iowa. Libraries. Special Collections Dept.",2001-11-13|2011-04,,"Educational use only, no other permissions given. Copyright to this digital object is owned by The Des Moines Register; it may not be downloaded, reproduced, or distributed without written permission. For more information, contact the Special Collections Department.","Editorial Cartoons of Brian Duffy; Des Moines Register Cartoonists|Papers of Brian Duffy|Des Moines Register",,English,"Still image|Editorial cartoons",MSC916|duffy-011113|http://digital.lib.uiowa.edu/cdm/ref/collection/duffy/id/54,,,,,,,,,,,,,,,,,,,,,,,,,,,,,,,,,,,,,,,,,,,,,,,,"<a href=""http://digital.lib.uiowa.edu/cdm/ref/collection/duffy/id/54"" target=""_blank"">View this item in its source respository</a>",,,,,,,,,,,,,,,,,,,,,,,,,,,,,http://www.iowaheritage.org/files/original/f14f7584886ca1facf2f6d97dc4ad0cb.jpg,"Remote Item","Editorial Cartoons of Brian Duffy",1,0
17518,http://www.iowaheritage.org/items/show/17518,"Secretary of Agriculture Henry Wallace in radio farm discussion with Lyman Bryson and Gen. Hugh S. Johnson (left to right), Washington, D.C., October 30, 1938","Cabinet officers|Wallace, Henry A. (Henry Agard), 1888-1965|United States -- Washington, D.C.|1930-1940|Farming|Radio broadcasting|Generals|College administrators|Bryson, Lyman|Johnson Hugh S.",,unidentified,,"University of Iowa. Libraries. Special Collections Dept.",1938-10-31|2010-02-01,,"Educational use only, no other permissions given. U.S. and international copyright laws may protect this item. Commercial use or distribution of this digital object is not permitted without written permission of the University of Iowa Special Collections Dept.","Henry A. Wallace Collection|Henry Agard Wallace papers|http://lib.uiowa.edu/collguides/?MSC0177|Photographs & images|Press Photographs - 7 x 9s|Scanned with Ricoh 3228C scanner at 300 ppi. Archival tiff available.",jpeg,,"Still image|Photographs",MSC0177|7|10|wal-033.jpg|https://digital.lib.uiowa.edu/,,,,,,,,,,,,,,,,,,,,,,,,,,,,,,,,,,,,,,,,,,,,,,,,"<a href=""https://digital.lib.uiowa.edu/"" target=""_blank"">View this item in its source respository</a>",,,,,,,,,,,,,,,,,,,,,,,,,,,,,http://www.iowaheritage.org/files/original/dedaf65560ced2866709055ea94953e5.jpg,"Remote Item","Henry A. Wallace Collection",1,0
17190,http://www.iowaheritage.org/items/show/17190,"Farm machinery, Lacombe, South Central Alberta, Canada, 1944","Farming|Canada -- Alberta -- Lacombe|1940-1950|Agricultural machinery & implements","""This machine was cutting willow growth near Lacombe.""",unidentified,,"University of Iowa. Libraries. Special Collections Dept.",1944|2009-02-16,,"Educational use only, no other permissions given. U.S. and international copyright laws may protect this item. Commercial use or distribution of this digital object is not permitted without written permission of the University of Iowa Special Collections Dept.","Henry A. Wallace Collection|Henry Agard Wallace papers|http://lib.uiowa.edu/collguides/?MSC0177|Photographs & images|China-Siberia Trip, 1944|Scanned with Ricoh 3228C scanner at 600 ppi. Archival tiff available.",jpeg,,"Still image|Photographs",MSC0177|7|wal73sa-064.jpg|https://digital.lib.uiowa.edu/,,,,,,,,,,,,,,,,,,,,,,,,,,,,,,,,,,,,,,,,,,,,,,,,"<a href=""https://digital.lib.uiowa.edu/"" target=""_blank"">View this item in its source respository</a>",,,,,,,,,,,,,,,,,,,,,,,,,,,,,http://www.iowaheritage.org/files/original/4632b14c70deea4492f50fe0b8f5478f.jpg,"Remote Item","Henry A. Wallace Collection",1,0
17125,http://www.iowaheritage.org/items/show/17125,"Henry Wallace in agricultural settings, Alberta, Canada, 1944","Rhubarb|Americans|Wallace, Henry A. (Henry Agard), 1888-1965|Beaver Lodge Experiment Station|Canada -- Alberta -- Grande Prairie|1940-1950|Farming|Vice presidents|Government officials|Canadians|Canada -- Alberta -- Peace River",,unidentified,,"University of Iowa. Libraries. Special Collections Dept.",1944|2009-02-20,,"Educational use only, no other permissions given. U.S. and international copyright laws may protect this item. Commercial use or distribution of this digital object is not permitted without written permission of the University of Iowa Special Collections Dept.","Henry A. Wallace Collection|Henry Agard Wallace papers|http://lib.uiowa.edu/collguides/?MSC0177|Photographs & images|China-Siberia Trip, 1944|Scanned with Ricoh 3228C scanner at 600 ppi. Archival tiff available.",jpeg,,"Still image; Text|Photographs",MSC0177|7|wal73sa-059.jpg|https://digital.lib.uiowa.edu/,,,,,,,,,,,,,,,,,,,,,,,,,,,,,,,,,,,,,,,,,,,,,,,,"<a href=""https://digital.lib.uiowa.edu/"" target=""_blank"">View this item in its source respository</a>",,,,,,,,,,,,,,,,,,,,,,,,,,,,,http://www.iowaheritage.org/files/original/ef1e16ba26c04bb5c96ca6e2e626c561.jpg,"Remote Item","Henry A. Wallace Collection",1,0
16904,http://www.iowaheritage.org/items/show/16904,"Farmer with water buffalo in rice paddy, China, 1944","Farming|Chinese|China|1940-1950|Rice paddies|Farmers|Water buffaloes",,unidentified,,"University of Iowa. Libraries. Special Collections Dept.",1944|2004-08-27,,"Educational use only, no other permissions given. U.S. and international copyright laws may protect this item. Commercial use or distribution of this digital object is not permitted without written permission of the University of Iowa Special Collections Dept.","Henry A. Wallace Collection|Henry Agard Wallace papers|http://lib.uiowa.edu/collguides/?MSC0177|Photographs & images|Scanned with Ricoh 3228C scanner at 600 ppi. Archival tiff available.",jpeg,,"Still image|Photographs",MSC0177|1|wal73cd-18.jpg|https://digital.lib.uiowa.edu/,,,,,,,,,,,,,,,,,,,,,,,,,,,,,,,,,,,,,,,,,,,,,,,,"<a href=""https://digital.lib.uiowa.edu/"" target=""_blank"">View this item in its source respository</a>",,,,,,,,,,,,,,,,,,,,,,,,,,,,,http://www.iowaheritage.org/files/original/b3d8d04e137fbe1a887675dddb7097d3.jpg,"Remote Item","Henry A. Wallace Collection",1,0
