 




﻿"Item Id","Item URI","Dublin Core:Title","Dublin Core:Subject","Dublin Core:Description","Dublin Core:Creator","Dublin Core:Source","Dublin Core:Publisher","Dublin Core:Date","Dublin Core:Contributor","Dublin Core:Rights","Dublin Core:Relation","Dublin Core:Format","Dublin Core:Language","Dublin Core:Type","Dublin Core:Identifier","Dublin Core:Coverage","Item Type Metadata:Text","Item Type Metadata:Interviewer","Item Type Metadata:Interviewee","Item Type Metadata:Location","Item Type Metadata:Transcription","Item Type Metadata:Local URL","Item Type Metadata:Original Format","Item Type Metadata:Physical Dimensions","Item Type Metadata:Duration","Item Type Metadata:Compression","Item Type Metadata:Producer","Item Type Metadata:Director","Item Type Metadata:Bit Rate/Frequency","Item Type Metadata:Time Summary","Item Type Metadata:Email Body","Item Type Metadata:Subject Line","Item Type Metadata:From","Item Type Metadata:To","Item Type Metadata:CC","Item Type Metadata:BCC","Item Type Metadata:Number of Attachments","Item Type Metadata:Standards","Item Type Metadata:Objectives","Item Type Metadata:Materials","Item Type Metadata:Lesson Plan Text","Item Type Metadata:URL","Item Type Metadata:Event Type","Item Type Metadata:Participants","Item Type Metadata:Birth Date","Item Type Metadata:Birthplace","Item Type Metadata:Death Date","Item Type Metadata:Occupation","Item Type Metadata:Biographical Text","Item Type Metadata:Bibliography","Item Type Metadata:Digital Reproduction Information","Item Type Metadata:Repository","Item Type Metadata:Repository Collection","Item Type Metadata:Contact information.","Item Type Metadata:File Name","Item Type Metadata:Notes","Item Type Metadata:Digital item created","Item Type Metadata:Digital item modified","Item Type Metadata:Executive Orders","Item Type Metadata:Record Created","Item Type Metadata:Record Modified","Item Type Metadata:Transcription2","Item Type Metadata:Source URL","Omeka Legacy File:Additional Creator","Omeka Legacy File:Transcriber","Omeka Legacy File:Producer","Omeka Legacy File:Render Device","Omeka Legacy File:Render Details","Omeka Legacy File:Capture Date","Omeka Legacy File:Capture Device","Omeka Legacy File:Capture Details","Omeka Legacy File:Change History","Omeka Legacy File:Watermark","Omeka Legacy File:Encryption","Omeka Legacy File:Compression","Omeka Legacy File:Post Processing","Omeka Image File:Width","Omeka Image File:Height","Omeka Image File:Bit Depth","Omeka Image File:Channels","Omeka Image File:Exif String","Omeka Image File:Exif Array","Omeka Image File:IPTC String","Omeka Image File:IPTC Array","Omeka Video File:Bitrate","Omeka Video File:Duration","Omeka Video File:Sample Rate","Omeka Video File:Codec","Omeka Video File:Width","Omeka Video File:Height",tags,file,itemType,collection,public,featured
21198,https://www.iowaheritage.org/items/show/21198,"Guards German prisoners|Arrow (Rolfe, Iowa)|Prisoner of war camps","World War, 1939-1945 -- Prisoners and prisons, American|United States -- Iowa -- Page County -- Clarinda|World War II|Prisoners of war -- Germany|Camp Clarinda (Clarinda, Iowa)",,,,"State Historical Society of Iowa, Iowa City","1944-10-26|1941;  1942;  1943;  1944;  1945;  1946;  1947;  1948;  1949;  1950|2006-02-23",,"This digital image may be used for educational purposes, as long as it is not altered in any way. No commercial reproduction or distribution of this file is permitted without written permission of the State Historical Society of Iowa.","World War II Iowa Press Clippings","image/jpeg; Display image:  193,463 bytes|1 clipping : b&w ; 5 x 6 cm.",eng,"Text; Clippings",1944-10-26-07.jpg|173848404|https://digital.lib.uiowa.edu/,,,,,,,,,,,,,,,,,,,,,,,,,,,,,,,,,,,,,,,,,,,,,,,,"<a href=""https://digital.lib.uiowa.edu/"" target=""_blank"">View this item in its source respository</a>",,,,,,,,,,,,,,,,,,,,,,,,,,,,,https://www.iowaheritage.org/files/original/602d9353430c7ca37640540c5e0a70eb.jpg,"Remote Item","World War II Iowa Press Clippings",1,0
21196,https://www.iowaheritage.org/items/show/21196,"PW camp plans making toys for enlisted men's kids|Herald Journal (Clarinda, Iowa)|Prisoner of war camps","World War, 1939-1945 -- Prisoners and prisons, American|United States -- Iowa -- Page County -- Clarinda|World War II|Camp Clarinda (Clarinda, Iowa)",,,,"State Historical Society of Iowa, Iowa City","1944-10-26|1941;  1942;  1943;  1944;  1945;  1946;  1947;  1948;  1949;  1950|2006-02-23",,"This digital image may be used for educational purposes, as long as it is not altered in any way. No commercial reproduction or distribution of this file is permitted without written permission of the State Historical Society of Iowa.","World War II Iowa Press Clippings","image/jpeg; Display image:  218,496 bytes|1 clipping : b&w ; 6 x 5 cm.",eng,"Text; Clippings",1944-10-26-06.jpg|173848404|https://digital.lib.uiowa.edu/,,,,,,,,,,,,,,,,,,,,,,,,,,,,,,,,,,,,,,,,,,,,,,,,"<a href=""https://digital.lib.uiowa.edu/"" target=""_blank"">View this item in its source respository</a>",,,,,,,,,,,,,,,,,,,,,,,,,,,,,https://www.iowaheritage.org/files/original/5b9b04d3295d47559f44e4af79f94513.jpg,"Remote Item","World War II Iowa Press Clippings",1,0
21194,https://www.iowaheritage.org/items/show/21194,"Now it's Lieutenant-Colonel George Ball|Herald Journal (Clarinda, Iowa)|Prisoner of war camps","World War, 1939-1945 -- Prisoners and prisons, American|United States -- Iowa -- Page County -- Clarinda|World War II|Camp Clarinda (Clarinda, Iowa)","Image of the commander of a prisoner of war camp having insignia pinned to his shoulder accompanies article.",,,"State Historical Society of Iowa, Iowa City","1944-10-26|1941;  1942;  1943;  1944;  1945;  1946;  1947;  1948;  1949;  1950|2006-02-23",,"This digital image may be used for educational purposes, as long as it is not altered in any way. No commercial reproduction or distribution of this file is permitted without written permission of the State Historical Society of Iowa.","World War II Iowa Press Clippings","image/jpeg; Display image:  371,968 bytes|1 clipping : b&w ; 17 x 11 cm.",eng,"Still image; Text; Clippings",1944-10-26-05.jpg|173848404|https://digital.lib.uiowa.edu/,,,,,,,,,,,,,,,,,,,,,,,,,,,,,,,,,,,,,,,,,,,,,,,,"<a href=""https://digital.lib.uiowa.edu/"" target=""_blank"">View this item in its source respository</a>",,,,,,,,,,,,,,,,,,,,,,,,,,,,,https://www.iowaheritage.org/files/original/a7281117e91a8b610d8bd39c9af951bd.jpg,"Remote Item","World War II Iowa Press Clippings",1,0
21192,https://www.iowaheritage.org/items/show/21192,"PW camp site worth $13,500|Independent (Essex, Iowa)|Prisoner of war camps","World War, 1939-1945 -- Prisoners and prisons, American|United States -- Iowa -- Page County -- Clarinda|World War II|Camp Clarinda (Clarinda, Iowa)",,,,"State Historical Society of Iowa, Iowa City","1944-10-26|1941;  1942;  1943;  1944;  1945;  1946;  1947;  1948;  1949;  1950|2006-02-23",,"This digital image may be used for educational purposes, as long as it is not altered in any way. No commercial reproduction or distribution of this file is permitted without written permission of the State Historical Society of Iowa.","World War II Iowa Press Clippings","image/jpeg; Display image:  320,672 bytes|1 clipping : b&w ; 13 x 5 cm.",eng,"Text; Clippings",1944-10-26-04.jpg|173848404|https://digital.lib.uiowa.edu/,,,,,,,,,,,,,,,,,,,,,,,,,,,,,,,,,,,,,,,,,,,,,,,,"<a href=""https://digital.lib.uiowa.edu/"" target=""_blank"">View this item in its source respository</a>",,,,,,,,,,,,,,,,,,,,,,,,,,,,,https://www.iowaheritage.org/files/original/9521dc197d050c810cd90745a2d7991b.jpg,"Remote Item","World War II Iowa Press Clippings",1,0
21190,https://www.iowaheritage.org/items/show/21190,"Tales false that prisoners escape|Lieut-Col Ball declares no PW escapes have occurred|Herald Journal (Clarinda, Iowa)|Prisoner of war camps","World War, 1939-1945 -- Prisoners and prisons, American|United States -- Iowa -- Page County -- Clarinda|World War II|Camp Clarinda (Clarinda, Iowa)",,,,"State Historical Society of Iowa, Iowa City","1944-10-26|1941;  1942;  1943;  1944;  1945;  1946;  1947;  1948;  1949;  1950|2006-02-23",,"This digital image may be used for educational purposes, as long as it is not altered in any way. No commercial reproduction or distribution of this file is permitted without written permission of the State Historical Society of Iowa.","World War II Iowa Press Clippings","image/jpeg; Display image:  325,422 bytes|1 clipping : b&w ; 13 x 6 cm.",eng,"Text; Clippings",1944-10-26-03.jpg|173848404|https://digital.lib.uiowa.edu/,,,,,,,,,,,,,,,,,,,,,,,,,,,,,,,,,,,,,,,,,,,,,,,,"<a href=""https://digital.lib.uiowa.edu/"" target=""_blank"">View this item in its source respository</a>",,,,,,,,,,,,,,,,,,,,,,,,,,,,,https://www.iowaheritage.org/files/original/d9b24a5518fe79a310797d48badad695.jpg,"Remote Item","World War II Iowa Press Clippings",1,0
21188,https://www.iowaheritage.org/items/show/21188,"Approval needed to use prisoners|Evening Tribune (Des Moines, Iowa)|Prisoner of war camps","World War, 1939-1945 -- Prisoners and prisons, American|United States -- Iowa|World War II",,,,"State Historical Society of Iowa, Iowa City","1944-10-26|1941;  1942;  1943;  1944;  1945;  1946;  1947;  1948;  1949;  1950|2006-02-23",,"This digital image may be used for educational purposes, as long as it is not altered in any way. No commercial reproduction or distribution of this file is permitted without written permission of the State Historical Society of Iowa.","World War II Iowa Press Clippings","image/jpeg; Display image:  275,341 bytes|1 clipping : b&w ; 10 x 5 cm.",eng,"Text; Clippings",1944-10-26-02.jpg|173848404|https://digital.lib.uiowa.edu/,,,,,,,,,,,,,,,,,,,,,,,,,,,,,,,,,,,,,,,,,,,,,,,,"<a href=""https://digital.lib.uiowa.edu/"" target=""_blank"">View this item in its source respository</a>",,,,,,,,,,,,,,,,,,,,,,,,,,,,,https://www.iowaheritage.org/files/original/d188ea44c0e29f84c8530900995ce5f6.jpg,"Remote Item","World War II Iowa Press Clippings",1,0
21186,https://www.iowaheritage.org/items/show/21186,"Yanks object to coddling Krauts|Independent (Hawarden, Iowa)|Prisoner of war camps","World War, 1939-1945 -- Prisoners and prisons, American|United States|World War II|Prisoners of war -- Germany|Prisoners of war -- Italy",,,,"State Historical Society of Iowa, Iowa City","1944-10-26|1941;  1942;  1943;  1944;  1945;  1946;  1947;  1948;  1949;  1950|2006-02-23",,"This digital image may be used for educational purposes, as long as it is not altered in any way. No commercial reproduction or distribution of this file is permitted without written permission of the State Historical Society of Iowa.","World War II Iowa Press Clippings","image/jpeg; Display image:  415,672 bytes|1 clipping : b&w ; 24 x 12 cm.",eng,"Text; Clippings",1944-10-26-01.jpg|173848404|https://digital.lib.uiowa.edu/,,,,,,,,,,,,,,,,,,,,,,,,,,,,,,,,,,,,,,,,,,,,,,,,"<a href=""https://digital.lib.uiowa.edu/"" target=""_blank"">View this item in its source respository</a>",,,,,,,,,,,,,,,,,,,,,,,,,,,,,https://www.iowaheritage.org/files/original/c3ffe06f5e4c590ba7b73075bf4cca68.jpg,"Remote Item","World War II Iowa Press Clippings",1,0
21180,https://www.iowaheritage.org/items/show/21180,"Flyers of World War I have visit|Upper Des Moines (Algona, Iowa)|Prisoner of war camps","World War, 1939-1945 -- Prisoners and prisons, American|United States -- Iowa -- Kossuth County -- Algona|World War II|Camp Algona (Algona, Iowa)",,,,"State Historical Society of Iowa, Iowa City","1944-10-25|1941;  1942;  1943;  1944;  1945;  1946;  1947;  1948;  1949;  1950|2006-02-23",,"This digital image may be used for educational purposes, as long as it is not altered in any way. No commercial reproduction or distribution of this file is permitted without written permission of the State Historical Society of Iowa.","World War II Iowa Press Clippings","image/jpeg; Display image:  203,985 bytes|1 clipping : b&w ; 6 x 5 cm.",eng,"Text; Clippings",1944-10-25-01.jpg|173848404|https://digital.lib.uiowa.edu/,,,,,,,,,,,,,,,,,,,,,,,,,,,,,,,,,,,,,,,,,,,,,,,,"<a href=""https://digital.lib.uiowa.edu/"" target=""_blank"">View this item in its source respository</a>",,,,,,,,,,,,,,,,,,,,,,,,,,,,,https://www.iowaheritage.org/files/original/6fbfc70642605710fb27c37499a3a9f0.jpg,"Remote Item","World War II Iowa Press Clippings",1,0
21178,https://www.iowaheritage.org/items/show/21178,"Algona P.W. camp helps farmers' associations|Farm labor shortage may be eased through use of PW workers; camp officials glad to help|Upper Des Moines (Algona, Iowa)|Prisoner of war camps","World War, 1939-1945 -- Prisoners and prisons, American|United States -- Iowa -- Kossuth County -- Algona|World War II|Camp Algona (Algona, Iowa)",,,,"State Historical Society of Iowa, Iowa City","1944-10-24|1941;  1942;  1943;  1944;  1945;  1946;  1947;  1948;  1949;  1950|2006-02-23",,"This digital image may be used for educational purposes, as long as it is not altered in any way. No commercial reproduction or distribution of this file is permitted without written permission of the State Historical Society of Iowa.","World War II Iowa Press Clippings","image/jpeg; Display image:  556,064 bytes|1 clipping : b&w ; 17 x 11 cm.",eng,"Text; Clippings",1944-10-24-02.jpg|173848404|https://digital.lib.uiowa.edu/,,,,,,,,,,,,,,,,,,,,,,,,,,,,,,,,,,,,,,,,,,,,,,,,"<a href=""https://digital.lib.uiowa.edu/"" target=""_blank"">View this item in its source respository</a>",,,,,,,,,,,,,,,,,,,,,,,,,,,,,https://www.iowaheritage.org/files/original/563fc33e3a71ec053cd6f6088cb515a0.jpg,"Remote Item","World War II Iowa Press Clippings",1,0
21176,https://www.iowaheritage.org/items/show/21176,"War prisoner camp not open to the public|Press (Charles City, Iowa)|Prisoner of war camps","World War, 1939-1945 -- Prisoners and prisons, American|United States -- Iowa -- Floyd County -- Charles City|World War II|Camp Charles City (Charles City, Iowa)",,,,"State Historical Society of Iowa, Iowa City","1944-10-24|1941;  1942;  1943;  1944;  1945;  1946;  1947;  1948;  1949;  1950|2006-02-23",,"This digital image may be used for educational purposes, as long as it is not altered in any way. No commercial reproduction or distribution of this file is permitted without written permission of the State Historical Society of Iowa.","World War II Iowa Press Clippings","image/jpeg; Display image:  322,158 bytes|1 clipping : b&w ; 26 x 10 cm.",eng,"Text; Clippings",1944-10-24-01.jpg|173848404|https://digital.lib.uiowa.edu/,,,,,,,,,,,,,,,,,,,,,,,,,,,,,,,,,,,,,,,,,,,,,,,,"<a href=""https://digital.lib.uiowa.edu/"" target=""_blank"">View this item in its source respository</a>",,,,,,,,,,,,,,,,,,,,,,,,,,,,,https://www.iowaheritage.org/files/original/82d7e5f46dac70337f679de6e174a0cd.jpg,"Remote Item","World War II Iowa Press Clippings",1,0
