 




﻿"Item Id","Item URI","Dublin Core:Title","Dublin Core:Subject","Dublin Core:Description","Dublin Core:Creator","Dublin Core:Source","Dublin Core:Publisher","Dublin Core:Date","Dublin Core:Contributor","Dublin Core:Rights","Dublin Core:Relation","Dublin Core:Format","Dublin Core:Language","Dublin Core:Type","Dublin Core:Identifier","Dublin Core:Coverage","Item Type Metadata:Text","Item Type Metadata:Interviewer","Item Type Metadata:Interviewee","Item Type Metadata:Location","Item Type Metadata:Transcription","Item Type Metadata:Local URL","Item Type Metadata:Original Format","Item Type Metadata:Physical Dimensions","Item Type Metadata:Duration","Item Type Metadata:Compression","Item Type Metadata:Producer","Item Type Metadata:Director","Item Type Metadata:Bit Rate/Frequency","Item Type Metadata:Time Summary","Item Type Metadata:Email Body","Item Type Metadata:Subject Line","Item Type Metadata:From","Item Type Metadata:To","Item Type Metadata:CC","Item Type Metadata:BCC","Item Type Metadata:Number of Attachments","Item Type Metadata:Standards","Item Type Metadata:Objectives","Item Type Metadata:Materials","Item Type Metadata:Lesson Plan Text","Item Type Metadata:URL","Item Type Metadata:Event Type","Item Type Metadata:Participants","Item Type Metadata:Birth Date","Item Type Metadata:Birthplace","Item Type Metadata:Death Date","Item Type Metadata:Occupation","Item Type Metadata:Biographical Text","Item Type Metadata:Bibliography","Item Type Metadata:Digital Reproduction Information","Item Type Metadata:Repository","Item Type Metadata:Repository Collection","Item Type Metadata:Contact information.","Item Type Metadata:File Name","Item Type Metadata:Notes","Item Type Metadata:Digital item created","Item Type Metadata:Digital item modified","Item Type Metadata:Executive Orders","Item Type Metadata:Record Created","Item Type Metadata:Record Modified","Item Type Metadata:Transcription2","Item Type Metadata:Source URL","Omeka Legacy File:Additional Creator","Omeka Legacy File:Transcriber","Omeka Legacy File:Producer","Omeka Legacy File:Render Device","Omeka Legacy File:Render Details","Omeka Legacy File:Capture Date","Omeka Legacy File:Capture Device","Omeka Legacy File:Capture Details","Omeka Legacy File:Change History","Omeka Legacy File:Watermark","Omeka Legacy File:Encryption","Omeka Legacy File:Compression","Omeka Legacy File:Post Processing","Omeka Image File:Width","Omeka Image File:Height","Omeka Image File:Bit Depth","Omeka Image File:Channels","Omeka Image File:Exif String","Omeka Image File:Exif Array","Omeka Image File:IPTC String","Omeka Image File:IPTC Array","Omeka Video File:Bitrate","Omeka Video File:Duration","Omeka Video File:Sample Rate","Omeka Video File:Codec","Omeka Video File:Width","Omeka Video File:Height",tags,file,itemType,collection,public,featured
19578,https://www.iowaheritage.org/items/show/19578,"Queenie and her master have extra special reasons for being thankful this season|Herald (Clinton, Iowa)|Dogs","World War, 1939-1945 -- Iowa|United States -- Iowa -- Clinton County -- Clinton|World War II|Dogs -- War use","Image of man in military uniform posing with dog in military uniform accompanies article.",,,"State Historical Society of Iowa, Iowa City","1945-11-22|1941, 1942, 1943, 1944, 1945, 1946, 1947, 1948, 1949, 1950|2005-10-20",,"This digital image may be used for educational purposes, as long as it is not altered in any way. No commercial reproduction or distribution of this file is permitted without written permission of the State Historical Society of Iowa.","World War II Iowa Press Clippings","image/jpeg; Display image: 288,071 bytes|1 clipping : b&w ;  21 x 15  cm.",eng,"Text; Clippings",1945-11-22.jpg|173848404|https://digital.lib.uiowa.edu/,,,,,,,,,,,,,,,,,,,,,,,,,,,,,,,,,,,,,,,,,,,,,,,,"<a href=""https://digital.lib.uiowa.edu/"" target=""_blank"">View this item in its source respository</a>",,,,,,,,,,,,,,,,,,,,,,,,,,,,,https://www.iowaheritage.org/files/original/beebc5784a1fd427083d67cf64f630b9.jpg,"Remote Item","World War II Iowa Press Clippings",1,0
28691,https://www.iowaheritage.org/items/show/28691,"Schick hospital in miniature|Herald (Clinton, Iowa)|Women's military activity","Women|United States. Army. Women's Army Corps|United States. Army. Women's Army Corps|United States -- Iowa -- Clinton County -- Clinton|1940-1950|World War II|World War, 1939-1945 -- Participation, Female|Women soldiers -- Iowa","Image of WACs and Cpl. Edward Klein accommpanies article.",,,"State Historical Society of Iowa, Iowa City",1944-10-09,,"This digital image may be used for educational purposes, as long as it is not altered in any way.  No commercial reproduction or distribution of this file is permitted without written permission of the State Historical Society of Iowa","World War II Iowa press clippings","Jpeg|image/jpeg|1 clipping : b&w ; 18 x 15 cm",eng,"Clippings; Text; Still Image|Text; Still image|Clippings (Information Artifacts)",1944-10-09-01.jpg|https://digital.lib.uiowa.edu/,,,,,,,,,,,,,,,,,,,,,,,,,,,,,,,,,,,,,,,,,,,,,,,,"<a href=""https://digital.lib.uiowa.edu/"" target=""_blank"">View this item in its source respository</a>",,,,,,,,,,,,,,,,,,,,,,,,,,,,,https://www.iowaheritage.org/files/original/3f6f233d117136ae6138b6fa37147053.jpg,"Remote Item","World War II Iowa Press Clippings",1,0
28449,https://www.iowaheritage.org/items/show/28449,"Schick nurses leave for Camp Grant unit|Herald (Clinton, Iowa)|Women's military activity","United States. Army. Women's Army Corps|United States -- Iowa -- Clinton County -- Clinton|World War II|World War, 1939-1945 -- Participation, Female|Women soldiers -- Iowa",,,,"State Historical Society of Iowa, Iowa City",1944-08-21,,"This digital image may be used for educational purposes, as long as it is not altered in any way.  No commercial reproduction or distribution of this file is permitted without written permission of the State Historical Society of Iowa","World War II Iowa Press Clippings","image/jpeg|1 clipping : b&w ; 7 x 5 cm",eng,"Text; Clippings",1944-08-21-01.jpg|https://digital.lib.uiowa.edu/,,,,,,,,,,,,,,,,,,,,,,,,,,,,,,,,,,,,,,,,,,,,,,,,"<a href=""https://digital.lib.uiowa.edu/"" target=""_blank"">View this item in its source respository</a>",,,,,,,,,,,,,,,,,,,,,,,,,,,,,https://www.iowaheritage.org/files/original/0f49eb6a9e5354ce2093236993645c49.jpg,"Remote Item","World War II Iowa Press Clippings",1,0
29057,https://www.iowaheritage.org/items/show/29057,"Seek 200 women medical recruits|Evening Tribune (Des Moines, Iowa)|Women's military activity","Women|World War, 1939-1945|United States. Army. Women's Army Corps|United States -- Iowa -- Clinton County -- Clinton|1940-1950|World War II|Soldiers|World War, 1939-1945 -- Participation, Female|Women soldiers -- Iowa",,,,"State Historical Society of Iowa, Iowa City",1945-02-01,,"This digital image may be used for educational purposes, as long as it is not altered in any way.  No commercial reproduction or distribution of this file is permitted without written permission of the State Historical Society of Iowa","World War II Iowa press clippings","Jpeg|image/jpeg|1 clipping : b&w ; 8 x 5 cm",eng,"Clippings; Text|Text|Clippings (Information Artifacts)",1945-02-01-01.jpg|https://digital.lib.uiowa.edu/,,,,,,,,,,,,,,,,,,,,,,,,,,,,,,,,,,,,,,,,,,,,,,,,"<a href=""https://digital.lib.uiowa.edu/"" target=""_blank"">View this item in its source respository</a>",,,,,,,,,,,,,,,,,,,,,,,,,,,,,https://www.iowaheritage.org/files/original/5be220c46a2967443a0727015b8518b6.jpg,"Remote Item","World War II Iowa Press Clippings",1,0
28388,https://www.iowaheritage.org/items/show/28388,"Seek women for Navy|Herald (Clinton, Iowa)|Women's military activity","United States. Naval Reserve. Women's Reserve|United States -- Iowa -- Clinton County -- Clinton|World War II|World War, 1939-1945 -- Participation, Female|Women soldiers -- Iowa",,,,"State Historical Society of Iowa, Iowa City",1944-08-05,,"This digital image may be used for educational purposes, as long as it is not altered in any way.  No commercial reproduction or distribution of this file is permitted without written permission of the State Historical Society of Iowa","World War II Iowa Press Clippings","image/jpeg|1 clipping : b&w ; 3 x 5 cm",eng,"Text; Clippings",1944-08-05-03.jpg|https://digital.lib.uiowa.edu/,,,,,,,,,,,,,,,,,,,,,,,,,,,,,,,,,,,,,,,,,,,,,,,,"<a href=""https://digital.lib.uiowa.edu/"" target=""_blank"">View this item in its source respository</a>",,,,,,,,,,,,,,,,,,,,,,,,,,,,,https://www.iowaheritage.org/files/original/6b433da8cdae1900ef49c35ac4ad82c1.jpg,"Remote Item","World War II Iowa Press Clippings",1,0
19686,https://www.iowaheritage.org/items/show/19686,"Sino named chairman for friendship train|Herald (Clinton, Iowa)|Friendship train","Reconstruction (1939-1951) –- Iowa|United States -- Iowa -- Clinton County -- Clinton|World War II|Friendship food train|Food relief, American –- Europe","Image of man in suit's headshot accompanies article.",,,"State Historical Society of Iowa, Iowa City","1947-10-31|1941, 1942, 1943, 1944, 1945, 1946, 1947, 1948, 1949, 1950|2009-02-15",,"This digital image may be used for educational purposes, as long as it is not altered in any way. No commercial reproduction or distribution of this file is permitted without written permission of the State Historical Society of Iowa.","World War II Iowa Press Clippings","image/jpeg; Display image: 429,894 bytes|1 clipping : b&w ;  18 x 10  cm.",eng,"Text; Clippings",1947-10-31-2.jpg|173848404|https://digital.lib.uiowa.edu/,,,,,,,,,,,,,,,,,,,,,,,,,,,,,,,,,,,,,,,,,,,,,,,,"<a href=""https://digital.lib.uiowa.edu/"" target=""_blank"">View this item in its source respository</a>",,,,,,,,,,,,,,,,,,,,,,,,,,,,,https://www.iowaheritage.org/files/original/86a36070848339f2d1bc460d7c822bfd.jpg,"Remote Item","World War II Iowa Press Clippings",1,0
29036,https://www.iowaheritage.org/items/show/29036,"To organize WAC platoon to work in Ia. Hospital|Plan is set up following a letter from Geo. C. Marshall to governor blue|Tribune (Indianola, Iowa)|Women's military activity","Women|World War, 1939-1945|United States. Army. Women's Army Corps|United States -- Iowa -- Clinton County -- Clinton|1940-1950|World War II|Soldiers|World War, 1939-1945 -- Participation, Female|Women soldiers -- Iowa",,,,"State Historical Society of Iowa, Iowa City",1945-02-07,,"This digital image may be used for educational purposes, as long as it is not altered in any way.  No commercial reproduction or distribution of this file is permitted without written permission of the State Historical Society of Iowa","World War II Iowa press clippings","Jpeg|image/jpeg|1 clipping : b&w ; 22 x 5 cm",eng,"Clippings; Text|Text|Clippings (Information Artifacts)",1945-02-07-02.jpg|https://digital.lib.uiowa.edu/,,,,,,,,,,,,,,,,,,,,,,,,,,,,,,,,,,,,,,,,,,,,,,,,"<a href=""https://digital.lib.uiowa.edu/"" target=""_blank"">View this item in its source respository</a>",,,,,,,,,,,,,,,,,,,,,,,,,,,,,https://www.iowaheritage.org/files/original/0bb207629aa0510cbc81840c547542b8.jpg,"Remote Item","World War II Iowa Press Clippings",1,0
28090,https://www.iowaheritage.org/items/show/28090,"Transfer Sgt. Ryan to Clinton office|Telegraph-Herald (Dubuque, Iowa)|Women's military activity","United States. Army. Women's Army Corps|United States -- Iowa -- Clinton County -- Clinton|World War II|World War, 1939-1945 -- Participation, Female|Women soldiers -- Iowa",,,,"State Historical Society of Iowa, Iowa City",1944-06-22,,"This digital image may be used for educational purposes, as long as it is not altered in any way.  No commercial reproduction or distribution of this file is permitted without written permission of the State Historical Society of Iowa","World War II Iowa Press Clippings","image/jpeg|1 clipping : b&w ; 5 x 5 cm",eng,"Text; Clippings",1944-06-22-10.jpg|https://digital.lib.uiowa.edu/,,,,,,,,,,,,,,,,,,,,,,,,,,,,,,,,,,,,,,,,,,,,,,,,"<a href=""https://digital.lib.uiowa.edu/"" target=""_blank"">View this item in its source respository</a>",,,,,,,,,,,,,,,,,,,,,,,,,,,,,https://www.iowaheritage.org/files/original/3c90fe1ede932ea0c997261a3c47ebda.jpg,"Remote Item","World War II Iowa Press Clippings",1,0
22625,https://www.iowaheritage.org/items/show/22625,"WAAC officer to be Legion meet speaker|Former newspaperwoman to be on program at district session.|Herald (Clinton, Iowa)|Women's military activity","United States. Army. Women's Army Auxiliary Corps|United States -- Iowa -- Clinton County -- Clinton|World War II|World War, 1939-1945 -- Participation, Female|Women soldiers -- Iowa -- Fort Des Moines",,,,"State Historical Society of Iowa, Iowa City","1942-10-19|1941;  1942;  1943;  1944;  1945;  1946;  1947;  1948;  1949;  1950|2006-07-10",,"This digital image may be used for educational purposes, as long as it is not altered in any way. No commercial reproduction or distribution of this file is permitted without written permission of the State Historical Society of Iowa.","World War II Iowa Press Clippings","image/jpeg|1 clipping : b&w ; 23 x 5 cm.",eng,"Text; Clippings",1942-10-19-02.jpg|173848404|https://digital.lib.uiowa.edu/,,,,,,,,,,,,,,,,,,,,,,,,,,,,,,,,,,,,,,,,,,,,,,,,"<a href=""https://digital.lib.uiowa.edu/"" target=""_blank"">View this item in its source respository</a>",,,,,,,,,,,,,,,,,,,,,,,,,,,,,https://www.iowaheritage.org/files/original/b29bd9867a02a26164db49b97f00a31a.jpg,"Remote Item","World War II Iowa Press Clippings",1,0
25492,https://www.iowaheritage.org/items/show/25492,"WAAC recruiters coming here|Herald (Clinton, Iowa)|Women's military activity","United States. Army. Women's Army Auxiliary Corps|United States -- Iowa -- Clinton County -- Clinton|World War II|World War, 1939-1945 -- Participation, Female|Women soldiers -- Iowa -- Fort Des Moines","Images of Mary A. Donovan and Mary Evelyn Bieze accompany article.",,,"State Historical Society of Iowa, Iowa City","1943-06-02|1941;  1942;  1943;  1944;  1945;  1946;  1947;  1948;  1949;  1950|2007-05-31",,"This digital image may be used for educational purposes, as long as it is not altered in any way. No commercial reproduction or distribution of this file is permitted without written permission of the State Historical Society of Iowa.","World War II Iowa Press Clippings","image/jpeg|1 clipping : b&w ; 12 x 10 cm.",eng,"Text; Clippings; Still Image",1943-06-02-04.jpg|173848404|https://digital.lib.uiowa.edu/,,,,,,,,,,,,,,,,,,,,,,,,,,,,,,,,,,,,,,,,,,,,,,,,"<a href=""https://digital.lib.uiowa.edu/"" target=""_blank"">View this item in its source respository</a>",,,,,,,,,,,,,,,,,,,,,,,,,,,,,https://www.iowaheritage.org/files/original/a3c71abecac853955b201352a9dd6021.jpg,"Remote Item","World War II Iowa Press Clippings",1,0
