 




﻿"Item Id","Item URI","Dublin Core:Title","Dublin Core:Subject","Dublin Core:Description","Dublin Core:Creator","Dublin Core:Source","Dublin Core:Publisher","Dublin Core:Date","Dublin Core:Contributor","Dublin Core:Rights","Dublin Core:Relation","Dublin Core:Format","Dublin Core:Language","Dublin Core:Type","Dublin Core:Identifier","Dublin Core:Coverage","Item Type Metadata:Text","Item Type Metadata:Interviewer","Item Type Metadata:Interviewee","Item Type Metadata:Location","Item Type Metadata:Transcription","Item Type Metadata:Local URL","Item Type Metadata:Original Format","Item Type Metadata:Physical Dimensions","Item Type Metadata:Duration","Item Type Metadata:Compression","Item Type Metadata:Producer","Item Type Metadata:Director","Item Type Metadata:Bit Rate/Frequency","Item Type Metadata:Time Summary","Item Type Metadata:Email Body","Item Type Metadata:Subject Line","Item Type Metadata:From","Item Type Metadata:To","Item Type Metadata:CC","Item Type Metadata:BCC","Item Type Metadata:Number of Attachments","Item Type Metadata:Standards","Item Type Metadata:Objectives","Item Type Metadata:Materials","Item Type Metadata:Lesson Plan Text","Item Type Metadata:URL","Item Type Metadata:Event Type","Item Type Metadata:Participants","Item Type Metadata:Birth Date","Item Type Metadata:Birthplace","Item Type Metadata:Death Date","Item Type Metadata:Occupation","Item Type Metadata:Biographical Text","Item Type Metadata:Bibliography","Item Type Metadata:Digital Reproduction Information","Item Type Metadata:Repository","Item Type Metadata:Repository Collection","Item Type Metadata:Contact information.","Item Type Metadata:File Name","Item Type Metadata:Notes","Item Type Metadata:Digital item created","Item Type Metadata:Digital item modified","Item Type Metadata:Executive Orders","Item Type Metadata:Record Created","Item Type Metadata:Record Modified","Item Type Metadata:Transcription2","Item Type Metadata:Source URL","Omeka Legacy File:Additional Creator","Omeka Legacy File:Transcriber","Omeka Legacy File:Producer","Omeka Legacy File:Render Device","Omeka Legacy File:Render Details","Omeka Legacy File:Capture Date","Omeka Legacy File:Capture Device","Omeka Legacy File:Capture Details","Omeka Legacy File:Change History","Omeka Legacy File:Watermark","Omeka Legacy File:Encryption","Omeka Legacy File:Compression","Omeka Legacy File:Post Processing","Omeka Image File:Width","Omeka Image File:Height","Omeka Image File:Bit Depth","Omeka Image File:Channels","Omeka Image File:Exif String","Omeka Image File:Exif Array","Omeka Image File:IPTC String","Omeka Image File:IPTC Array","Omeka Video File:Bitrate","Omeka Video File:Duration","Omeka Video File:Sample Rate","Omeka Video File:Codec","Omeka Video File:Width","Omeka Video File:Height",tags,file,itemType,collection,public,featured
9114,https://www.iowaheritage.org/items/show/9114,"It's navy day in the U.S.A.","War|Tojo, Hideki, 1884-1948|World War, 1939-1945|Japan|Ships|aggression|retaliation|navy|United States|Pearl Harbor|periscopes|airplanes|bombers.",,"Darling, Jay N. (Jay Norwood), 1876-1962","The Editorial cartoons of J.N. ""Ding"" Darling [electronic resource] : The Cowles Collection, Drake University, 1912-1962",,1943/10/27|1943,,"Copyright is owned by the ""Ding"" Darling Wildlife Society; it is administered on behalf of the Society by The University of Iowa. While use within the classroom is encouraged without specific authorization, publishing this cartoon in any format requires written permission. See policy and permissions procedure at: http://www.lib.uiowa.edu/spec-coll/services/dingdarling_fees.html","Cowles Library, Drake University, 2507 University Ave., Des Moines, IA 50311-4505.",,,,"431027.jpg|http://ddr.lib.drake.edu/u?/ddarling,6044",,,,,,,,,,,,,,,,,,,,,,,,,,,,,,,,,,,,,,,,,,,,,,,,"<a href=""http://ddr.lib.drake.edu/u?/ddarling,6044"" target=""_blank"">View this item in its source respository</a>",,,,,,,,,,,,,,,,,,,,,,,,,,,,,https://www.iowaheritage.org/files/original/bb2205c16c1017c8d72d4dd689ae826d.jpg,"Remote Item","Editorial Cartoons of J.N. ""Ding"" Darling, Drake University",1,0
9257,https://www.iowaheritage.org/items/show/9257,"Home, James.","War|World War, 1939-1945|Soldiers|peace|victory|postwar|veterans|merchant marine|ships|trashcans.",,"Darling, Jay N. (Jay Norwood), 1876-1962","The Editorial cartoons of J.N. ""Ding"" Darling [electronic resource] : The Cowles Collection, Drake University, 1912-1962",,1945/05/18|1945,,"Copyright is owned by the ""Ding"" Darling Wildlife Society; it is administered on behalf of the Society by The University of Iowa. While use within the classroom is encouraged without specific authorization, publishing this cartoon in any format requires written permission. See policy and permissions procedure at: http://www.lib.uiowa.edu/spec-coll/services/dingdarling_fees.html","Cowles Library, Drake University, 2507 University Ave., Des Moines, IA 50311-4505.",,,,"450518.jpg|http://ddr.lib.drake.edu/u?/ddarling,6187",,,,,,,,,,,,,,,,,,,,,,,,,,,,,,,,,,,,,,,,,,,,,,,,"<a href=""http://ddr.lib.drake.edu/u?/ddarling,6187"" target=""_blank"">View this item in its source respository</a>",,,,,,,,,,,,,,,,,,,,,,,,,,,,,https://www.iowaheritage.org/files/original/8461ad2f4322c31d6631b28f5f53e847.jpg,"Remote Item","Editorial Cartoons of J.N. ""Ding"" Darling, Drake University",1,0
9359,https://www.iowaheritage.org/items/show/9359,"Ships that pass in the night.","Government|World War, 1939-1945|United States|Ships|Democracy|capitalism|Communism|Socialism|economics|postwar|Europe|Uncle Sam.",,"Darling, Jay N. (Jay Norwood), 1876-1962","The Editorial cartoons of J.N. ""Ding"" Darling [electronic resource] : The Cowles Collection, Drake University, 1912-1962",,1946/03/24|1946,,"Copyright is owned by the ""Ding"" Darling Wildlife Society; it is administered on behalf of the Society by The University of Iowa. While use within the classroom is encouraged without specific authorization, publishing this cartoon in any format requires written permission. See policy and permissions procedure at: http://www.lib.uiowa.edu/spec-coll/services/dingdarling_fees.html","Cowles Library, Drake University, 2507 University Ave., Des Moines, IA 50311-4505.",,,,"460324.jpg|http://ddr.lib.drake.edu/u?/ddarling,6289",,,,,,,,,,,,,,,,,,,,,,,,,,,,,,,,,,,,,,,,,,,,,,,,"<a href=""http://ddr.lib.drake.edu/u?/ddarling,6289"" target=""_blank"">View this item in its source respository</a>",,,,,,,,,,,,,,,,,,,,,,,,,,,,,https://www.iowaheritage.org/files/original/a0f5178b4c74f1e4aed5609ba5717053.jpg,"Remote Item","Editorial Cartoons of J.N. ""Ding"" Darling, Drake University",1,0
11004,https://www.iowaheritage.org/items/show/11004,"Shelton family papers, 1864-1936","Soldiers|United States -- History -- Civil War, 1861-1865|Shelton, O. C.|United States. Army. Iowa Infantry Regiment, 45th (1864). Company G|United States -- Iowa -- Mount Pleasant|1860-1870|War casualties|Sick persons|Military camps|Military hospitals|Prisoners of war|Military officers|Guards|Courtship|Campaigns & battles|Writing|Reading|Christianity|Slaves|Freedmen|Orphanages|Mental institutions|Teachers|Spies|Women's rights|Assassinations|Kitchens|Cooks|Nursing|Housework|Train travel|Ships|Philanthropy|Andersonville Prison|Atlanta Campaign, 1864|African Americans|African American soldiers|Chickamauga Battlefield (Ga.)|Bookkeepers|Shelton, Mary E.|Shelton, Rhoda Amanda|Wittenmyer, Annie, 1827-1900|Lincoln, Abraham, 1809-1865|United States Christian Commission|United States Sanitary Commission|Burlington hawk-eye|Lucy Bertram (Steamer)|Ladies' Soldiers' Aid Society (Keokuk, Iowa)|Iowa Soldiers' Orphans' Home (Davenport, Iowa)|Iowa Wesleyan College|Mount Pleasant State Hospital (Mount Pleasant, Iowa)|Spanish-American War Veterans|Mississippi Valley Historical Association|United States -- Iowa -- Burlington|United States -- Iowa -- Keokuk|United States -- Iowa -- Des Moines|United States -- Tennessee -- Memphis|United States -- Tennessee -- Nashville|United States -- Tennessee -- Chattanooga|United States -- Washington (D.C.)|United States -- Virginia -- Alexandria|United States -- Delaware -- Wilmington|United States -- Kentucky -- Louisville|United States -- Tennessee -- Lookout Mountain|United States -- Mississippi -- Vicksburg|1930-1940","Diaries of siblings O.C., Mary, and R. Amanda Shelton from the 1860s and a speech written by R. Amanda Shelton in 1911 about her experiences during the Civil War. O.C. Shelton served as an officer in the Iowa Infantry 45th Regiment and died of illness shortly after returning home; his sisters, under the guidance of Annie Wittenmeyer, helped set up ""diet kitchens"" in Union military hospitals in the South and tended to wounded soldiers.","Shelton, O. C.; Shelton Mary E.; Shelton, Rhoda Amanda",,"University of Iowa. Libraries. Special Collections Dept.",1864/1936|2008-10-15,,"Educational use only, no other permissions given. U.S. and international copyright laws may protect this digital image. Commercial use or distribution of the image is not permitted without prior permission of the copyright holder.","Civil War Diaries and Letters; Abraham Lincoln Collection|Shelton Family Papers|http://lib.uiowa.edu/collguides/?MSC0007",,,"Text|Diaries; Speeches; Obituaries; Military passes|jpeg",MSC0007|31858055128080|https://digital.lib.uiowa.edu/,,,,,,,,,,,,,,,,,,,,,,,,,,,,,,,,,,,,,,,,,,,,,,,,"<a href=""https://digital.lib.uiowa.edu/"" target=""_blank"">View this item in its source respository</a>",,,,,,,,,,,,,,,,,,,,,,,,,,,,,https://www.iowaheritage.org/files/original/7f08a69fe8d19719668a920f80ea3df9.jpg,"Remote Item","African American Women in Iowa Collection",1,0
11159,https://www.iowaheritage.org/items/show/11159,"American travel diary of an unknown Englishman, 1864","Travel|United States|1860-1870|Ships|Indigenous peoples|Cities & towns|Commerce|Rivers|Roads|Forests|Canada","Account of an Englishman's voyage across the Atlantic and his travels on land and water throughout eastern Canada and the United States, from New York to Iowa and back.",unknown,,"University of Iowa. Libraries. Special Collections Dept.",1864,,"Educational use only, no other permissions given. U.S. and international copyright laws may protect this digital image. Commercial use or distribution of the image is not permitted without prior permission of the copyright holder.","Civil War Diaries and Letters",,,Text|Diaries|jpeg,"xMs J86|index.cpd|https://digital.lib.uiowa.edu/",,,,,,,,,,,,,,,,,,,,,,,,,,,,,,,,,,,,,,,,,,,,,,,,"<a href=""https://digital.lib.uiowa.edu/"" target=""_blank"">View this item in its source respository</a>",,,,,,,,,,,,,,,,,,,,,,,,,,,,,https://www.iowaheritage.org/files/original/e4a2217e73fe80de850622674b1fd68c.jpg,"Remote Item","African American Women in Iowa Collection",1,0
11162,https://www.iowaheritage.org/items/show/11162,"Clara Barton's letters to Cousin Leander (Len), 1863-1864","War|United States -- History -- Civil War, 1861-1865|Barton, Clara, 1821-1912|United States|1860-1870|Nursing|Nurses|Military hospitals|Military officers|Ships|Death||Quartermasters|Grant, Ulysses S. (Ulysses Simpson), 1822-1885||United States -- South Carolina -- Hilton Head|United States -- Washington (D.C.)","Barton, a nurse, tended to the wounded on the battlefields of the Civil War, eventually being put in charge of hospitals and of locating missing Union soldiers. After the war she became active in women's suffrage and civil rights movements and was instrumental in founding the American Red Cross.","Barton, Clara, 1821-1912",,"University of Iowa. Libraries. Special Collections Dept.",1863/1864,,"Educational use only, no other permissions given. U.S. and international copyright laws may protect this digital image. Commercial use or distribution of the image is not permitted without prior permission of the copyright holder.","Civil War Diaries and Letters|Civil War, 1861-1865|http://www.lib.uiowa.edu/spec-coll/resources/CivilWarResources.html#civilwar",,,Text|Correspondence|jpeg,"MsL B2933le2|index.cpd|https://digital.lib.uiowa.edu/",,,,,,,,,,,,,,,,,,,,,,,,,,,,,,,,,,,,,,,,,,,,,,,,"<a href=""https://digital.lib.uiowa.edu/"" target=""_blank"">View this item in its source respository</a>",,,,,,,,,,,,,,,,,,,,,,,,,,,,,https://www.iowaheritage.org/files/original/cda4894be7b57e751c56aa5107517c4c.jpg,"Remote Item","African American Women in Iowa Collection",1,0
15515,https://www.iowaheritage.org/items/show/15515,"Shelton family papers, 1864-1936","Soldiers|United States -- History -- Civil War, 1861-1865|Shelton, O. C.|United States. Army. Iowa Infantry Regiment, 45th (1864). Company G|United States -- Iowa -- Mount Pleasant|1860-1870|War casualties|Sick persons|Military camps|Military hospitals|Prisoners of war|Military officers|Guards|Courtship|Campaigns & battles|Writing|Reading|Christianity|Slaves|Freedmen|Orphanages|Mental institutions|Teachers|Spies|Women's rights|Assassinations|Kitchens|Cooks|Nursing|Housework|Train travel|Ships|Philanthropy|Andersonville Prison|Atlanta Campaign, 1864|African Americans|African American soldiers|Chickamauga Battlefield (Ga.)|Bookkeepers|Shelton, Mary E.|Shelton, Rhoda Amanda|Wittenmyer, Annie, 1827-1900|Lincoln, Abraham, 1809-1865|United States Christian Commission|United States Sanitary Commission|Burlington hawk-eye|Lucy Bertram (Steamer)|Ladies' Soldiers' Aid Society (Keokuk, Iowa)|Iowa Soldiers' Orphans' Home (Davenport, Iowa)|Iowa Wesleyan College|Mount Pleasant State Hospital (Mount Pleasant, Iowa)|Spanish-American War Veterans|Mississippi Valley Historical Association|United States -- Iowa -- Burlington|United States -- Iowa -- Keokuk|United States -- Iowa -- Des Moines|United States -- Tennessee -- Memphis|United States -- Tennessee -- Nashville|United States -- Tennessee -- Chattanooga|United States -- Washington (D.C.)|United States -- Virginia -- Alexandria|United States -- Delaware -- Wilmington|United States -- Kentucky -- Louisville|United States -- Tennessee -- Lookout Mountain|United States -- Mississippi -- Vicksburg|1930-1940","Diaries of siblings O.C., Mary, and R. Amanda Shelton from the 1860s and a speech written by R. Amanda Shelton in 1911 about her experiences during the Civil War. O.C. Shelton served as an officer in the Iowa Infantry 45th Regiment and died of illness shortly after returning home; his sisters, under the guidance of Annie Wittenmeyer, helped set up ""diet kitchens"" in Union military hospitals in the South and tended to wounded soldiers.","Shelton, O. C.; Shelton Mary E.; Shelton, Rhoda Amanda",,"University of Iowa. Libraries. Special Collections Dept.",1864/1936|2008-10-15,,"Educational use only, no other permissions given. U.S. and international copyright laws may protect this digital image. Commercial use or distribution of the image is not permitted without prior permission of the copyright holder.","Civil War Diaries and Letters; Abraham Lincoln Collection|Shelton Family Papers|http://lib.uiowa.edu/collguides/?MSC0007",,,"Text|Diaries; Speeches; Obituaries; Military passes|jpeg",MSC0007|31858055128080|https://digital.lib.uiowa.edu/,,,,,,,,,,,,,,,,,,,,,,,,,,,,,,,,,,,,,,,,,,,,,,,,"<a href=""https://digital.lib.uiowa.edu/"" target=""_blank"">View this item in its source respository</a>",,,,,,,,,,,,,,,,,,,,,,,,,,,,,https://www.iowaheritage.org/files/original/e566cfd344ba50aac2cd901d3bddcb8a.jpg,"Remote Item","Civil War Diaries and Letters",1,0
15864,https://www.iowaheritage.org/items/show/15864,"American travel diary of an unknown Englishman, 1864","Travel|United States|1860-1870|Ships|Indigenous peoples|Cities & towns|Commerce|Rivers|Roads|Forests|Canada","Account of an Englishman's voyage across the Atlantic and his travels on land and water throughout eastern Canada and the United States, from New York to Iowa and back.",unknown,,"University of Iowa. Libraries. Special Collections Dept.",1864,,"Educational use only, no other permissions given. U.S. and international copyright laws may protect this digital image. Commercial use or distribution of the image is not permitted without prior permission of the copyright holder.","Civil War Diaries and Letters",,,Text|Diaries|jpeg,"xMs J86|index.cpd|https://digital.lib.uiowa.edu/",,,,,,,,,,,,,,,,,,,,,,,,,,,,,,,,,,,,,,,,,,,,,,,,"<a href=""https://digital.lib.uiowa.edu/"" target=""_blank"">View this item in its source respository</a>",,,,,,,,,,,,,,,,,,,,,,,,,,,,,https://www.iowaheritage.org/files/original/23f1c36b967eec465114a5352b68209b.jpg,"Remote Item","Civil War Diaries and Letters",1,0
15873,https://www.iowaheritage.org/items/show/15873,"Clara Barton's letters to Cousin Leander (Len), 1863-1864","War|United States -- History -- Civil War, 1861-1865|Barton, Clara, 1821-1912|United States|1860-1870|Nursing|Nurses|Military hospitals|Military officers|Ships|Death||Quartermasters|Grant, Ulysses S. (Ulysses Simpson), 1822-1885||United States -- South Carolina -- Hilton Head|United States -- Washington (D.C.)","Barton, a nurse, tended to the wounded on the battlefields of the Civil War, eventually being put in charge of hospitals and of locating missing Union soldiers. After the war she became active in women's suffrage and civil rights movements and was instrumental in founding the American Red Cross.","Barton, Clara, 1821-1912",,"University of Iowa. Libraries. Special Collections Dept.",1863/1864,,"Educational use only, no other permissions given. U.S. and international copyright laws may protect this digital image. Commercial use or distribution of the image is not permitted without prior permission of the copyright holder.","Civil War Diaries and Letters|Civil War, 1861-1865|http://www.lib.uiowa.edu/spec-coll/resources/CivilWarResources.html#civilwar",,,Text|Correspondence|jpeg,"MsL B2933le2|index.cpd|https://digital.lib.uiowa.edu/",,,,,,,,,,,,,,,,,,,,,,,,,,,,,,,,,,,,,,,,,,,,,,,,"<a href=""https://digital.lib.uiowa.edu/"" target=""_blank"">View this item in its source respository</a>",,,,,,,,,,,,,,,,,,,,,,,,,,,,,https://www.iowaheritage.org/files/original/bf88c5b57d744d839aa5b6efe0630ef2.jpg,"Remote Item","Civil War Diaries and Letters",1,0
31116,https://www.iowaheritage.org/items/show/31116,"Classroom mural of ships, The University of Iowa, May 19, 1932","Universities & colleges|University of Iowa|United States -- Iowa -- Iowa City|1930-1940|Schools|Classrooms|Murals|Blackboards|Posters|Ships|University of Iowa. College of Education","The University Elementary School,established in 1915, was a laboratory or experimental school directed through the College of Education for the training of principals, superintendents and teachers. Along with the University High School, it was closed in 1972 due to lack of funding.","Kent, Frederick W. (Frederick Wallace), 1894-1984",,"University of Iowa. Libraries. University Archives",1932-05-19|2010-09-12,,"Educational use only, no other permissions given. U.S. and international copyright laws may protect this digital object. Commercial use or distribution of the object is not permitted without prior permission of the copyright holder.","Iowa City Town and Campus Scenes|Frederick W. Kent Collection of Photographs, 1866-2000|http://www.lib.uiowa.edu/collguides/?RG30.0001.01|Prints|Organizations|University Elementary School|University Elementary School|Scanned with Ricoh Aficio 3228C @ 600 ppi. Master image saved in TIFF format",4|7,,"Still image|Photographs|jpeg",RG30.0001.01|index.cpd|https://digital.lib.uiowa.edu/,,,,,,,,,,,,,,,,,,,,,,,,,,,,,,,,,,,,,,,,,,,,,,,,"<a href=""https://digital.lib.uiowa.edu/"" target=""_blank"">View this item in its source respository</a>",,,,,,,,,,,,,,,,,,,,,,,,,,,,,https://www.iowaheritage.org/files/original/97ed0afae35e562eed4bbd017fe1a3ed.jpg,"Remote Item","Iowa City Town and Campus Scenes",1,0
