 




﻿"Item Id","Item URI","Dublin Core:Title","Dublin Core:Subject","Dublin Core:Description","Dublin Core:Creator","Dublin Core:Source","Dublin Core:Publisher","Dublin Core:Date","Dublin Core:Contributor","Dublin Core:Rights","Dublin Core:Relation","Dublin Core:Format","Dublin Core:Language","Dublin Core:Type","Dublin Core:Identifier","Dublin Core:Coverage","Item Type Metadata:Text","Item Type Metadata:Interviewer","Item Type Metadata:Interviewee","Item Type Metadata:Location","Item Type Metadata:Transcription","Item Type Metadata:Local URL","Item Type Metadata:Original Format","Item Type Metadata:Physical Dimensions","Item Type Metadata:Duration","Item Type Metadata:Compression","Item Type Metadata:Producer","Item Type Metadata:Director","Item Type Metadata:Bit Rate/Frequency","Item Type Metadata:Time Summary","Item Type Metadata:Email Body","Item Type Metadata:Subject Line","Item Type Metadata:From","Item Type Metadata:To","Item Type Metadata:CC","Item Type Metadata:BCC","Item Type Metadata:Number of Attachments","Item Type Metadata:Standards","Item Type Metadata:Objectives","Item Type Metadata:Materials","Item Type Metadata:Lesson Plan Text","Item Type Metadata:URL","Item Type Metadata:Event Type","Item Type Metadata:Participants","Item Type Metadata:Birth Date","Item Type Metadata:Birthplace","Item Type Metadata:Death Date","Item Type Metadata:Occupation","Item Type Metadata:Biographical Text","Item Type Metadata:Bibliography","Item Type Metadata:Digital Reproduction Information","Item Type Metadata:Repository","Item Type Metadata:Repository Collection","Item Type Metadata:Contact information.","Item Type Metadata:File Name","Item Type Metadata:Notes","Item Type Metadata:Digital item created","Item Type Metadata:Digital item modified","Item Type Metadata:Executive Orders","Item Type Metadata:Record Created","Item Type Metadata:Record Modified","Item Type Metadata:Transcription2","Item Type Metadata:Source URL","Omeka Legacy File:Additional Creator","Omeka Legacy File:Transcriber","Omeka Legacy File:Producer","Omeka Legacy File:Render Device","Omeka Legacy File:Render Details","Omeka Legacy File:Capture Date","Omeka Legacy File:Capture Device","Omeka Legacy File:Capture Details","Omeka Legacy File:Change History","Omeka Legacy File:Watermark","Omeka Legacy File:Encryption","Omeka Legacy File:Compression","Omeka Legacy File:Post Processing","Omeka Image File:Width","Omeka Image File:Height","Omeka Image File:Bit Depth","Omeka Image File:Channels","Omeka Image File:Exif String","Omeka Image File:Exif Array","Omeka Image File:IPTC String","Omeka Image File:IPTC Array","Omeka Video File:Bitrate","Omeka Video File:Duration","Omeka Video File:Sample Rate","Omeka Video File:Codec","Omeka Video File:Width","Omeka Video File:Height",tags,file,itemType,collection,public,featured
15459,https://www.iowaheritage.org/items/show/15459,"Pleistocene Fauna, fossil bones, Pisgah and Missouri Valley, Iowa, late 1890s or early 1900s","Geology|United States -- Iowa -- Harrison County -- Pisgah|190-|Cenozoic -- Pleistocene|Aftonian gravels|Fossils|United States -- Iowa -- Harrison County -- Missouri Valley",,unknown,"Photographs scanned using Epson Expression 1680 scanner at 300 ppi, 8-bit greyscale.","University of Iowa. Dept. of Geoscience. Paleontology Repository|Contact Tiffany Adrain (tiffany-adrain@uiowa.edu) at The University of Iowa Paleontology Repository http://www.uiowa.edu/~geology/paleo",1895/1910|2006-03-02,,"This digital image may be used for educational purposes, as long as it is not altered in any way. No commercial reproduction or distribution of this file is permitted without permission.","Calvin Geological Photographs|This digital collection contains the geology-related images originally digitized for the Dept. of Geosciences' Calvin web exhibit: http://www.uiowa.edu/~calvin/calvin.htm . Calvin's images of Iowa City can be viewed in the Iowa City Town and Campus Scenes Digital Collection: http://digital.lib.uiowa.edu/ictcs",jpeg|5|7,,"Still image|Photographs; Dry collodion negatives",0678|4390|173611416|https://digital.lib.uiowa.edu/,,,,,,,,,,,,,,,,,,,,,,,,,,,,,,,,,,,,,,,,,,,,,,,,"<a href=""https://digital.lib.uiowa.edu/"" target=""_blank"">View this item in its source respository</a>",,,,,,,,,,,,,,,,,,,,,,,,,,,,,https://www.iowaheritage.org/files/original/2e9b1f41d2946078d48898cdb6314426.jpg,"Remote Item","Calvin Geological Photographs",1,0
15460,https://www.iowaheritage.org/items/show/15460,"Pleistocene Fauna, side view of well worn molar, 6th superior, right side, Mastodon mirificus Leidy, from well (well went down through Kansan Drift), Akron, Iowa, late 1890s or early 1900s","Geology|United States -- Iowa -- Plymouth County -- Akron|190-|Cenozoic -- Pleistocene|Aftonian gravels|Fossils|Teeth",,unknown,"Photographs scanned using Epson Expression 1680 scanner at 300 ppi, 8-bit greyscale.","University of Iowa. Dept. of Geoscience. Paleontology Repository|Contact Tiffany Adrain (tiffany-adrain@uiowa.edu) at The University of Iowa Paleontology Repository http://www.uiowa.edu/~geology/paleo",1895/1910|2006-03-02,,"This digital image may be used for educational purposes, as long as it is not altered in any way. No commercial reproduction or distribution of this file is permitted without permission.","Calvin Geological Photographs|This digital collection contains the geology-related images originally digitized for the Dept. of Geosciences' Calvin web exhibit: http://www.uiowa.edu/~calvin/calvin.htm . Calvin's images of Iowa City can be viewed in the Iowa City Town and Campus Scenes Digital Collection: http://digital.lib.uiowa.edu/ictcs",jpeg|5|7,,"Still image|Photographs; Dry collodion negatives",0679|1881|173611416|https://digital.lib.uiowa.edu/,,,,,,,,,,,,,,,,,,,,,,,,,,,,,,,,,,,,,,,,,,,,,,,,"<a href=""https://digital.lib.uiowa.edu/"" target=""_blank"">View this item in its source respository</a>",,,,,,,,,,,,,,,,,,,,,,,,,,,,,https://www.iowaheritage.org/files/original/27979404bf5ee68b5813ef17372772fb.jpg,"Remote Item","Calvin Geological Photographs",1,0
15464,https://www.iowaheritage.org/items/show/15464,"Pleistocene Fauna, Elephas imerator, side view of molar 5 (x 3/7), Peyton Pit, Pisgah, Iowa, late 1890s or early 1900s","Geology|Peyton Pit (Pisgah, Iowa)|United States -- Iowa -- Harrison County -- Pisgah|190-|Cenozoic -- Pleistocene|Aftonian Gravels|Fossils|Teeth",,unknown,"Photographs scanned using Epson Expression 1680 scanner at 300 ppi, 8-bit greyscale.","University of Iowa. Dept. of Geoscience. Paleontology Repository|Contact Tiffany Adrain (tiffany-adrain@uiowa.edu) at The University of Iowa Paleontology Repository http://www.uiowa.edu/~geology/paleo",1895/1910|2006-03-02,,"This digital image may be used for educational purposes, as long as it is not altered in any way. No commercial reproduction or distribution of this file is permitted without permission.","Calvin Geological Photographs|This digital collection contains the geology-related images originally digitized for the Dept. of Geosciences' Calvin web exhibit: http://www.uiowa.edu/~calvin/calvin.htm . Calvin's images of Iowa City can be viewed in the Iowa City Town and Campus Scenes Digital Collection: http://digital.lib.uiowa.edu/ictcs",jpeg|5|7,,"Still image|Photographs; Dry collodion negatives",0683|3337|173611416|https://digital.lib.uiowa.edu/,,,,,,,,,,,,,,,,,,,,,,,,,,,,,,,,,,,,,,,,,,,,,,,,"<a href=""https://digital.lib.uiowa.edu/"" target=""_blank"">View this item in its source respository</a>",,,,,,,,,,,,,,,,,,,,,,,,,,,,,https://www.iowaheritage.org/files/original/84a94417652c64f3dca43206b2e5840b.jpg,"Remote Item","Calvin Geological Photographs",1,0
15465,https://www.iowaheritage.org/items/show/15465,"Pleistocene Fauna, fossil bones from southwestern Iowa, late 1890s or early 1900s","Geology|United States -- Iowa -- Harrison County -- Pisgah|190-|Cenozoic -- Pleistocene|Aftonian Gravels|Fossils","Found at Pisgah and other localities in southwestern Iowa.",unknown,"Photographs scanned using Epson Expression 1680 scanner at 300 ppi, 8-bit greyscale.","University of Iowa. Dept. of Geoscience. Paleontology Repository|Contact Tiffany Adrain (tiffany-adrain@uiowa.edu) at The University of Iowa Paleontology Repository http://www.uiowa.edu/~geology/paleo",1895/1910|2006-03-02,,"This digital image may be used for educational purposes, as long as it is not altered in any way. No commercial reproduction or distribution of this file is permitted without permission.","Calvin Geological Photographs|This digital collection contains the geology-related images originally digitized for the Dept. of Geosciences' Calvin web exhibit: http://www.uiowa.edu/~calvin/calvin.htm . Calvin's images of Iowa City can be viewed in the Iowa City Town and Campus Scenes Digital Collection: http://digital.lib.uiowa.edu/ictcs",jpeg|5|7,,"Still image|Photographs; Dry collodion negatives",0684|1889|173611416|https://digital.lib.uiowa.edu/,,,,,,,,,,,,,,,,,,,,,,,,,,,,,,,,,,,,,,,,,,,,,,,,"<a href=""https://digital.lib.uiowa.edu/"" target=""_blank"">View this item in its source respository</a>",,,,,,,,,,,,,,,,,,,,,,,,,,,,,https://www.iowaheritage.org/files/original/86d75d98b5e183dcaea4f7f1e228d8fe.jpg,"Remote Item","Calvin Geological Photographs",1,0
15467,https://www.iowaheritage.org/items/show/15467,"Pleistocene Fauna, Elephas imperator, grinding surface of molar found in Peyton Pit, Pisgah, Iowa, late 1890s or early 1900s","Geology|Peyton Pit (Pisgah, Iowa)|United States -- Iowa -- Harrison County -- Pisgah|190-|Cenozoic -- Pleistocene|Aftonian gravels|Fossils|Teeth",,unknown,"Photographs scanned using Epson Expression 1680 scanner at 300 ppi, 8-bit greyscale.","University of Iowa. Dept. of Geoscience. Paleontology Repository|Contact Tiffany Adrain (tiffany-adrain@uiowa.edu) at The University of Iowa Paleontology Repository http://www.uiowa.edu/~geology/paleo",1895/1910|2006-03-02,,"This digital image may be used for educational purposes, as long as it is not altered in any way. No commercial reproduction or distribution of this file is permitted without permission.","Calvin Geological Photographs|This digital collection contains the geology-related images originally digitized for the Dept. of Geosciences' Calvin web exhibit: http://www.uiowa.edu/~calvin/calvin.htm . Calvin's images of Iowa City can be viewed in the Iowa City Town and Campus Scenes Digital Collection: http://digital.lib.uiowa.edu/ictcs",jpeg|5|7,,"Still image|Photographs",0686|173611416|https://digital.lib.uiowa.edu/,,,,,,,,,,,,,,,,,,,,,,,,,,,,,,,,,,,,,,,,,,,,,,,,"<a href=""https://digital.lib.uiowa.edu/"" target=""_blank"">View this item in its source respository</a>",,,,,,,,,,,,,,,,,,,,,,,,,,,,,https://www.iowaheritage.org/files/original/290c6e079f41d5ffaa1f4f9aac63ca4c.jpg,"Remote Item","Calvin Geological Photographs",1,0
15468,https://www.iowaheritage.org/items/show/15468,"Pleistocene Fauna, molars of Elephas, 1) Elephas primigenius (Denison, Iowa)  2) Elephas columbi (West Union, Iowa), late 1890s or early 1900s","Geology|United States -- Iowa -- Crawford County -- Denison|190-|Cenozoic -- Pleistocene|Aftonian gravels|Fossils|United States -- Iowa -- Fayette County -- West Union",,unknown,"Photographs scanned using Epson Expression 1680 scanner at 300 ppi, 8-bit greyscale.","University of Iowa. Dept. of Geoscience. Paleontology Repository|Contact Tiffany Adrain (tiffany-adrain@uiowa.edu) at The University of Iowa Paleontology Repository http://www.uiowa.edu/~geology/paleo",1895/1910|2006-03-02,,"This digital image may be used for educational purposes, as long as it is not altered in any way. No commercial reproduction or distribution of this file is permitted without permission.","Calvin Geological Photographs|This digital collection contains the geology-related images originally digitized for the Dept. of Geosciences' Calvin web exhibit: http://www.uiowa.edu/~calvin/calvin.htm . Calvin's images of Iowa City can be viewed in the Iowa City Town and Campus Scenes Digital Collection: http://digital.lib.uiowa.edu/ictcs",jpeg|5|7,,"Still image|Photographs; Dry collodion negatives",0687|2292|173611416|https://digital.lib.uiowa.edu/,,,,,,,,,,,,,,,,,,,,,,,,,,,,,,,,,,,,,,,,,,,,,,,,"<a href=""https://digital.lib.uiowa.edu/"" target=""_blank"">View this item in its source respository</a>",,,,,,,,,,,,,,,,,,,,,,,,,,,,,https://www.iowaheritage.org/files/original/779b3a50402ed96eae17a6e424a97fe3.jpg,"Remote Item","Calvin Geological Photographs",1,0
15482,https://www.iowaheritage.org/items/show/15482,"Pleistocene Fauna, Mammut americanum Kerr, Mastodon americanus of anthors, 6th molar grinding surface. The crown of this molar is well worn., late 1890s or early 1900s","Geology|190-|Cenozoic -- Pleistocene|Aftonian gravels|Fossils|Teeth",Turin,unknown,"Photographs scanned using Epson Expression 1680 scanner at 300 ppi, 8-bit greyscale.","University of Iowa. Dept. of Geoscience. Paleontology Repository|Contact Tiffany Adrain (tiffany-adrain@uiowa.edu) at The University of Iowa Paleontology Repository http://www.uiowa.edu/~geology/paleo",1895/1910|2006-03-02,,"This digital image may be used for educational purposes, as long as it is not altered in any way. No commercial reproduction or distribution of this file is permitted without permission.","Calvin Geological Photographs|This digital collection contains the geology-related images originally digitized for the Dept. of Geosciences' Calvin web exhibit: http://www.uiowa.edu/~calvin/calvin.htm . Calvin's images of Iowa City can be viewed in the Iowa City Town and Campus Scenes Digital Collection: http://digital.lib.uiowa.edu/ictcs",jpeg|5|7,,"Still image|Photographs; Dry collodion negatives",0694|3233|173611416|https://digital.lib.uiowa.edu/,,,,,,,,,,,,,,,,,,,,,,,,,,,,,,,,,,,,,,,,,,,,,,,,"<a href=""https://digital.lib.uiowa.edu/"" target=""_blank"">View this item in its source respository</a>",,,,,,,,,,,,,,,,,,,,,,,,,,,,,https://www.iowaheritage.org/files/original/70d06ada632c8b503cd5165731257044.jpg,"Remote Item","Calvin Geological Photographs",1,0
15486,https://www.iowaheritage.org/items/show/15486,"Pleistocene Fauna, Cervalces, Denison, Iowa, late 1890s or early 1900s","Geology|United States -- Iowa -- Crawford County -- Denison|190-|Cenozoic -- Pleistocene|Aftonian gravels|Fossils",,unknown,"Photographs scanned using Epson Expression 1680 scanner at 300 ppi, 8-bit greyscale.","University of Iowa. Dept. of Geoscience. Paleontology Repository|Contact Tiffany Adrain (tiffany-adrain@uiowa.edu) at The University of Iowa Paleontology Repository http://www.uiowa.edu/~geology/paleo",1895/1910|2006-03-02,,"This digital image may be used for educational purposes, as long as it is not altered in any way. No commercial reproduction or distribution of this file is permitted without permission.","Calvin Geological Photographs|This digital collection contains the geology-related images originally digitized for the Dept. of Geosciences' Calvin web exhibit: http://www.uiowa.edu/~calvin/calvin.htm . Calvin's images of Iowa City can be viewed in the Iowa City Town and Campus Scenes Digital Collection: http://digital.lib.uiowa.edu/ictcs",jpeg|5|7,,"Still image|Photographs; Dry collodion negatives",0696|2276|173611416|https://digital.lib.uiowa.edu/,,,,,,,,,,,,,,,,,,,,,,,,,,,,,,,,,,,,,,,,,,,,,,,,"<a href=""https://digital.lib.uiowa.edu/"" target=""_blank"">View this item in its source respository</a>",,,,,,,,,,,,,,,,,,,,,,,,,,,,,https://www.iowaheritage.org/files/original/e8af9f0bf48b3dd7660ebb023b6d64f9.jpg,"Remote Item","Calvin Geological Photographs",1,0
15488,https://www.iowaheritage.org/items/show/15488,"Pleistocene Fauna, foot bones (metatarsals and phalanges) of fossil horse, Cox Pit, Missouri Valley, Iowa, late 1890s or early 1900s","Geology|Cox Pit (Missouri Valley, Iowa)|United States -- Iowa -- Harrison County -- Missouri Valley|190-|Cenozoic -- Pleistocene|Aftonian gravels|Fossils",,unknown,"Photographs scanned using Epson Expression 1680 scanner at 300 ppi, 8-bit greyscale.","University of Iowa. Dept. of Geoscience. Paleontology Repository|Contact Tiffany Adrain (tiffany-adrain@uiowa.edu) at The University of Iowa Paleontology Repository http://www.uiowa.edu/~geology/paleo",1895/1910|2006-03-02,,"This digital image may be used for educational purposes, as long as it is not altered in any way. No commercial reproduction or distribution of this file is permitted without permission.","Calvin Geological Photographs|This digital collection contains the geology-related images originally digitized for the Dept. of Geosciences' Calvin web exhibit: http://www.uiowa.edu/~calvin/calvin.htm . Calvin's images of Iowa City can be viewed in the Iowa City Town and Campus Scenes Digital Collection: http://digital.lib.uiowa.edu/ictcs",jpeg|5|7,,"Still image|Photographs",0697|173611416|https://digital.lib.uiowa.edu/,,,,,,,,,,,,,,,,,,,,,,,,,,,,,,,,,,,,,,,,,,,,,,,,"<a href=""https://digital.lib.uiowa.edu/"" target=""_blank"">View this item in its source respository</a>",,,,,,,,,,,,,,,,,,,,,,,,,,,,,https://www.iowaheritage.org/files/original/90ffab66902dd7b80723ee7616ab4354.jpg,"Remote Item","Calvin Geological Photographs",1,0
15490,https://www.iowaheritage.org/items/show/15490,"Pleistocene Fauna, 1) first phalanx of camel, 2-3-4) molars of Equus complicatus Leidy, Iowa, late 1890s or early 1900s","Geology|United States -- Iowa -- Harrison County|190-|Cenozoic -- Pleistocene|Aftonian Gravels|Fossils",,unknown,"Photographs scanned using Epson Expression 1680 scanner at 300 ppi, 8-bit greyscale.","University of Iowa. Dept. of Geoscience. Paleontology Repository|Contact Tiffany Adrain (tiffany-adrain@uiowa.edu) at The University of Iowa Paleontology Repository http://www.uiowa.edu/~geology/paleo",1895/1910|2006-03-02,,"This digital image may be used for educational purposes, as long as it is not altered in any way. No commercial reproduction or distribution of this file is permitted without permission.","Calvin Geological Photographs|This digital collection contains the geology-related images originally digitized for the Dept. of Geosciences' Calvin web exhibit: http://www.uiowa.edu/~calvin/calvin.htm . Calvin's images of Iowa City can be viewed in the Iowa City Town and Campus Scenes Digital Collection: http://digital.lib.uiowa.edu/ictcs",jpeg|5|7,,"Still image|Photographs; Dry collodion negatives",0698|4391|173611416|https://digital.lib.uiowa.edu/,,,,,,,,,,,,,,,,,,,,,,,,,,,,,,,,,,,,,,,,,,,,,,,,"<a href=""https://digital.lib.uiowa.edu/"" target=""_blank"">View this item in its source respository</a>",,,,,,,,,,,,,,,,,,,,,,,,,,,,,https://www.iowaheritage.org/files/original/37c0423dcd9ae438e06ccfb5a9a7c81e.jpg,"Remote Item","Calvin Geological Photographs",1,0
