 




﻿"Item Id","Item URI","Dublin Core:Title","Dublin Core:Subject","Dublin Core:Description","Dublin Core:Creator","Dublin Core:Source","Dublin Core:Publisher","Dublin Core:Date","Dublin Core:Contributor","Dublin Core:Rights","Dublin Core:Relation","Dublin Core:Format","Dublin Core:Language","Dublin Core:Type","Dublin Core:Identifier","Dublin Core:Coverage","Item Type Metadata:Text","Item Type Metadata:Interviewer","Item Type Metadata:Interviewee","Item Type Metadata:Location","Item Type Metadata:Transcription","Item Type Metadata:Local URL","Item Type Metadata:Original Format","Item Type Metadata:Physical Dimensions","Item Type Metadata:Duration","Item Type Metadata:Compression","Item Type Metadata:Producer","Item Type Metadata:Director","Item Type Metadata:Bit Rate/Frequency","Item Type Metadata:Time Summary","Item Type Metadata:Email Body","Item Type Metadata:Subject Line","Item Type Metadata:From","Item Type Metadata:To","Item Type Metadata:CC","Item Type Metadata:BCC","Item Type Metadata:Number of Attachments","Item Type Metadata:Standards","Item Type Metadata:Objectives","Item Type Metadata:Materials","Item Type Metadata:Lesson Plan Text","Item Type Metadata:URL","Item Type Metadata:Event Type","Item Type Metadata:Participants","Item Type Metadata:Birth Date","Item Type Metadata:Birthplace","Item Type Metadata:Death Date","Item Type Metadata:Occupation","Item Type Metadata:Biographical Text","Item Type Metadata:Bibliography","Item Type Metadata:Digital Reproduction Information","Item Type Metadata:Repository","Item Type Metadata:Repository Collection","Item Type Metadata:Contact information.","Item Type Metadata:File Name","Item Type Metadata:Notes","Item Type Metadata:Digital item created","Item Type Metadata:Digital item modified","Item Type Metadata:Executive Orders","Item Type Metadata:Record Created","Item Type Metadata:Record Modified","Item Type Metadata:Transcription2","Item Type Metadata:Source URL","Omeka Legacy File:Additional Creator","Omeka Legacy File:Transcriber","Omeka Legacy File:Producer","Omeka Legacy File:Render Device","Omeka Legacy File:Render Details","Omeka Legacy File:Capture Date","Omeka Legacy File:Capture Device","Omeka Legacy File:Capture Details","Omeka Legacy File:Change History","Omeka Legacy File:Watermark","Omeka Legacy File:Encryption","Omeka Legacy File:Compression","Omeka Legacy File:Post Processing","Omeka Image File:Width","Omeka Image File:Height","Omeka Image File:Bit Depth","Omeka Image File:Channels","Omeka Image File:Exif String","Omeka Image File:Exif Array","Omeka Image File:IPTC String","Omeka Image File:IPTC Array","Omeka Video File:Bitrate","Omeka Video File:Duration","Omeka Video File:Sample Rate","Omeka Video File:Codec","Omeka Video File:Width","Omeka Video File:Height",tags,file,itemType,collection,public,featured
64566,http://www.iowaheritage.org/items/show/64566,"Congress overhauling service","Congress|United States|Gas stations|1980-1990|Politics|Legislation|Farm aid|Farm policy|Farm relief|Farm vote|Gas pumps|Tractors|Men|Telephones|Mechanics","Farm bill; Drink cola; Closed; Don't call us, we'll call you!; We fix  flats!","Duffy, Brian, 1955-",,"University of Iowa. Libraries. Special Collections Dept.",1985-07-26|2011-04,,"Educational use only, no other permissions given. Copyright to this digital object is owned by The Des Moines Register; it may not be downloaded, reproduced, or distributed without written permission. For more information, contact the Special Collections Department.","Editorial Cartoons of Brian Duffy; Des Moines Register Cartoonists|Papers of Brian Duffy|Des Moines Register",,English,"Still image|Editorial cartoons","MSC916|duffy-850726 2|http://digital.lib.uiowa.edu/cdm/ref/collection/duffy/id/404",,,,,,,,,,,,,,,,,,,,,,,,,,,,,,,,,,,,,,,,,,,,,,,,"<a href=""http://digital.lib.uiowa.edu/cdm/ref/collection/duffy/id/404"" target=""_blank"">View this item in its source respository</a>",,,,,,,,,,,,,,,,,,,,,,,,,,,,,http://www.iowaheritage.org/files/original/1170b39157f27fefa8712f84c578d57f.jpg,"Remote Item","Editorial Cartoons of Brian Duffy",1,0
64565,http://www.iowaheritage.org/items/show/64565,"South Africa","Apartheid|South Africa|Men|1980-1990|Economic & political systems|Race relations|Racism|Segregation|Power|Maps|Paintbrushes|Painters|Painting|Paints & varnishes|Pails|Hands",Apartheid,"Duffy, Brian, 1955-",,"University of Iowa. Libraries. Special Collections Dept.",1985-07-30|2011-04,,"Educational use only, no other permissions given. Copyright to this digital object is owned by The Des Moines Register; it may not be downloaded, reproduced, or distributed without written permission. For more information, contact the Special Collections Department.","Editorial Cartoons of Brian Duffy; Des Moines Register Cartoonists|Papers of Brian Duffy|Des Moines Register",,English,"Still image|Editorial cartoons",MSC916|duffy-850730|http://digital.lib.uiowa.edu/cdm/ref/collection/duffy/id/403,,,,,,,,,,,,,,,,,,,,,,,,,,,,,,,,,,,,,,,,,,,,,,,,"<a href=""http://digital.lib.uiowa.edu/cdm/ref/collection/duffy/id/403"" target=""_blank"">View this item in its source respository</a>",,,,,,,,,,,,,,,,,,,,,,,,,,,,,http://www.iowaheritage.org/files/original/99749a146f1320cf2928c51a9c9a0fe9.jpg,"Remote Item","Editorial Cartoons of Brian Duffy",1,0
64564,http://www.iowaheritage.org/items/show/64564,"Get well soon","Presidents|Reagan, Ronald|United States|Hospitals|1980-1990|Budgets -- United States|Economy|Popularity|United States -- Economic conditions|United States -- Monetary policy|Patients|Machines|Medical equipment & supplies|Arrows|Charts|Balloons|Flowers|Greeting cards|Presidents","Reagan, R; Up; Down; Up; Down; Eject; Budget '86","Duffy, Brian, 1955-",,"University of Iowa. Libraries. Special Collections Dept.",1985-07-18|2011-04,,"Educational use only, no other permissions given. Copyright to this digital object is owned by The Des Moines Register; it may not be downloaded, reproduced, or distributed without written permission. For more information, contact the Special Collections Department.","Editorial Cartoons of Brian Duffy; Des Moines Register Cartoonists|Papers of Brian Duffy|Des Moines Register",,English,"Still image|Editorial cartoons",MSC916|duffy-850718|http://digital.lib.uiowa.edu/cdm/ref/collection/duffy/id/402,,,,,,,,,,,,,,,,,,,,,,,,,,,,,,,,,,,,,,,,,,,,,,,,"<a href=""http://digital.lib.uiowa.edu/cdm/ref/collection/duffy/id/402"" target=""_blank"">View this item in its source respository</a>",,,,,,,,,,,,,,,,,,,,,,,,,,,,,http://www.iowaheritage.org/files/original/720d227224e1729699a2116e4254c90a.jpg,"Remote Item","Editorial Cartoons of Brian Duffy",1,0
64563,http://www.iowaheritage.org/items/show/64563,"Corn soybeans graduates","Exports|Iowa|Corn|1980-1990|States|Crops|Emigration|Employment|Job market|Job seekers|Bags|Soybeans|Graduates|Students",,"Duffy, Brian, 1955-",,"University of Iowa. Libraries. Special Collections Dept.",1985-07|2011-04,,"Educational use only, no other permissions given. Copyright to this digital object is owned by The Des Moines Register; it may not be downloaded, reproduced, or distributed without written permission. For more information, contact the Special Collections Department.","Editorial Cartoons of Brian Duffy; Des Moines Register Cartoonists|Papers of Brian Duffy|Des Moines Register",,English,"Still image|Editorial cartoons","MSC916|duffy-8507xx 2|http://digital.lib.uiowa.edu/cdm/ref/collection/duffy/id/401",,,,,,,,,,,,,,,,,,,,,,,,,,,,,,,,,,,,,,,,,,,,,,,,"<a href=""http://digital.lib.uiowa.edu/cdm/ref/collection/duffy/id/401"" target=""_blank"">View this item in its source respository</a>",,,,,,,,,,,,,,,,,,,,,,,,,,,,,http://www.iowaheritage.org/files/original/594ff54d1f47876cb5e04d7c8a944a32.jpg,"Remote Item","Editorial Cartoons of Brian Duffy",1,0
64562,http://www.iowaheritage.org/items/show/64562,"This pocket looks pretty clean to me","Investigations|Presser, Jackie|United States|Men|1980-1990|Congressional investigations|Labor|Labor unions|Unions|Spies|Suits (Clothing)|Pockets|Neckties|Fat people","Same here!; Teamsters; Justice Dept.; Labor Dept.; Presser","Duffy, Brian, 1955-",,"University of Iowa. Libraries. Special Collections Dept.",1985-07-26|2011-04,,"Educational use only, no other permissions given. Copyright to this digital object is owned by The Des Moines Register; it may not be downloaded, reproduced, or distributed without written permission. For more information, contact the Special Collections Department.","Editorial Cartoons of Brian Duffy; Des Moines Register Cartoonists|Papers of Brian Duffy|Des Moines Register",,English,"Still image|Editorial cartoons",MSC916|duffy-850726|http://digital.lib.uiowa.edu/cdm/ref/collection/duffy/id/400,,,,,,,,,,,,,,,,,,,,,,,,,,,,,,,,,,,,,,,,,,,,,,,,"<a href=""http://digital.lib.uiowa.edu/cdm/ref/collection/duffy/id/400"" target=""_blank"">View this item in its source respository</a>",,,,,,,,,,,,,,,,,,,,,,,,,,,,,http://www.iowaheritage.org/files/original/24f53208f029aea44954c76b528a7046.jpg,"Remote Item","Editorial Cartoons of Brian Duffy",1,0
64561,http://www.iowaheritage.org/items/show/64561,"No more Ms. Nice Guy","Women|United States|Opera singers|1980-1990|Women's rights|Women's liberation|Equality|Microphones|Press|Press conferences|Spears|Shields|Warriors","National Organization for Women","Duffy, Brian, 1955-",,"University of Iowa. Libraries. Special Collections Dept.",1985-07-23|2011-04,,"Educational use only, no other permissions given. Copyright to this digital object is owned by The Des Moines Register; it may not be downloaded, reproduced, or distributed without written permission. For more information, contact the Special Collections Department.","Editorial Cartoons of Brian Duffy; Des Moines Register Cartoonists|Papers of Brian Duffy|Des Moines Register",,English,"Still image|Editorial cartoons",MSC916|duffy-850723|http://digital.lib.uiowa.edu/cdm/ref/collection/duffy/id/399,,,,,,,,,,,,,,,,,,,,,,,,,,,,,,,,,,,,,,,,,,,,,,,,"<a href=""http://digital.lib.uiowa.edu/cdm/ref/collection/duffy/id/399"" target=""_blank"">View this item in its source respository</a>",,,,,,,,,,,,,,,,,,,,,,,,,,,,,http://www.iowaheritage.org/files/original/dc1a7848660bdb265fc3e3aab17ee3ac.jpg,"Remote Item","Editorial Cartoons of Brian Duffy",1,0
64560,http://www.iowaheritage.org/items/show/64560,"You're all under arrest","Apartheid|South Africa|Men|1980-1990|Race relations|Segregation|Racism|Race riots|Violence|Crowds|Batons","South Africa","Duffy, Brian, 1955-",,"University of Iowa. Libraries. Special Collections Dept.",1985-07-24|2011-04,,"Educational use only, no other permissions given. Copyright to this digital object is owned by The Des Moines Register; it may not be downloaded, reproduced, or distributed without written permission. For more information, contact the Special Collections Department.","Editorial Cartoons of Brian Duffy; Des Moines Register Cartoonists|Papers of Brian Duffy|Des Moines Register",,English,"Still image|Editorial cartoons",MSC916|duffy-850724|http://digital.lib.uiowa.edu/cdm/ref/collection/duffy/id/398,,,,,,,,,,,,,,,,,,,,,,,,,,,,,,,,,,,,,,,,,,,,,,,,"<a href=""http://digital.lib.uiowa.edu/cdm/ref/collection/duffy/id/398"" target=""_blank"">View this item in its source respository</a>",,,,,,,,,,,,,,,,,,,,,,,,,,,,,http://www.iowaheritage.org/files/original/bfa41f404e486dddffee77a05fe87abc.jpg,"Remote Item","Editorial Cartoons of Brian Duffy",1,0
64559,http://www.iowaheritage.org/items/show/64559,"President Donald Regan","Presidency|Regan, Donald T.|Washington (D.C.)|Offices|1980-1990|Presidents -- United States|Vice presidents|Congress|Power|Popularity|Reagan, Ronald|Bush, George, 1924-|Desks|Candy|Flags|Monuments|Windows|Signs|Men|Senators|Presidents",Bush,"Duffy, Brian, 1955-",,"University of Iowa. Libraries. Special Collections Dept.",1985-07-17|2011-04,,"Educational use only, no other permissions given. Copyright to this digital object is owned by The Des Moines Register; it may not be downloaded, reproduced, or distributed without written permission. For more information, contact the Special Collections Department.","Editorial Cartoons of Brian Duffy; Des Moines Register Cartoonists|Papers of Brian Duffy|Des Moines Register",,English,"Still image|Editorial cartoons",MSC916|duffy-850717|http://digital.lib.uiowa.edu/cdm/ref/collection/duffy/id/397,,,,,,,,,,,,,,,,,,,,,,,,,,,,,,,,,,,,,,,,,,,,,,,,"<a href=""http://digital.lib.uiowa.edu/cdm/ref/collection/duffy/id/397"" target=""_blank"">View this item in its source respository</a>",,,,,,,,,,,,,,,,,,,,,,,,,,,,,http://www.iowaheritage.org/files/original/7fad69ef5478dd7cb0af2f5a79923b5a.jpg,"Remote Item","Editorial Cartoons of Brian Duffy",1,0
64558,http://www.iowaheritage.org/items/show/64558,"I don't want to see you again for another year!","Bicycling|Iowa|RAGBRAI (Bicycle race)|Bicycles|1980-1990|Cycling|Men|Safety equipment|Pennants|Garages|Stars|Cyclists","The feeling is mutual!; RAGBRAI XIII","Duffy, Brian, 1955-",,"University of Iowa. Libraries. Special Collections Dept.",1985-07-28|2011-04,,"Educational use only, no other permissions given. Copyright to this digital object is owned by The Des Moines Register; it may not be downloaded, reproduced, or distributed without written permission. For more information, contact the Special Collections Department.","Editorial Cartoons of Brian Duffy; Des Moines Register Cartoonists|Papers of Brian Duffy|Des Moines Register",,English,"Still image|Editorial cartoons",MSC916|duffy-850728|http://digital.lib.uiowa.edu/cdm/ref/collection/duffy/id/396,,,,,,,,,,,,,,,,,,,,,,,,,,,,,,,,,,,,,,,,,,,,,,,,"<a href=""http://digital.lib.uiowa.edu/cdm/ref/collection/duffy/id/396"" target=""_blank"">View this item in its source respository</a>",,,,,,,,,,,,,,,,,,,,,,,,,,,,,http://www.iowaheritage.org/files/original/e94857f5059e35ad9345bedc85cdbe45.jpg,"Remote Item","Editorial Cartoons of Brian Duffy",1,0
64557,http://www.iowaheritage.org/items/show/64557,"Take that, you trade restricting countries!","Imports|United States|Men|1980-1990|Trade|Trade policy|United States -- Foreign economic relations|Foreign trade|Boomerangs","Protectionists; Import surcharge; Retaliation; That will teach them!","Duffy, Brian, 1955-",,"University of Iowa. Libraries. Special Collections Dept.",1985-07-19|2011-04,,"Educational use only, no other permissions given. Copyright to this digital object is owned by The Des Moines Register; it may not be downloaded, reproduced, or distributed without written permission. For more information, contact the Special Collections Department.","Editorial Cartoons of Brian Duffy; Des Moines Register Cartoonists|Papers of Brian Duffy|Des Moines Register",,English,"Still image|Editorial cartoons",MSC916|duffy-850719|http://digital.lib.uiowa.edu/cdm/ref/collection/duffy/id/395,,,,,,,,,,,,,,,,,,,,,,,,,,,,,,,,,,,,,,,,,,,,,,,,"<a href=""http://digital.lib.uiowa.edu/cdm/ref/collection/duffy/id/395"" target=""_blank"">View this item in its source respository</a>",,,,,,,,,,,,,,,,,,,,,,,,,,,,,http://www.iowaheritage.org/files/original/fdeb3b09057de6df486546deda60bbe0.jpg,"Remote Item","Editorial Cartoons of Brian Duffy",1,0
