 




﻿"Item Id","Item URI","Dublin Core:Title","Dublin Core:Subject","Dublin Core:Description","Dublin Core:Creator","Dublin Core:Source","Dublin Core:Publisher","Dublin Core:Date","Dublin Core:Contributor","Dublin Core:Rights","Dublin Core:Relation","Dublin Core:Format","Dublin Core:Language","Dublin Core:Type","Dublin Core:Identifier","Dublin Core:Coverage","Item Type Metadata:Text","Item Type Metadata:Interviewer","Item Type Metadata:Interviewee","Item Type Metadata:Location","Item Type Metadata:Transcription","Item Type Metadata:Local URL","Item Type Metadata:Original Format","Item Type Metadata:Physical Dimensions","Item Type Metadata:Duration","Item Type Metadata:Compression","Item Type Metadata:Producer","Item Type Metadata:Director","Item Type Metadata:Bit Rate/Frequency","Item Type Metadata:Time Summary","Item Type Metadata:Email Body","Item Type Metadata:Subject Line","Item Type Metadata:From","Item Type Metadata:To","Item Type Metadata:CC","Item Type Metadata:BCC","Item Type Metadata:Number of Attachments","Item Type Metadata:Standards","Item Type Metadata:Objectives","Item Type Metadata:Materials","Item Type Metadata:Lesson Plan Text","Item Type Metadata:URL","Item Type Metadata:Event Type","Item Type Metadata:Participants","Item Type Metadata:Birth Date","Item Type Metadata:Birthplace","Item Type Metadata:Death Date","Item Type Metadata:Occupation","Item Type Metadata:Biographical Text","Item Type Metadata:Bibliography","Item Type Metadata:Digital Reproduction Information","Item Type Metadata:Repository","Item Type Metadata:Repository Collection","Item Type Metadata:Contact information.","Item Type Metadata:File Name","Item Type Metadata:Notes","Item Type Metadata:Digital item created","Item Type Metadata:Digital item modified","Item Type Metadata:Executive Orders","Item Type Metadata:Record Created","Item Type Metadata:Record Modified","Item Type Metadata:Transcription2","Item Type Metadata:Source URL","Omeka Legacy File:Additional Creator","Omeka Legacy File:Transcriber","Omeka Legacy File:Producer","Omeka Legacy File:Render Device","Omeka Legacy File:Render Details","Omeka Legacy File:Capture Date","Omeka Legacy File:Capture Device","Omeka Legacy File:Capture Details","Omeka Legacy File:Change History","Omeka Legacy File:Watermark","Omeka Legacy File:Encryption","Omeka Legacy File:Compression","Omeka Legacy File:Post Processing","Omeka Image File:Width","Omeka Image File:Height","Omeka Image File:Bit Depth","Omeka Image File:Channels","Omeka Image File:Exif String","Omeka Image File:Exif Array","Omeka Image File:IPTC String","Omeka Image File:IPTC Array","Omeka Video File:Bitrate","Omeka Video File:Duration","Omeka Video File:Sample Rate","Omeka Video File:Codec","Omeka Video File:Width","Omeka Video File:Height",tags,file,itemType,collection,public,featured
72607,https://www.iowaheritage.org/items/show/72607,"Milling crowd in State gym after football game, 1952","Iowa State University|Homecoming|football","A large group of spectators are gathered in State gym after the football game.  Various small groups of individuals are talking or engaged in other activities.|Alumni first began returning to Iowa State for an official Homecoming in 1912. Since then, the celebration continues to entertain both young and old Iowa Staters, with traditional events, including tailgate parties, fireworks, lawn displays, """"Yell Like Hell"""" cheering competition, and mass campaniling. Currently, the Student Alumni Association Leadership Council coordinates the efforts of hundreds of students, who volunteer their time to help Story County Habitat for Humanity build a house.","Iowa State University",22-07-G.Homecoming.1651-4-8,"Iowa State University Library Special Collections: http://www.add.lib.iastate.edu/spcl/index.html",1952|2007-09,,"U.S. and international copyright laws protect this digital image. Commercial use or distribution of the image is not permitted without prior permission of the copyright holder. For permission to use the digital image, please contact Iowa State University Library, Special Collections archives@iastate.edu  For reproductions see:  http://www.add.lib.iastate.edu/spcl/services/photfees.html","University Photographs; http://www.add.lib.iastate.edu/spcl/collections/images.html","Photograph| 11.7 x 8.9 cm",,Image|Image,22-07-G.Homecoming.1651-4-8|https://digitalcollections.lib.iastate.edu/,,,,,,,,,,,,,,,,,,,,,,,,,,,,,,,,,,,,,,,,,,,,,,,,"<a href=""https://digitalcollections.lib.iastate.edu/"" target=""_blank"">View this item in its source respository</a>",,,,,,,,,,,,,,,,,,,,,,,,,,,,,https://www.iowaheritage.org/files/original/21957902279b72d0ae9f5e52cb9dd59a.jpg,"Remote Item",,1,0
67671,https://www.iowaheritage.org/items/show/67671,"Nancy Chase, Homecoming Queen, 1968","Iowa State University|Homecoming|Homecoming Queen","Nancy Chase, 1968 Homecoming Queen, is shown in this portrait.|Alumni first began returning to Iowa State for an official Homecoming in 1912. Since then, the celebration continues to entertain both young and old Iowa Staters, with traditional events, including tailgate parties, fireworks, lawn displays, """"Yell Like Hell"""" cheering competition, and mass campaniling. Currently, the Student Alumni Association Leadership Council coordinates the efforts of hundreds of students, who volunteer their time to help Story County Habitat for Humanity build a house.","Perry; Iowa State University",22-07-G.Homecoming.1666-05-04-1,"Iowa State University Library Special Collections: http://www.add.lib.iastate.edu/spcl/index.html",1968|2012-05,,"U.S. and international copyright laws protect this digital image. Commercial use or distribution of the image is not permitted without prior permission of the copyright holder. For permission to use the digital image, please contact Iowa State University Library, Special Collections archives@iastate.edu  For reproductions see:  http://www.add.lib.iastate.edu/spcl/services/photfees.html","University Photographs; http://www.add.lib.iastate.edu/spcl/collections/images.html","Photograph| 5.7 x 9.4 cm",,Image|Image,22-07-G.Homecoming.1666-05-04-1|https://digitalcollections.lib.iastate.edu/,,,,,,,,,,,,,,,,,,,,,,,,,,,,,,,,,,,,,,,,,,,,,,,,"<a href=""https://digitalcollections.lib.iastate.edu/"" target=""_blank"">View this item in its source respository</a>",,,,,,,,,,,,,,,,,,,,,,,,,,,,,https://www.iowaheritage.org/files/original/1a8d73532a6c1832bcea321d4d430f49.jpg,"Remote Item","Iowa State University Library Photograph Collection",1,0
72814,https://www.iowaheritage.org/items/show/72814,"Nancy Chase, Homecoming Queen, 1968","Iowa State University|Homecoming|Homecoming Queen","Nancy Chase, 1968 Homecoming Queen, is shown in this portrait.|Alumni first began returning to Iowa State for an official Homecoming in 1912. Since then, the celebration continues to entertain both young and old Iowa Staters, with traditional events, including tailgate parties, fireworks, lawn displays, """"Yell Like Hell"""" cheering competition, and mass campaniling. Currently, the Student Alumni Association Leadership Council coordinates the efforts of hundreds of students, who volunteer their time to help Story County Habitat for Humanity build a house.","Perry; Iowa State University",22-07-G.Homecoming.1666-05-04-1,"Iowa State University Library Special Collections: http://www.add.lib.iastate.edu/spcl/index.html",1968|2012-05,,"U.S. and international copyright laws protect this digital image. Commercial use or distribution of the image is not permitted without prior permission of the copyright holder. For permission to use the digital image, please contact Iowa State University Library, Special Collections archives@iastate.edu  For reproductions see:  http://www.add.lib.iastate.edu/spcl/services/photfees.html","University Photographs; http://www.add.lib.iastate.edu/spcl/collections/images.html","Photograph| 5.7 x 9.4 cm",,Image|Image,22-07-G.Homecoming.1666-05-04-1|https://digitalcollections.lib.iastate.edu/,,,,,,,,,,,,,,,,,,,,,,,,,,,,,,,,,,,,,,,,,,,,,,,,"<a href=""https://digitalcollections.lib.iastate.edu/"" target=""_blank"">View this item in its source respository</a>",,,,,,,,,,,,,,,,,,,,,,,,,,,,,https://www.iowaheritage.org/files/original/895fa3b7d15d623823435d7eadf96d10.jpg,"Remote Item",,1,0
67672,https://www.iowaheritage.org/items/show/67672,"Nancy Chase, Homecoming Queen, under the campanile,1968","Iowa State University|Homecoming|Homecoming Queen","Nancy Chase, 1968 Homecoming Queen, poses next to a doorway of the campanile.|Alumni first began returning to Iowa State for an official Homecoming in 1912. Since then, the celebration continues to entertain both young and old Iowa Staters, with traditional events, including tailgate parties, fireworks, lawn displays, """"Yell Like Hell"""" cheering competition, and mass campaniling. Currently, the Student Alumni Association Leadership Council coordinates the efforts of hundreds of students, who volunteer their time to help Story County Habitat for Humanity build a house.","Perry; Iowa State University",22-07-G.Homecoming.1666-05-04-7,"Iowa State University Library Special Collections: http://www.add.lib.iastate.edu/spcl/index.html",1968|2012-05,,"U.S. and international copyright laws protect this digital image. Commercial use or distribution of the image is not permitted without prior permission of the copyright holder. For permission to use the digital image, please contact Iowa State University Library, Special Collections archives@iastate.edu  For reproductions see:  http://www.add.lib.iastate.edu/spcl/services/photfees.html","University Photographs; http://www.add.lib.iastate.edu/spcl/collections/images.html","Photograph| 5.7 x 5.8 cm",,Image|Image,22-07-G.Homecoming.1666-05-04-7|https://digitalcollections.lib.iastate.edu/,,,,,,,,,,,,,,,,,,,,,,,,,,,,,,,,,,,,,,,,,,,,,,,,"<a href=""https://digitalcollections.lib.iastate.edu/"" target=""_blank"">View this item in its source respository</a>",,,,,,,,,,,,,,,,,,,,,,,,,,,,,https://www.iowaheritage.org/files/original/5be1e6b2d2a03fc09072cb7ec58d0cb1.jpg,"Remote Item","Iowa State University Library Photograph Collection",1,0
72815,https://www.iowaheritage.org/items/show/72815,"Nancy Chase, Homecoming Queen, under the campanile,1968","Iowa State University|Homecoming|Homecoming Queen","Nancy Chase, 1968 Homecoming Queen, poses next to a doorway of the campanile.|Alumni first began returning to Iowa State for an official Homecoming in 1912. Since then, the celebration continues to entertain both young and old Iowa Staters, with traditional events, including tailgate parties, fireworks, lawn displays, """"Yell Like Hell"""" cheering competition, and mass campaniling. Currently, the Student Alumni Association Leadership Council coordinates the efforts of hundreds of students, who volunteer their time to help Story County Habitat for Humanity build a house.","Perry; Iowa State University",22-07-G.Homecoming.1666-05-04-7,"Iowa State University Library Special Collections: http://www.add.lib.iastate.edu/spcl/index.html",1968|2012-05,,"U.S. and international copyright laws protect this digital image. Commercial use or distribution of the image is not permitted without prior permission of the copyright holder. For permission to use the digital image, please contact Iowa State University Library, Special Collections archives@iastate.edu  For reproductions see:  http://www.add.lib.iastate.edu/spcl/services/photfees.html","University Photographs; http://www.add.lib.iastate.edu/spcl/collections/images.html","Photograph| 5.7 x 5.8 cm",,Image|Image,22-07-G.Homecoming.1666-05-04-7|https://digitalcollections.lib.iastate.edu/,,,,,,,,,,,,,,,,,,,,,,,,,,,,,,,,,,,,,,,,,,,,,,,,"<a href=""https://digitalcollections.lib.iastate.edu/"" target=""_blank"">View this item in its source respository</a>",,,,,,,,,,,,,,,,,,,,,,,,,,,,,https://www.iowaheritage.org/files/original/8bd444ece32d44837fcb134219684eda.jpg,"Remote Item",,1,0
67552,https://www.iowaheritage.org/items/show/67552,"Omega House Lawn display, """"ISC Misery for Missouri"""", Homecoming, 1941","Iowa State University|Homecoming|Lawn display","A lawn display of a bandaged tiger is displayed at the Omega House at Home Coming. A sign below the display reads """"ISC Misery for Missouri.""""|Alumni first began returning to Iowa State for an official Homecoming in 1912. Since then, the celebration continues to entertain both young and old Iowa Staters, with traditional events, including tailgate parties, fireworks, lawn displays, """"Yell Like Hell"""" cheering competition, and mass campaniling. Currently, the Student Alumni Association Leadership Council coordinates the efforts of hundreds of students, who volunteer their time to help Story County Habitat for Humanity build a house.","Iowa State University",22-07-G.Homecoming.1662-1-3,"Iowa State University Library Special Collections: http://www.add.lib.iastate.edu/spcl/index.html",1941|2007-10,,"U.S. and international copyright laws protect this digital image. Commercial use or distribution of the image is not permitted without prior permission of the copyright holder. For permission to use the digital image, please contact Iowa State University Library, Special Collections archives@iastate.edu  For reproductions see:  http://www.add.lib.iastate.edu/spcl/services/photfees.html","University Photographs; http://www.add.lib.iastate.edu/spcl/collections/images.html","Photograph| 21.9 x 18.7 cm",,Image|Image,22-07-G.Homecoming.1662-1-3|https://digitalcollections.lib.iastate.edu/,,,,,,,,,,,,,,,,,,,,,,,,,,,,,,,,,,,,,,,,,,,,,,,,"<a href=""https://digitalcollections.lib.iastate.edu/"" target=""_blank"">View this item in its source respository</a>",,,,,,,,,,,,,,,,,,,,,,,,,,,,,https://www.iowaheritage.org/files/original/cd3ce9e0842b81163759ac6216212d0d.jpg,"Remote Item","Iowa State University Library Photograph Collection",1,0
72695,https://www.iowaheritage.org/items/show/72695,"Omega House Lawn display, """"ISC Misery for Missouri"""", Homecoming, 1941","Iowa State University|Homecoming|Lawn display","A lawn display of a bandaged tiger is displayed at the Omega House at Home Coming. A sign below the display reads """"ISC Misery for Missouri.""""|Alumni first began returning to Iowa State for an official Homecoming in 1912. Since then, the celebration continues to entertain both young and old Iowa Staters, with traditional events, including tailgate parties, fireworks, lawn displays, """"Yell Like Hell"""" cheering competition, and mass campaniling. Currently, the Student Alumni Association Leadership Council coordinates the efforts of hundreds of students, who volunteer their time to help Story County Habitat for Humanity build a house.","Iowa State University",22-07-G.Homecoming.1662-1-3,"Iowa State University Library Special Collections: http://www.add.lib.iastate.edu/spcl/index.html",1941|2007-10,,"U.S. and international copyright laws protect this digital image. Commercial use or distribution of the image is not permitted without prior permission of the copyright holder. For permission to use the digital image, please contact Iowa State University Library, Special Collections archives@iastate.edu  For reproductions see:  http://www.add.lib.iastate.edu/spcl/services/photfees.html","University Photographs; http://www.add.lib.iastate.edu/spcl/collections/images.html","Photograph| 21.9 x 18.7 cm",,Image|Image,22-07-G.Homecoming.1662-1-3|https://digitalcollections.lib.iastate.edu/,,,,,,,,,,,,,,,,,,,,,,,,,,,,,,,,,,,,,,,,,,,,,,,,"<a href=""https://digitalcollections.lib.iastate.edu/"" target=""_blank"">View this item in its source respository</a>",,,,,,,,,,,,,,,,,,,,,,,,,,,,,https://www.iowaheritage.org/files/original/3bf9f5c8722a2d2b398784604b7eadea.jpg,"Remote Item",,1,0
67562,https://www.iowaheritage.org/items/show/67562,"Pajama Relay, Homecoming Pep Rally, 1948","Iowa State University|Homecoming|Pajama Relay|Pep Rally","Students are participating in the pajama relay before the Homecoming Pep Rally, 1948.|Alumni first began returning to Iowa State for an official Homecoming in 1912. Since then, the celebration continues to entertain both young and old Iowa Staters, with traditional events, including tailgate parties, fireworks, lawn displays, """"Yell Like Hell"""" cheering competition, and mass campaniling. Currently, the Student Alumni Association Leadership Council coordinates the efforts of hundreds of students, who volunteer their time to help Story County Habitat for Humanity build a house.","Benn, Iowa State University",22-07-G.Homecoming.1662-2-6,"Iowa State University Library Special Collections: http://www.add.lib.iastate.edu/spcl/index.html",1948|2007-10,,"U.S. and international copyright laws protect this digital image. Commercial use or distribution of the image is not permitted without prior permission of the copyright holder. For permission to use the digital image, please contact Iowa State University Library, Special Collections archives@iastate.edu  For reproductions see:  http://www.add.lib.iastate.edu/spcl/services/photfees.html","University Photographs; http://www.add.lib.iastate.edu/spcl/collections/images.html","Photograph| 11.7 x 8.6 cm",,Image|Image,22-07-G.Homecoming.1662-2-6|https://digitalcollections.lib.iastate.edu/,,,,,,,,,,,,,,,,,,,,,,,,,,,,,,,,,,,,,,,,,,,,,,,,"<a href=""https://digitalcollections.lib.iastate.edu/"" target=""_blank"">View this item in its source respository</a>",,,,,,,,,,,,,,,,,,,,,,,,,,,,,https://www.iowaheritage.org/files/original/951cf91595350078451d6ed737f57008.jpg,"Remote Item","Iowa State University Library Photograph Collection",1,0
72705,https://www.iowaheritage.org/items/show/72705,"Pajama Relay, Homecoming Pep Rally, 1948","Iowa State University|Homecoming|Pajama Relay|Pep Rally","Students are participating in the pajama relay before the Homecoming Pep Rally, 1948.|Alumni first began returning to Iowa State for an official Homecoming in 1912. Since then, the celebration continues to entertain both young and old Iowa Staters, with traditional events, including tailgate parties, fireworks, lawn displays, """"Yell Like Hell"""" cheering competition, and mass campaniling. Currently, the Student Alumni Association Leadership Council coordinates the efforts of hundreds of students, who volunteer their time to help Story County Habitat for Humanity build a house.","Benn, Iowa State University",22-07-G.Homecoming.1662-2-6,"Iowa State University Library Special Collections: http://www.add.lib.iastate.edu/spcl/index.html",1948|2007-10,,"U.S. and international copyright laws protect this digital image. Commercial use or distribution of the image is not permitted without prior permission of the copyright holder. For permission to use the digital image, please contact Iowa State University Library, Special Collections archives@iastate.edu  For reproductions see:  http://www.add.lib.iastate.edu/spcl/services/photfees.html","University Photographs; http://www.add.lib.iastate.edu/spcl/collections/images.html","Photograph| 11.7 x 8.6 cm",,Image|Image,22-07-G.Homecoming.1662-2-6|https://digitalcollections.lib.iastate.edu/,,,,,,,,,,,,,,,,,,,,,,,,,,,,,,,,,,,,,,,,,,,,,,,,"<a href=""https://digitalcollections.lib.iastate.edu/"" target=""_blank"">View this item in its source respository</a>",,,,,,,,,,,,,,,,,,,,,,,,,,,,,https://www.iowaheritage.org/files/original/69f6f8f37614cabedac477e80acdc429.jpg,"Remote Item",,1,0
67482,https://www.iowaheritage.org/items/show/67482,"Pat Nelson, Homecoming  queen, 1953","Iowa State University|Homecoming|Homecoming queen","Pat Nelson appears on a stage shortly after receiving a trophy cup.  She is being kissed on the check by an unidentified male.  Other individuals stand in the background.|Alumni first began returning to Iowa State for an official Homecoming in 1912. Since then, the celebration continues to entertain both young and old Iowa Staters, with traditional events, including tailgate parties, fireworks, lawn displays, """"Yell Like Hell"""" cheering competition, and mass campaniling. Currently, the Student Alumni Association Leadership Council coordinates the efforts of hundreds of students, who volunteer their time to help Story County Habitat for Humanity build a house.","Iowa State University",22-07-G.Homecoming.1651-6-8,"Iowa State University Library Special Collections: http://www.add.lib.iastate.edu/spcl/index.html",1953|2007-09,,"U.S. and international copyright laws protect this digital image. Commercial use or distribution of the image is not permitted without prior permission of the copyright holder. For permission to use the digital image, please contact Iowa State University Library, Special Collections archives@iastate.edu  For reproductions see:  http://www.add.lib.iastate.edu/spcl/services/photfees.html","University Photographs; http://www.add.lib.iastate.edu/spcl/collections/images.html","Photograph| 12.1 x 16.5 cm",,Image|Image,22-07-G.Homecoming.1651-6-8|https://digitalcollections.lib.iastate.edu/,,,,,,,,,,,,,,,,,,,,,,,,,,,,,,,,,,,,,,,,,,,,,,,,"<a href=""https://digitalcollections.lib.iastate.edu/"" target=""_blank"">View this item in its source respository</a>",,,,,,,,,,,,,,,,,,,,,,,,,,,,,https://www.iowaheritage.org/files/original/c537030656dfeabb26ee9bf0c4253d8d.jpg,"Remote Item","Iowa State University Library Photograph Collection",1,0
