 




﻿"Item Id","Item URI","Dublin Core:Title","Dublin Core:Subject","Dublin Core:Description","Dublin Core:Creator","Dublin Core:Source","Dublin Core:Publisher","Dublin Core:Date","Dublin Core:Contributor","Dublin Core:Rights","Dublin Core:Relation","Dublin Core:Format","Dublin Core:Language","Dublin Core:Type","Dublin Core:Identifier","Dublin Core:Coverage","Item Type Metadata:Text","Item Type Metadata:Interviewer","Item Type Metadata:Interviewee","Item Type Metadata:Location","Item Type Metadata:Transcription","Item Type Metadata:Local URL","Item Type Metadata:Original Format","Item Type Metadata:Physical Dimensions","Item Type Metadata:Duration","Item Type Metadata:Compression","Item Type Metadata:Producer","Item Type Metadata:Director","Item Type Metadata:Bit Rate/Frequency","Item Type Metadata:Time Summary","Item Type Metadata:Email Body","Item Type Metadata:Subject Line","Item Type Metadata:From","Item Type Metadata:To","Item Type Metadata:CC","Item Type Metadata:BCC","Item Type Metadata:Number of Attachments","Item Type Metadata:Standards","Item Type Metadata:Objectives","Item Type Metadata:Materials","Item Type Metadata:Lesson Plan Text","Item Type Metadata:URL","Item Type Metadata:Event Type","Item Type Metadata:Participants","Item Type Metadata:Birth Date","Item Type Metadata:Birthplace","Item Type Metadata:Death Date","Item Type Metadata:Occupation","Item Type Metadata:Biographical Text","Item Type Metadata:Bibliography","Item Type Metadata:Digital Reproduction Information","Item Type Metadata:Repository","Item Type Metadata:Repository Collection","Item Type Metadata:Contact information.","Item Type Metadata:File Name","Item Type Metadata:Notes","Item Type Metadata:Digital item created","Item Type Metadata:Digital item modified","Item Type Metadata:Executive Orders","Item Type Metadata:Record Created","Item Type Metadata:Record Modified","Item Type Metadata:Transcription2","Item Type Metadata:Source URL","Omeka Legacy File:Additional Creator","Omeka Legacy File:Transcriber","Omeka Legacy File:Producer","Omeka Legacy File:Render Device","Omeka Legacy File:Render Details","Omeka Legacy File:Capture Date","Omeka Legacy File:Capture Device","Omeka Legacy File:Capture Details","Omeka Legacy File:Change History","Omeka Legacy File:Watermark","Omeka Legacy File:Encryption","Omeka Legacy File:Compression","Omeka Legacy File:Post Processing","Omeka Image File:Width","Omeka Image File:Height","Omeka Image File:Bit Depth","Omeka Image File:Channels","Omeka Image File:Exif String","Omeka Image File:Exif Array","Omeka Image File:IPTC String","Omeka Image File:IPTC Array","Omeka Video File:Bitrate","Omeka Video File:Duration","Omeka Video File:Sample Rate","Omeka Video File:Codec","Omeka Video File:Width","Omeka Video File:Height",tags,file,itemType,collection,public,featured
78516,https://www.iowaheritage.org/items/show/78516,"The Knights Templar Band, 1886-1890; Oskaloosa; Mahaska County; Iowa","Knights Templar Band|19th Century|Music|Oskaloosa|Mahaska County|Iowa","In Oskaloosa, Iowa, music has always been appreciated and taken seriously by its bands.  One of the first bands in Oskaloosa was the Knights Templar Band, formed out of the musical brotherhood that existed within the town.  On weekends and on special days, the Knights Templar Band would play on top of the town square's bandstand before a large audience of families and friends in the community.  Here they are pictured in front of the Oskaloosa bandstand created by C.L. Barnhouse.",,"Historical Archives","Mahaska County Historical Society",1886-1890|2008-08-12,"Mahaska County Historical Society",www.nelsonpioneer.org,,"still image/jpeg",,image,"Mahaska County Historical Society|http://cdm16125.contentdm.oclc.org/u?/p270701coll7,178",,,,,,,,,,,,,,,,,,,,,,,,,,,,,,,,,,,,,,,,,,,,,,,,"<a href=""http://cdm16125.contentdm.oclc.org/u?/p270701coll7,178"" target=""_blank"">View this item in its source respository</a>",,,,,,,,,,,,,,,,,,,,,,,,,,,,,https://www.iowaheritage.org/files/original/0b4fd4b6b008514fd21965a90b86832b.jpg,"Remote Item","Mahaska County Historical Society",1,0
78515,https://www.iowaheritage.org/items/show/78515,"C.L. Barnhouse and the Knights of Pythias Brigade Band, State Encampment in Marshalltown, 1896; Oskaloosa; Mahaska County; Iowa","C.L. Barnhouse|Knights of Pythias|Brigade Band|19th Century|Music|Oskaloosa|Mahaska County|Iowa","C.L. Barnhouse is known for his contributions to the music industry by establishing a successful music publishing company in Oskaloosa, Iowa.  However, Barnhouse was an inspiration to the people of Oskaloosa and Mahaska County for the brigade band he led for several years in the late 19th and early 20th Centuries.  Known as the Knights of Pythias Brigade Band, Barnhouse and the band members were dedicated musicians that played before crowds at the Oskaloosa town square's bandstand and became well known enough to be the main musical focus at the Iowa State Fair on a few occasions and other state events as well.  The photograph here demonstrates this, as the band marches through downtown Marshalltown, Iowa for the state encampment taking place there in 1896.",,"Historical Archives","Mahaska County Historical Society",1896|2008-08-12,"Mahaska County Historical Society",www.nelsonpioneer.org,,"still image/jpeg",,image,"Mahaska County Historical Society|http://cdm16125.contentdm.oclc.org/u?/p270701coll7,177",,,,,,,,,,,,,,,,,,,,,,,,,,,,,,,,,,,,,,,,,,,,,,,,"<a href=""http://cdm16125.contentdm.oclc.org/u?/p270701coll7,177"" target=""_blank"">View this item in its source respository</a>",,,,,,,,,,,,,,,,,,,,,,,,,,,,,https://www.iowaheritage.org/files/original/02e2297c4b650197425013fb663ee788.jpg,"Remote Item","Mahaska County Historical Society",1,0
78514,https://www.iowaheritage.org/items/show/78514,"C.L. Barnhouse and the Municipal Brigade Band, circa 1896; Oskaloosa; Mahaska County; Iowa","C.L. Barnhouse|Municipal|Brigade Band|19th Century|Music|Oskaloosa|Mahaska County|Iowa","C.L. Barnhouse is known for his contributions to the music industry by establishing a successful music publishing company in Oskaloosa, Iowa.  However, Barnhouse was an inspiration to the people of Oskaloosa and Mahaska County for the brigade band he led for several years in the late 19th and early 20th Centuries.  Known as the Knights of Pythias Brigade Band and then the Municipal Brigade Band, Barnhouse and the band members were dedicated musicians that played before crowds at the Oskaloosa town square's bandstand and became well known enough to be the main musical focus at the Iowa State Fair on a few occasions.  The photograph here demonstrates the hard work and dedication put forth by Barnhouse and his Brigade Band, as seen posing during one of their practice sessions here.",,"Historical Archives","Mahaska County Historical Society",1896?|2008-08-12,"Mahaska County Historical Society",www.nelsonpioneer.org,,"still image/jpeg",,image,"Mahaska County Historical Society|http://cdm16125.contentdm.oclc.org/u?/p270701coll7,176",,,,,,,,,,,,,,,,,,,,,,,,,,,,,,,,,,,,,,,,,,,,,,,,"<a href=""http://cdm16125.contentdm.oclc.org/u?/p270701coll7,176"" target=""_blank"">View this item in its source respository</a>",,,,,,,,,,,,,,,,,,,,,,,,,,,,,https://www.iowaheritage.org/files/original/179a58e3998a7d9bf4cfb3a87e1fc4d0.jpg,"Remote Item","Mahaska County Historical Society",1,0
78513,https://www.iowaheritage.org/items/show/78513,"C.L. Barnhouse and the Knights of Pythias Brigade Band Member Key, August 27-September 2, 1892, Iowa State Fair; Oskaloosa; Mahaska County; Iowa","C.L. Barnhouse|Knights of Pythias|Brigade Band|Key|Iowa State Fair|19th Century|Music|Oskaloosa|Mahaska County|Iowa","C.L. Barnhouse is known for his contributions to the music industry by establishing a successful music publishing company in Oskaloosa, Iowa.  However, Barnhouse was an inspiration to the people of Mahaska County for the brigade band he led for several years in the late 19th and eary 20th Centuries.  Known as the Knights of Pythias Brigade Band, Barnhouse and the band members were dedicated musicians that played before crowds at the Oskaloosa town square's bandstand and became well known enough to be the main musicial focus at the Iowa State Fair on a few occasions.  The photograph here demonstrates this, as Barnhouse and the Knights of Pythias Brigade Band come marching through the Iowa State Fair between August 27 and September 2, 1892.",,"Historical Archives","Mahaska County Historical Society",1892-08-27|2008-08-12,"Mahaska County Historical Society",www.nelsonpioneer.org,,"still image/jpeg",,image,"Mahaska County Historical Society|http://cdm16125.contentdm.oclc.org/u?/p270701coll7,175",,,,,,,,,,,,,,,,,,,,,,,,,,,,,,,,,,,,,,,,,,,,,,,,"<a href=""http://cdm16125.contentdm.oclc.org/u?/p270701coll7,175"" target=""_blank"">View this item in its source respository</a>",,,,,,,,,,,,,,,,,,,,,,,,,,,,,https://www.iowaheritage.org/files/original/a0991c5fbc93f0655946f9606d45ed11.jpg,"Remote Item","Mahaska County Historical Society",1,0
78512,https://www.iowaheritage.org/items/show/78512,"C.L. Barnhouse and the Knights of Pythias Brigade Band, August 27-September 2, 1892, Iowa State Fair; Oskaloosa; Mahaska County; Iowa","C.L. Barnhouse|Knights of Pythias|Brigade Band|Iowa State Fair|19th Century|Music|Oskaloosa|Mahaska County|Iowa","C.L. Barnhouse is known for his contributions to the music industry by establishing a successful music publishing company in Oskaloosa, Iowa.  However, Barnhouse was an inspiration to the people of Mahaska County for the brigade band he led for several years in the late 19th and early 20th Centuries.  Known as the Knights of Pythias Brigade Band, Barnhouse and the band members were dedicated musicians that played before crowds at the Oskaloosa town square's bandstand and became well known enough to be the main musical focus at the Iowa State Fair on a few occasions.  The photograph here demonstrates this, as Barnhouse and the Knights of Pythias Brigade Band come marching through the Iowa State Fair between August 27 and September 2, 1892.",,"Historical Archives","Mahaska County Historical Society",1892-08-27|2008-08-12,"Mahaska County Historical Society",www.nelsonpioneer.org,,"still image/jpeg",,image,"Mahaska County Historical Society|http://cdm16125.contentdm.oclc.org/u?/p270701coll7,174",,,,,,,,,,,,,,,,,,,,,,,,,,,,,,,,,,,,,,,,,,,,,,,,"<a href=""http://cdm16125.contentdm.oclc.org/u?/p270701coll7,174"" target=""_blank"">View this item in its source respository</a>",,,,,,,,,,,,,,,,,,,,,,,,,,,,,https://www.iowaheritage.org/files/original/8d336affdcde60256c0f63138dc54938.jpg,"Remote Item","Mahaska County Historical Society",1,0
78511,https://www.iowaheritage.org/items/show/78511,"Historic House; Oskaloosa, Mahaska County; Iowa","Historic Home|Mahaska County|Oskaloosa|Iowa","This is a historic district home located at 609 1st Avenue East in Oskaloosa, Iowa.  The home is across the street from St. Mary's Catholic Church and is still in existence today.","Mahaska County Historical Society","Historical Archives","Mahaska County Historical Society",unknown|2008-08-11,"Olive Maddy",www.nelsonpioneer.org,,"still image/jpeg",,image,"Mahaska County Historical Society|http://cdm16125.contentdm.oclc.org/u?/p270701coll7,173",,,,,,,,,,,,,,,,,,,,,,,,,,,,,,,,,,,,,,,,,,,,,,,,"<a href=""http://cdm16125.contentdm.oclc.org/u?/p270701coll7,173"" target=""_blank"">View this item in its source respository</a>",,,,,,,,,,,,,,,,,,,,,,,,,,,,,https://www.iowaheritage.org/files/original/99b8f7a6613eba0b980589df7905711a.jpg,"Remote Item","Mahaska County Historical Society",1,0
78510,https://www.iowaheritage.org/items/show/78510,"Seeberger-Loring-Kilburn House; Oskaloosa, Mahaska County; Iowa","Historic Home|Seeberger-Loring-Kilburn|Mahaska County|Oskaloosa|Iowa","This is a photograph taken of the Seeberger-Loring-Kilburn house, located at 509 High Avenue East.  Many of the historic homes in Oskaloosa can be found along High Avenue, Market Street, and 1st Avenue East today.","Mahaska County Historical Society","Historical Archives","Mahaska County Historical Society",unknown|2008-08-11,,www.nelsonpioneer.org,,"still image/jpeg",,image,"Mahaska County Historical Society|http://cdm16125.contentdm.oclc.org/u?/p270701coll7,172",,,,,,,,,,,,,,,,,,,,,,,,,,,,,,,,,,,,,,,,,,,,,,,,"<a href=""http://cdm16125.contentdm.oclc.org/u?/p270701coll7,172"" target=""_blank"">View this item in its source respository</a>",,,,,,,,,,,,,,,,,,,,,,,,,,,,,https://www.iowaheritage.org/files/original/9f6c393c4fb122eaea547e2c825686f2.jpg,"Remote Item","Mahaska County Historical Society",1,0
78509,https://www.iowaheritage.org/items/show/78509,"The McNeill Home, built in 1909; Oskaloosa, Mahaska County; Iowa","Historic Home|McNeill|Mahaska County|Oskaloosa|Iowa","This is a photograph taken of the home of W.A. McNeill, which was built between the years 1908-1909 by the architecture firm Hallett and Rawson.  The outside of the home is built with limestone.  Today, the home is host to a bed and breakfast and is known as the McNeill stone mansion, located on C Avenue East.","Mahaska County Historical Society","Historical Archives","Mahaska County Historical Society",1910?|2008-08-11,,www.nelsonpioneer.org,,"still image/jpeg",,image,"Mahaska County Historical Society|http://cdm16125.contentdm.oclc.org/u?/p270701coll7,171",,,,,,,,,,,,,,,,,,,,,,,,,,,,,,,,,,,,,,,,,,,,,,,,"<a href=""http://cdm16125.contentdm.oclc.org/u?/p270701coll7,171"" target=""_blank"">View this item in its source respository</a>",,,,,,,,,,,,,,,,,,,,,,,,,,,,,https://www.iowaheritage.org/files/original/23e406408c2ad062f45b78f2ab802273.jpg,"Remote Item","Mahaska County Historical Society",1,0
78508,https://www.iowaheritage.org/items/show/78508,"Park Place, home of H.W. McNeill, 1880's; Oskaloosa, Mahaska County; Iowa","Historic Home|H.W. McNeill|Park Place|Mahaska County|Oskaloosa|Iowa","This is a photograph taken of of the McNeill home in the late 1880's.  The home was located on Park Place on the northeast side of Oskaloosa.  The home burned down in May of 1924.  At the time it burned down, the McNeill home was one of the finest homes in all of Mahaska County.  It was built and lived in by railroad and coal tycoon, H.W. McNeill.","Mahaska County Historical Society","Historical Archives","Mahaska County Historical Society",1880-1889?|2008-08-11,"John F. Lacey",www.nelsonpioneer.org,,"still image/jpeg",,image,"Mahaska County Historical Society|http://cdm16125.contentdm.oclc.org/u?/p270701coll7,170",,,,,,,,,,,,,,,,,,,,,,,,,,,,,,,,,,,,,,,,,,,,,,,,"<a href=""http://cdm16125.contentdm.oclc.org/u?/p270701coll7,170"" target=""_blank"">View this item in its source respository</a>",,,,,,,,,,,,,,,,,,,,,,,,,,,,,https://www.iowaheritage.org/files/original/28a07eedb8bee4ef77fb597ac19e1872.jpg,"Remote Item","Mahaska County Historical Society",1,0
78507,https://www.iowaheritage.org/items/show/78507,"Marsenus Cutts Home, circa 1895; Mahaska County; Iowa","Historic Home|Marsenus Cutts|Mahaska County|Oskaloosa|Iowa","This is a photograph taken of Marsenus Cutts's home circa 1895.  The house was located on 604 1st Avenue East, near the downtown area of Oskaloosa, Iowa.  Pictured outside the home are members of the Cutts family.","Mahaska County Historical Society","Historical Archives","Mahaska County Historical Society",1895?|2008-08-11,"John F. Lacey",www.nelsonpioneer.org,,"still image/jpeg",,image,"Mahaska County Historical Society|http://cdm16125.contentdm.oclc.org/u?/p270701coll7,169",,,,,,,,,,,,,,,,,,,,,,,,,,,,,,,,,,,,,,,,,,,,,,,,"<a href=""http://cdm16125.contentdm.oclc.org/u?/p270701coll7,169"" target=""_blank"">View this item in its source respository</a>",,,,,,,,,,,,,,,,,,,,,,,,,,,,,https://www.iowaheritage.org/files/original/0086343721d9d3343478dc6ef0454e79.jpg,"Remote Item","Mahaska County Historical Society",1,0
