 




﻿"Item Id","Item URI","Dublin Core:Title","Dublin Core:Subject","Dublin Core:Description","Dublin Core:Creator","Dublin Core:Source","Dublin Core:Publisher","Dublin Core:Date","Dublin Core:Contributor","Dublin Core:Rights","Dublin Core:Relation","Dublin Core:Format","Dublin Core:Language","Dublin Core:Type","Dublin Core:Identifier","Dublin Core:Coverage","Item Type Metadata:Text","Item Type Metadata:Interviewer","Item Type Metadata:Interviewee","Item Type Metadata:Location","Item Type Metadata:Transcription","Item Type Metadata:Local URL","Item Type Metadata:Original Format","Item Type Metadata:Physical Dimensions","Item Type Metadata:Duration","Item Type Metadata:Compression","Item Type Metadata:Producer","Item Type Metadata:Director","Item Type Metadata:Bit Rate/Frequency","Item Type Metadata:Time Summary","Item Type Metadata:Email Body","Item Type Metadata:Subject Line","Item Type Metadata:From","Item Type Metadata:To","Item Type Metadata:CC","Item Type Metadata:BCC","Item Type Metadata:Number of Attachments","Item Type Metadata:Standards","Item Type Metadata:Objectives","Item Type Metadata:Materials","Item Type Metadata:Lesson Plan Text","Item Type Metadata:URL","Item Type Metadata:Event Type","Item Type Metadata:Participants","Item Type Metadata:Birth Date","Item Type Metadata:Birthplace","Item Type Metadata:Death Date","Item Type Metadata:Occupation","Item Type Metadata:Biographical Text","Item Type Metadata:Bibliography","Item Type Metadata:Digital Reproduction Information","Item Type Metadata:Repository","Item Type Metadata:Repository Collection","Item Type Metadata:Contact information.","Item Type Metadata:File Name","Item Type Metadata:Notes","Item Type Metadata:Digital item created","Item Type Metadata:Digital item modified","Item Type Metadata:Executive Orders","Item Type Metadata:Record Created","Item Type Metadata:Record Modified","Item Type Metadata:Transcription2","Item Type Metadata:Source URL","Omeka Legacy File:Additional Creator","Omeka Legacy File:Transcriber","Omeka Legacy File:Producer","Omeka Legacy File:Render Device","Omeka Legacy File:Render Details","Omeka Legacy File:Capture Date","Omeka Legacy File:Capture Device","Omeka Legacy File:Capture Details","Omeka Legacy File:Change History","Omeka Legacy File:Watermark","Omeka Legacy File:Encryption","Omeka Legacy File:Compression","Omeka Legacy File:Post Processing","Omeka Image File:Width","Omeka Image File:Height","Omeka Image File:Bit Depth","Omeka Image File:Channels","Omeka Image File:Exif String","Omeka Image File:Exif Array","Omeka Image File:IPTC String","Omeka Image File:IPTC Array","Omeka Video File:Bitrate","Omeka Video File:Duration","Omeka Video File:Sample Rate","Omeka Video File:Codec","Omeka Video File:Width","Omeka Video File:Height",tags,file,itemType,collection,public,featured
11920,https://www.iowaheritage.org/items/show/11920,"Studio Arts construction, The University of Iowa, August 1, 2008","Floods|University of Iowa|United States -- Iowa -- Iowa City|2000-2010|Evacuations|Disaster relief|Building construction|Art education|Educational facilities|Construction equipment|Construction workers||Studio Arts (Iowa City, Iowa)","Studio Arts construction in former Menards building on Highway 6 West in Iowa City. Installation of panels, framing, and electrical.","Jorgensen, Tom",,"University of Iowa. University News Services",2008-08-01|2008-08-01,,"Educational use only, no other permissions given. U.S. and international copyright laws may protect this item. Commercial use or distribution of this digital object is not permitted without written permission of the copyright holder.","Iowa City Flood|Flood Images|Studio Arts Construction, Aug. 1, 2008",jpeg,,"Still image|Photographs",https://digital.lib.uiowa.edu/,,,,,,,,,,,,,,,,,,,,,,,,,,,,,,,,,,,,,,,,,,,,,,,,"<a href=""https://digital.lib.uiowa.edu/"" target=""_blank"">View this item in its source respository</a>",,,,,,,,,,,,,,,,,,,,,,,,,,,,,https://www.iowaheritage.org/files/original/63aead966b8c82937bfdc7e96a4ffc94.jpg,"Remote Item","Iowa City Flood",1,0
11914,https://www.iowaheritage.org/items/show/11914,"Flood recovery effort at Adler Journalism and Mass Communication Building, The University of Iowa, July 2, 2008","Floods|University of Iowa|United States -- Iowa -- Iowa City|2000-2010|Evacuations|Disaster relief|Educational facilities||Adler Journalism and Mass Communication Building (Iowa City, Iowa)","Photos show flood recovery efforts at the Adler Journalism and Mass Communication Building. Machine pictured is used to purify air from harmful airborne mold.","Jorgensen, Tom",,"University of Iowa. University News Services",2008-07-02|2008-07-02,,"Educational use only, no other permissions given. U.S. and international copyright laws may protect this item. Commercial use or distribution of this digital object is not permitted without written permission of the copyright holder.","Iowa City Flood|Flood Images|Flood Aftermath Arts, July 2, 2008",jpeg,,"Still image|Photographs",https://digital.lib.uiowa.edu/,,,,,,,,,,,,,,,,,,,,,,,,,,,,,,,,,,,,,,,,,,,,,,,,"<a href=""https://digital.lib.uiowa.edu/"" target=""_blank"">View this item in its source respository</a>",,,,,,,,,,,,,,,,,,,,,,,,,,,,,https://www.iowaheritage.org/files/original/eade245aa3e7b11a4e45a675a33e2b03.jpg,"Remote Item","Iowa City Flood",1,0
11906,https://www.iowaheritage.org/items/show/11906,"Provost worker lunch, The University of Iowa, July 17, 2008","Floods|University of Iowa|United States -- Iowa -- Iowa City|2000-2010|Evacuations|Disaster relief|Laborers|Rest periods|Barbecues|","The Office of the Provost offered lunch to flood workers under a tent on the Gibson Square lawn. Faculty and staff members volunteered to serve workers to say thanks for their flood cleanup work. Hamburgers and brats were served for an estimated 300 people.","Jorgensen, Tom",,"University of Iowa. University News Services",2008-07-17|2008-07-17,,"Educational use only, no other permissions given. U.S. and international copyright laws may protect this item. Commercial use or distribution of this digital object is not permitted without written permission of the copyright holder.","Iowa City Flood|Flood Images|Provost Worker Lunch, July 17, 2008",jpeg,,"Still image|Photographs",https://digital.lib.uiowa.edu/,,,,,,,,,,,,,,,,,,,,,,,,,,,,,,,,,,,,,,,,,,,,,,,,"<a href=""https://digital.lib.uiowa.edu/"" target=""_blank"">View this item in its source respository</a>",,,,,,,,,,,,,,,,,,,,,,,,,,,,,https://www.iowaheritage.org/files/original/d46fda55f9de4d8e2c430e18813ba0ad.jpg,"Remote Item","Iowa City Flood",1,0
11904,https://www.iowaheritage.org/items/show/11904,"Flood recovery effort at Clapp Recital Hall, The University of Iowa, July 3, 2008","Floods|University of Iowa|United States -- Iowa -- Iowa City|2000-2010|Evacuations|Disaster relief|Educational facilities|Music education|Concert halls|Air pumps|Clapp Recital Hall (Iowa City, Iowa)","Photos show flood recovery efforts at Clapp Recital Hall. Machine pictured is used to purify air from harmful airborne mold.","Jorgensen, Tom",,"University of Iowa. University News Services",2008-07-03|2008-07-03,,"Educational use only, no other permissions given. U.S. and international copyright laws may protect this item. Commercial use or distribution of this digital object is not permitted without written permission of the copyright holder.","Iowa City Flood|Flood Images|Flood Aftermath Arts, July 3, 2008",jpeg,,"Still image|Photographs",https://digital.lib.uiowa.edu/,,,,,,,,,,,,,,,,,,,,,,,,,,,,,,,,,,,,,,,,,,,,,,,,"<a href=""https://digital.lib.uiowa.edu/"" target=""_blank"">View this item in its source respository</a>",,,,,,,,,,,,,,,,,,,,,,,,,,,,,https://www.iowaheritage.org/files/original/37bcc843819022964a6e915c57ef2737.jpg,"Remote Item","Iowa City Flood",1,0
11902,https://www.iowaheritage.org/items/show/11902,"Flood recovery effort around Iowa Memorial Union, The University of Iowa, July 2, 2008","Floods|University of Iowa|United States -- Iowa -- Iowa City|2000-2010|Evacuations|Disaster relief|Student unions|Water pumps|Air pumps|Iowa Memorial Union (Iowa City, Iowa)","Photos show flood recovery efforts around the Iowa Memorial Union and Danforth Chapel. Machines pictured are used to purify air from harmful airborne mold and pump floodwater from buildings.","Jorgensen, Tom",,"University of Iowa. University News Services",2008-07-02|2008-07-02,,"Educational use only, no other permissions given. U.S. and international copyright laws may protect this item. Commercial use or distribution of this digital object is not permitted without written permission of the copyright holder.","Iowa City Flood|Flood Images|Flood Aftermath Arts, July 2, 2008",jpeg,,"Still image|Photographs",https://digital.lib.uiowa.edu/,,,,,,,,,,,,,,,,,,,,,,,,,,,,,,,,,,,,,,,,,,,,,,,,"<a href=""https://digital.lib.uiowa.edu/"" target=""_blank"">View this item in its source respository</a>",,,,,,,,,,,,,,,,,,,,,,,,,,,,,https://www.iowaheritage.org/files/original/be706f0953604a7a33ea4a2347a9dd03.jpg,"Remote Item","Iowa City Flood",1,0
11890,https://www.iowaheritage.org/items/show/11890,"Studio Arts construction, The University of Iowa, August 5, 2008","Floods|University of Iowa|United States -- Iowa -- Iowa City|2000-2010|Evacuations|Disaster relief|Building construction|Construction workers|Educational facilities|Art education||Studio Arts (Iowa City, Iowa)","Studio Arts construction in former Menards building on Highway 6 West in Iowa City. Electrical, installation of partitions, and framing are pictured.","Jorgensen, Tom",,"University of Iowa. University News Services",2008-08-05|2008-08-05,,"Educational use only, no other permissions given. U.S. and international copyright laws may protect this item. Commercial use or distribution of this digital object is not permitted without written permission of the copyright holder.","Iowa City Flood|Flood Images|Studio Arts Construction, Aug. 5, 2008",jpeg,,"Still image|Photographs",https://digital.lib.uiowa.edu/,,,,,,,,,,,,,,,,,,,,,,,,,,,,,,,,,,,,,,,,,,,,,,,,"<a href=""https://digital.lib.uiowa.edu/"" target=""_blank"">View this item in its source respository</a>",,,,,,,,,,,,,,,,,,,,,,,,,,,,,https://www.iowaheritage.org/files/original/edc4da4b2cb7f54ab901d18dcc2f5242.jpg,"Remote Item","Iowa City Flood",1,0
11880,https://www.iowaheritage.org/items/show/11880,"Flood cleanup workers at Voxman Music Building, The University of Iowa, July 3, 2008","Floods|University of Iowa|United States -- Iowa -- Iowa City|2000-2010|Evacuations|Disaster relief|Educational facilities|Music education|Voxman Music Building (Iowa City, Iowa)","Photos show aftermath of flooding at the Voxman Music Building. Flood recovery workers evacuate the building.","Jorgensen, Tom",,"University of Iowa. University News Services",2008-07-03|2008-07-03,,"Educational use only, no other permissions given. U.S. and international copyright laws may protect this item. Commercial use or distribution of this digital object is not permitted without written permission of the copyright holder.","Iowa City Flood|Flood Images|Flood Aftermath Arts, July 3, 2008",jpeg,,"Still image|Photographs",https://digital.lib.uiowa.edu/,,,,,,,,,,,,,,,,,,,,,,,,,,,,,,,,,,,,,,,,,,,,,,,,"<a href=""https://digital.lib.uiowa.edu/"" target=""_blank"">View this item in its source respository</a>",,,,,,,,,,,,,,,,,,,,,,,,,,,,,https://www.iowaheritage.org/files/original/24ac3a4ff4ee65990fd938948ec83db7.jpg,"Remote Item","Iowa City Flood",1,0
11874,https://www.iowaheritage.org/items/show/11874,"Katherine Johnson and Liz Johnson interview about the Midwest floods of June 2008, The University of Iowa Main Library, Iowa City, Iowa, October 2, 2008","Floods|Johnson, Katherine|United States -- Iowa -- Iowa City|2000-2010|Evacuations|Disaster relief|Johnson, Liz|United States -- Iowa -- Iowa River","Interview with sisters Katherine Johnson (22) of Cedar Rapids, Iowa and Liz Johnson (27) of Omaha, Nebraska.|Liz (age 27) and Kate (age 22) talk about the apartment they lost in the Iowa River flood in June 2008. They were given just one hour to evacuate, and lost most of their belongings and their home.|First night of the flood - noisy machinery, stress, making a plan. Liz sent home from work early (00:00:48) -- Came home and saw people packing - being evacuated. Trying to pack up the cats, pack up belongings. Katherine wasn't home, Liz had to decide what to bring for her. Katherine was in class (00:03:10) -- Went to their grandparent's house - feeling powerless. Out of their houses for two weeks (00:07:02) -- Twenty inches of moldy water. Shelves caved in under the weight of swollen books (00:08:05) -- Feeling childish - ""It's just stuff"" (00:09:55) -- Listening to the radio - running on a generator. Going to WalMart (00:11:26) -- The flood made them impulsive, trying to stay less stressed. Emotionally exhausting (00:13:45) -- Watching the local news, looking for their building (00:16:50) -- Let the local news look into their apartment, opening the refrigerator for them (00:18:50) -- Weren't expecting it - didn't know they were at risk. The week leading up to floods (00:22:45) -- Changes in their personalities and their cats. Being angry at each other instead of the flood (00:25:04) -- Sandbagging the day after the evacuation - reminded them that it was hopeless and chaotic (00:30:00) -- Katherine worked in the library, couldn't go back there either. Cedar Rapids library flooded (00:31:40) -- Reactions from others - people making light of it. Finding others who are going through the same things (00:33:07) -- Remembering their old apartment (00:35:20) -- National news coverage leaving Iowa floods - Tim Russert's death took attention away (00:37:30) -- Thanking each other (00:38:30)","Johnson, Katherine; Johnson, Liz",,"StoryCorps (Project); University of Iowa. Libraries. Digital Research & Publishing",2008-10-02|2008-10-02,,"Educational use only, no other permissions given. U.S. and international copyright laws may protect this item. Commercial use or distribution of this digital object is not permitted without written permission of the copyright holder.","Iowa City Flood|Flood Oral Histories",mpeg|00:39:12,English,"Sound|Oral histories (Document genres)",DDA000509.mp3|https://digital.lib.uiowa.edu/,,,,,,,,,,,,,,,,,,,,,,,,,,,,,,,,,,,,,,,,,,,,,,,,"<a href=""https://digital.lib.uiowa.edu/"" target=""_blank"">View this item in its source respository</a>",,,,,,,,,,,,,,,,,,,,,,,,,,,,,https://www.iowaheritage.org/files/original/6e898e95e324b0b87767e564c11d2615.jpg,"Remote Item","Iowa City Flood",1,0
11851,https://www.iowaheritage.org/items/show/11851,"Donald Baxter and Carol Johnk interview about the Midwest floods of June 2008, Iowa City, Iowa, September 30, 2008","Floods|Johnk, Carol|United States -- Iowa -- Iowa City|2000-2010|Evacuations|Disaster relief|Baxter, Donald|United States -- Iowa -- Iowa River","Interview with friends and coworkers Carol Johnk (51) of Hudson, South Dakota and Donald Baxter (50) of Atlanta, Georgia.|Carol and Donald discuss sandbagging before the floods hit. They also remember photographing the surreal scenes that the floods produced.|Donald and Carol were sandbagging. Describe the process. As the flood was coming. To protect from the flood (00:00:51) -- Carol talks about the unreality of the flood - like a movie. Donald agrees (00:02:58) -- Donald remembers when the flood came. Sandbagging helped. Spent a week off of work (00:03:48) -- University shut down for a week. Then asked to document flood damage. Both Carol and Donald volunteered to help (00:05:59) -- Donald photographed the art museum. Speed of mold growth (00:07:14) -- Carol took pictures of the music building (00:08:35) -- Donald photographing old art building basement. Seeing things left behind. History being removed (00:09:14) -- Donald photographed steam plant. Seeing parts of university never seen before. Carol got into a building she had never been in before. Totally dark room using flash to illuminate, seeing a huge laser for a few instances. Rooms lit only by repeating flash (00:11:19) -- Opening a door into an underground tunnel going from building to building (00:14:54) -- Tunnels caused huge problems that sandbagging could not prevent (00:15:40) -- Learning Iowa used to be a huge inland sea. Donald and Carol talk about relationship to water, flooding (00:16:42) -- Donald talks about sandbagging and being part of a large scale natural disaster - seeing people you know. Proof of ""social capital and community pride."" Everyone was out. Children filling up bags and a blind person filling up bags (00:22:03) -- Carol on photographing a flooded apartment building. Carol remembers a particular apartment - one woman had all of her things in the apartment, couldn't get her things out (00:23:14) -- Donald talks about seeing a neighborhood in Cedar Rapids. Feeling lucky to have been in Iowa City. Entire neighborhoods flooded. Iowa City has a dam (00:25:19) -- Carol visited Coralville. Seeing flood water was beautiful during the sunset. Trouble with beauty of those pictures (00:27:45) -- Rains before the flood. Beauty of weather during the flood (00:29:00) -- Eating gritty cold cuts. Living with sand for weeks. Smell inside buildings (00:30:43) -- Cleaning crews who came in were amazing. People who go around the country and clean up after disasters. Often immigrant labor. Mexico, Guatemala, El Salvador. Iowa has had recent immigrant raids. ""Made me feel guilty."" Losing helmets (00:32:40) -- One of Donald's pictures of ducks swimming around parking meters (00:39:05) -- Carol took pictures for her family (00:39:35)","Johnk, Carol; Baxter, Donald",,"StoryCorps (Project); University of Iowa. Libraries. Digital Research & Publishing",2008-09-30|2008-09-30,,"Educational use only, no other permissions given. U.S. and international copyright laws may protect this item. Commercial use or distribution of this digital object is not permitted without written permission of the copyright holder.","Iowa City Flood|Flood Oral Histories",mpeg|00:41:55,English,"Sound|Oral histories (Document genres)",DDA000498.mp3|https://digital.lib.uiowa.edu/,,,,,,,,,,,,,,,,,,,,,,,,,,,,,,,,,,,,,,,,,,,,,,,,"<a href=""https://digital.lib.uiowa.edu/"" target=""_blank"">View this item in its source respository</a>",,,,,,,,,,,,,,,,,,,,,,,,,,,,,https://www.iowaheritage.org/files/original/0ce1978f456bc6c02f2b8f470733a334.jpg,"Remote Item","Iowa City Flood",1,0
15790,https://www.iowaheritage.org/items/show/15790,"Refugee narrative of Martha Huntington, 1920s","War|United States -- History -- Civil War, 1861-1865|Huntington, Martha|United States -- Georgia -- Atlanta|1920-1930|Evacuations|Refugees",,"Huntington, Martha",,"University of Iowa. Libraries. Special Collections Dept.",1920/1929,,"Educational use only, no other permissions given. U.S. and international copyright laws may protect this digital image. Commercial use or distribution of the image is not permitted without prior permission of the copyright holder.","Civil War Diaries and Letters|Civil War Collection|http://www.lib.uiowa.edu/spec-coll/msc/ToMsC950/MsC906/CivilWarCollection.html",,,Text|Memoirs|jpeg,MsC906|index.cpd|https://digital.lib.uiowa.edu/,,,,,,,,,,,,,,,,,,,,,,,,,,,,,,,,,,,,,,,,,,,,,,,,"<a href=""https://digital.lib.uiowa.edu/"" target=""_blank"">View this item in its source respository</a>",,,,,,,,,,,,,,,,,,,,,,,,,,,,,https://www.iowaheritage.org/files/original/a4c4625e2a34c518e4be5e5c6e2ec0fe.jpg,"Remote Item","Civil War Diaries and Letters",1,0
