 




﻿"Item Id","Item URI","Dublin Core:Title","Dublin Core:Subject","Dublin Core:Description","Dublin Core:Creator","Dublin Core:Source","Dublin Core:Publisher","Dublin Core:Date","Dublin Core:Contributor","Dublin Core:Rights","Dublin Core:Relation","Dublin Core:Format","Dublin Core:Language","Dublin Core:Type","Dublin Core:Identifier","Dublin Core:Coverage","Item Type Metadata:Text","Item Type Metadata:Interviewer","Item Type Metadata:Interviewee","Item Type Metadata:Location","Item Type Metadata:Transcription","Item Type Metadata:Local URL","Item Type Metadata:Original Format","Item Type Metadata:Physical Dimensions","Item Type Metadata:Duration","Item Type Metadata:Compression","Item Type Metadata:Producer","Item Type Metadata:Director","Item Type Metadata:Bit Rate/Frequency","Item Type Metadata:Time Summary","Item Type Metadata:Email Body","Item Type Metadata:Subject Line","Item Type Metadata:From","Item Type Metadata:To","Item Type Metadata:CC","Item Type Metadata:BCC","Item Type Metadata:Number of Attachments","Item Type Metadata:Standards","Item Type Metadata:Objectives","Item Type Metadata:Materials","Item Type Metadata:Lesson Plan Text","Item Type Metadata:URL","Item Type Metadata:Event Type","Item Type Metadata:Participants","Item Type Metadata:Birth Date","Item Type Metadata:Birthplace","Item Type Metadata:Death Date","Item Type Metadata:Occupation","Item Type Metadata:Biographical Text","Item Type Metadata:Bibliography","Item Type Metadata:Digital Reproduction Information","Item Type Metadata:Repository","Item Type Metadata:Repository Collection","Item Type Metadata:Contact information.","Item Type Metadata:File Name","Item Type Metadata:Notes","Item Type Metadata:Digital item created","Item Type Metadata:Digital item modified","Item Type Metadata:Executive Orders","Item Type Metadata:Record Created","Item Type Metadata:Record Modified","Item Type Metadata:Transcription2","Item Type Metadata:Source URL","Omeka Legacy File:Additional Creator","Omeka Legacy File:Transcriber","Omeka Legacy File:Producer","Omeka Legacy File:Render Device","Omeka Legacy File:Render Details","Omeka Legacy File:Capture Date","Omeka Legacy File:Capture Device","Omeka Legacy File:Capture Details","Omeka Legacy File:Change History","Omeka Legacy File:Watermark","Omeka Legacy File:Encryption","Omeka Legacy File:Compression","Omeka Legacy File:Post Processing","Omeka Image File:Width","Omeka Image File:Height","Omeka Image File:Bit Depth","Omeka Image File:Channels","Omeka Image File:Exif String","Omeka Image File:Exif Array","Omeka Image File:IPTC String","Omeka Image File:IPTC Array","Omeka Video File:Bitrate","Omeka Video File:Duration","Omeka Video File:Sample Rate","Omeka Video File:Codec","Omeka Video File:Width","Omeka Video File:Height",tags,file,itemType,collection,public,featured
12239,https://www.iowaheritage.org/items/show/12239,"Volunteers fill sandbags outside Main Library, The University of Iowa, June 13, 2008","Floods|University of Iowa|United States -- Iowa -- Iowa City|2000-2010|Evacuations|Disaster relief|Community service||Main Library (Iowa City, Iowa)","Volunteers fill sandbags outside the Main Library on Friday, June 13, 2008.","Schoon, Tim",,"University of Iowa. University News Services",2008-06-13|2008-06-13,,"Educational use only, no other permissions given. U.S. and international copyright laws may protect this item. Commercial use or distribution of this digital object is not permitted without written permission of the copyright holder.","Iowa City Flood|Flood Images|Library sandbagging, June 13, 2008",jpeg,,"Still image|Photographs",https://digital.lib.uiowa.edu/,,,,,,,,,,,,,,,,,,,,,,,,,,,,,,,,,,,,,,,,,,,,,,,,"<a href=""https://digital.lib.uiowa.edu/"" target=""_blank"">View this item in its source respository</a>",,,,,,,,,,,,,,,,,,,,,,,,,,,,,https://www.iowaheritage.org/files/original/2cc56ceac995dbc70c002876bb3e8f74.jpg,"Remote Item","Iowa City Flood",1,0
12240,https://www.iowaheritage.org/items/show/12240,"Power Plant Rehabilitation, The University of Iowa, September 5, 2008","Floods|University of Iowa|United States -- Iowa -- Iowa City|2000-2010|Evacuations|Disaster relief|Power plants|University of Iowa Power Plant","Working to get the power plant ready to operate again after the flood.","Schoon, Tim",,"University of Iowa. University News Services",2008-09-05|2008-09-05,,"Educational use only, no other permissions given. U.S. and international copyright laws may protect this item. Commercial use or distribution of this digital object is not permitted without written permission of the copyright holder.","Iowa City Flood|Flood Images|Power Plant rehabbing, Sept. 5, 2008",jpeg,,"Still image|Photographs",https://digital.lib.uiowa.edu/,,,,,,,,,,,,,,,,,,,,,,,,,,,,,,,,,,,,,,,,,,,,,,,,"<a href=""https://digital.lib.uiowa.edu/"" target=""_blank"">View this item in its source respository</a>",,,,,,,,,,,,,,,,,,,,,,,,,,,,,https://www.iowaheritage.org/files/original/639a89949ea9151130f76a4d7d59d582.jpg,"Remote Item","Iowa City Flood",1,0
12241,https://www.iowaheritage.org/items/show/12241,"Volunteers fill sandbags outside Iowa Memorial Union, The University of Iowa, June 12, 2008","Floods|University of Iowa|United States -- Iowa -- Iowa City|2000-2010|Evacuations|Disaster relief|Community service|Student Unions||Iowa Memorial Union (Iowa City, Iowa)","Volunteers fill sandbags outside the Iowa Memorial Union on Thursday, June 12, 2008.","Schoon, Tim",,"University of Iowa. University News Services",2008-06-12|2008-06-12,,"Educational use only, no other permissions given. U.S. and international copyright laws may protect this item. Commercial use or distribution of this digital object is not permitted without written permission of the copyright holder.","Iowa City Flood|Flood Images|Flood, June 12, 2008",jpeg,,"Still image|Photographs",https://digital.lib.uiowa.edu/,,,,,,,,,,,,,,,,,,,,,,,,,,,,,,,,,,,,,,,,,,,,,,,,"<a href=""https://digital.lib.uiowa.edu/"" target=""_blank"">View this item in its source respository</a>",,,,,,,,,,,,,,,,,,,,,,,,,,,,,https://www.iowaheritage.org/files/original/31389f979ad52ead58af371f28261d4e.jpg,"Remote Item","Iowa City Flood",1,0
12242,https://www.iowaheritage.org/items/show/12242,"Parking lot near English-Philosophy Building flooded, The University of Iowa, June 13, 2008","Floods|University of Iowa|United States -- Iowa -- Iowa City|2000-2010|Evacuations|Disaster relief|Railroad bridges|Parking lots","A parking lot near English-Philosophy Building flooded on Friday, June 13, 2008. Onlookers watch flooding from railroad bridge near the parking lot.","Schoon, Tim",,"University of Iowa. University News Services",2008-06-13|2008-06-13,,"Educational use only, no other permissions given. U.S. and international copyright laws may protect this item. Commercial use or distribution of this digital object is not permitted without written permission of the copyright holder.","Iowa City Flood|Flood Images|Flood, June 13, 2008",jpeg,,"Still image|Photographs",https://digital.lib.uiowa.edu/,,,,,,,,,,,,,,,,,,,,,,,,,,,,,,,,,,,,,,,,,,,,,,,,"<a href=""https://digital.lib.uiowa.edu/"" target=""_blank"">View this item in its source respository</a>",,,,,,,,,,,,,,,,,,,,,,,,,,,,,https://www.iowaheritage.org/files/original/63b6771b8793b99d0bdd705a1e0de67e.jpg,"Remote Item","Iowa City Flood",1,0
12243,https://www.iowaheritage.org/items/show/12243,"Organ lessons at Gloria Dei, The University of Iowa, September 5, 2008","Floods|University of Iowa|United States -- Iowa -- Iowa City|2000-2010|Evacuations|Disaster relief|Music education|Organs","Greg Hand gives an organ lesson at Gloria Dei Lutheran Church in Iowa City. Organ faculty have been invited to use organs in local churches after being displaced by the floods of 2008.","Jorgensen, Tom",,"University of Iowa. University News Services",2008-09-05|2008-09-05,,"Educational use only, no other permissions given. U.S. and international copyright laws may protect this item. Commercial use or distribution of this digital object is not permitted without written permission of the copyright holder.","Iowa City Flood|Flood Images|Organ Gloria Dei, Sept. 5, 2008",jpeg,,"Still image|Photographs",https://digital.lib.uiowa.edu/,,,,,,,,,,,,,,,,,,,,,,,,,,,,,,,,,,,,,,,,,,,,,,,,"<a href=""https://digital.lib.uiowa.edu/"" target=""_blank"">View this item in its source respository</a>",,,,,,,,,,,,,,,,,,,,,,,,,,,,,https://www.iowaheritage.org/files/original/a6d57abe5c55d691f052953741459d48.jpg,"Remote Item","Iowa City Flood",1,0
12244,https://www.iowaheritage.org/items/show/12244,"Volunteers sandbagging, The University of Iowa, June 14, 2008","Floods|University of Iowa|United States -- Iowa -- Iowa City|2000-2010|Evacuations|Disaster relief|Community service","Volunteers sandbag on The University of Iowa campus on Saturday, June 14, 2008.","Schoon, Tim",,"University of Iowa. University News Services",2008-06-14|2008-06-14,,"Educational use only, no other permissions given. U.S. and international copyright laws may protect this item. Commercial use or distribution of this digital object is not permitted without written permission of the copyright holder.","Iowa City Flood|Flood Images|Flood preparations, June 14, 2008",jpeg,,"Still image|Photographs",https://digital.lib.uiowa.edu/,,,,,,,,,,,,,,,,,,,,,,,,,,,,,,,,,,,,,,,,,,,,,,,,"<a href=""https://digital.lib.uiowa.edu/"" target=""_blank"">View this item in its source respository</a>",,,,,,,,,,,,,,,,,,,,,,,,,,,,,https://www.iowaheritage.org/files/original/45bec8233d3294aed1c98372bc436812.jpg,"Remote Item","Iowa City Flood",1,0
12245,https://www.iowaheritage.org/items/show/12245,"Outside Iowa Advanced Technology Laboratories and Iowa Memorial Union, The University of Iowa, June 19, 2008","Floods|University of Iowa|United States -- Iowa -- Iowa City|2000-2010|Evacuations|Disaster relief|Retaining walls|Student Unions||Iowa Memorial Union (Iowa City, Iowa)|Iowa Advanced Technology Laboratories (Iowa City, Iowa)","Outside Iowa Advanced Technology Laboratories and Iowa Memorial Union on Thursday, June 19, 2008.","Schoon, Tim",,"University of Iowa. University News Services",2008-06-19|2008-06-19,,"Educational use only, no other permissions given. U.S. and international copyright laws may protect this item. Commercial use or distribution of this digital object is not permitted without written permission of the copyright holder.","Iowa City Flood|Flood Images|Flood, June 19, 2008",jpeg,,"Still image|Photographs",https://digital.lib.uiowa.edu/,,,,,,,,,,,,,,,,,,,,,,,,,,,,,,,,,,,,,,,,,,,,,,,,"<a href=""https://digital.lib.uiowa.edu/"" target=""_blank"">View this item in its source respository</a>",,,,,,,,,,,,,,,,,,,,,,,,,,,,,https://www.iowaheritage.org/files/original/b16cffd9ea065f200d77b93508dcfe30.jpg,"Remote Item","Iowa City Flood",1,0
12246,https://www.iowaheritage.org/items/show/12246,"The Daily Iowan offices relocated, The University of Iowa, June 29, 2008","Floods|United States -- Iowa -- Iowa City|2000-2010|Evacuations|Disaster relief","The Daily Iowan staff working out of temporary locations due to flooding in the basement of the Adler Building.  The production staff is working out of the Cedar Rapids Gazette offices in the Old Capitol Center and the news room was relocated to Schaeffer Hall.  The first photos are of the production staff.  Samantha Miller a designer is pictured in the foreground (green top).  The last five frames show Alayna Wilken in the temp. newsroom.  Alayna is an intern Metro Reporter for the DI.","Jorgensen, Tom",,,2008-06-29|2008-06-29,,,"080629 Daily Iowan Relocated",jpeg|19|28,,"Still image|photographs",https://digital.lib.uiowa.edu/,,,,,,,,,,,,,,,,,,,,,,,,,,,,,,,,,,,,,,,,,,,,,,,,"<a href=""https://digital.lib.uiowa.edu/"" target=""_blank"">View this item in its source respository</a>",,,,,,,,,,,,,,,,,,,,,,,,,,,,,https://www.iowaheritage.org/files/original/87d69f0f95ee8f2547a70a463572545b.jpg,"Remote Item","Iowa City Flood",1,0
12247,https://www.iowaheritage.org/items/show/12247,"Volunteers sandbagging outside Lindquist Center, The University of Iowa, June 14, 2008","Floods|University of Iowa|United States -- Iowa -- Iowa City|2000-2010|Evacuations|Disaster relief|Community service|Educational facilities||Lindquist Center (Iowa City, Iowa)","Volunteers sandbag outside the Lindquist Center on Saturday, June 14, 2008.","Schoon, Tim",,"University of Iowa. University News Services",2008-06-14|2008-06-14,,"Educational use only, no other permissions given. U.S. and international copyright laws may protect this item. Commercial use or distribution of this digital object is not permitted without written permission of the copyright holder.","Iowa City Flood|Flood Images|Flood preparations, June 14, 2008",jpeg,,"Still image|Photographs",https://digital.lib.uiowa.edu/,,,,,,,,,,,,,,,,,,,,,,,,,,,,,,,,,,,,,,,,,,,,,,,,"<a href=""https://digital.lib.uiowa.edu/"" target=""_blank"">View this item in its source respository</a>",,,,,,,,,,,,,,,,,,,,,,,,,,,,,https://www.iowaheritage.org/files/original/228c4d7c1fefbfa0f07b0a2a75ca0c90.jpg,"Remote Item","Iowa City Flood",1,0
12248,https://www.iowaheritage.org/items/show/12248,"Studio Arts construction, The University of Iowa, August 1, 2008","Floods|University of Iowa|United States -- Iowa -- Iowa City|2000-2010|Evacuations|Disaster relief|Building construction|Art education|Educational facilities|Construction workers||Studio Arts (Iowa City, Iowa)","Studio Arts construction in former Menards building on Highway 6 West in Iowa City. Installation of panels, framing, and electrical.","Jorgensen, Tom",,"University of Iowa. University News Services",2008-08-01|2008-08-01,,"Educational use only, no other permissions given. U.S. and international copyright laws may protect this item. Commercial use or distribution of this digital object is not permitted without written permission of the copyright holder.","Iowa City Flood|Flood Images|Studio Arts Construction, Aug. 1, 2008",jpeg,,"Still image|Photographs",https://digital.lib.uiowa.edu/,,,,,,,,,,,,,,,,,,,,,,,,,,,,,,,,,,,,,,,,,,,,,,,,"<a href=""https://digital.lib.uiowa.edu/"" target=""_blank"">View this item in its source respository</a>",,,,,,,,,,,,,,,,,,,,,,,,,,,,,https://www.iowaheritage.org/files/original/2d3d04637e35298421e48f5083cf5861.jpg,"Remote Item","Iowa City Flood",1,0
