 




﻿"Item Id","Item URI","Dublin Core:Title","Dublin Core:Subject","Dublin Core:Description","Dublin Core:Creator","Dublin Core:Source","Dublin Core:Publisher","Dublin Core:Date","Dublin Core:Contributor","Dublin Core:Rights","Dublin Core:Relation","Dublin Core:Format","Dublin Core:Language","Dublin Core:Type","Dublin Core:Identifier","Dublin Core:Coverage","Item Type Metadata:Text","Item Type Metadata:Interviewer","Item Type Metadata:Interviewee","Item Type Metadata:Location","Item Type Metadata:Transcription","Item Type Metadata:Local URL","Item Type Metadata:Original Format","Item Type Metadata:Physical Dimensions","Item Type Metadata:Duration","Item Type Metadata:Compression","Item Type Metadata:Producer","Item Type Metadata:Director","Item Type Metadata:Bit Rate/Frequency","Item Type Metadata:Time Summary","Item Type Metadata:Email Body","Item Type Metadata:Subject Line","Item Type Metadata:From","Item Type Metadata:To","Item Type Metadata:CC","Item Type Metadata:BCC","Item Type Metadata:Number of Attachments","Item Type Metadata:Standards","Item Type Metadata:Objectives","Item Type Metadata:Materials","Item Type Metadata:Lesson Plan Text","Item Type Metadata:URL","Item Type Metadata:Event Type","Item Type Metadata:Participants","Item Type Metadata:Birth Date","Item Type Metadata:Birthplace","Item Type Metadata:Death Date","Item Type Metadata:Occupation","Item Type Metadata:Biographical Text","Item Type Metadata:Bibliography","Item Type Metadata:Digital Reproduction Information","Item Type Metadata:Repository","Item Type Metadata:Repository Collection","Item Type Metadata:Contact information.","Item Type Metadata:File Name","Item Type Metadata:Notes","Item Type Metadata:Digital item created","Item Type Metadata:Digital item modified","Item Type Metadata:Executive Orders","Item Type Metadata:Record Created","Item Type Metadata:Record Modified","Item Type Metadata:Transcription2","Item Type Metadata:Source URL","Omeka Legacy File:Additional Creator","Omeka Legacy File:Transcriber","Omeka Legacy File:Producer","Omeka Legacy File:Render Device","Omeka Legacy File:Render Details","Omeka Legacy File:Capture Date","Omeka Legacy File:Capture Device","Omeka Legacy File:Capture Details","Omeka Legacy File:Change History","Omeka Legacy File:Watermark","Omeka Legacy File:Encryption","Omeka Legacy File:Compression","Omeka Legacy File:Post Processing","Omeka Image File:Width","Omeka Image File:Height","Omeka Image File:Bit Depth","Omeka Image File:Channels","Omeka Image File:Exif String","Omeka Image File:Exif Array","Omeka Image File:IPTC String","Omeka Image File:IPTC Array","Omeka Video File:Bitrate","Omeka Video File:Duration","Omeka Video File:Sample Rate","Omeka Video File:Codec","Omeka Video File:Width","Omeka Video File:Height",tags,file,itemType,collection,public,featured
96905,https://www.iowaheritage.org/items/show/96905,"Certificate of Appreciation","Monroe County Soil and Water Conservation District |Wetland ","Certificate of appreciation presented to the Albia Field office staff in completing the Monroe County wetland determination during fiscal year 1991.","U.S. Department of Agriculture ",,"State Library of Iowa","1990-10-01 to 1991-09-30","Monroe County Soil and Water Conservation District of Iowa. For questions about copyright, contact the State Library of Iowa at  <a href=""http://www.statelibraryofiowa.org"">http://www.statelibraryofiowa.org</a>.","This item is protected by copyright and/or related rights. Your are free to use this Item in any way that is permitted by the copyright and related rights legislation that applies to your use. For other uses you need to obtain permission from the rights-holder(s). <a href=""http://rightsstatements.org/"">http://rightsstatements.org</a>",,pdf,eng,"Text: Certificate",,,,,,,,,,,,,,,,,,,,,,,,,,,,,,,,,,,,,,,,,Monroe_SWCD_20191105_005,,,,,,,,,,,,,,,,,,,,,,,,,,,,,,,,,,,,"Monroe Soil and Water Conservation District,Wetlands",https://www.iowaheritage.org/files/original/4c9dac6080c4825e29a1c92fcb2dcf07.pdf,Document,"Monroe County Soil and Water Conservation District Historical Collection",1,0
97110,https://www.iowaheritage.org/items/show/97110,"Schreiber riparian ","Ida County Soil and Water Conservation District |Wetlands","Color photograph of farmland with terraces in background. Handwritten note on back of photograph, ""Al Schreiber riparian"". ","Ida County Soil and Water Conservation District",,"State Library of Iowa","Unknown ","Ida County Soil and Water Conservation District of Iowa. For questions about copyright, contact the State Library of Iowa at  <a href=""http://www.statelibraryofiowa.org"">http://www.statelibraryofiowa.org</a>.","This item is protected by copyright and/or related rights. Your are free to use this Item in any way that is permitted by the copyright and related rights legislation that applies to your use. For other uses you need to obtain permission from the rights-holder(s). <a href=""http://rightsstatements.org/"">http://rightsstatements.org</a>",,jpg,eng,"Still Image; Photograph ",,,,,,,,,,,,,,,,,,,,,,,,,,,,,,,,,,,,,,,,,20191114_004|20191114_004b,,,,,,,,,,,,,,,,,,,,,,,,,,,,,,,,,,,,"Al Schreiber,Ida County Soil and Water Conservation District,Riparian,Wetlands","https://www.iowaheritage.org/files/original/26f4df31e4005eb0453f4010f06e7e2a.jpg,https://www.iowaheritage.org/files/original/73d67c23cf6109e3a11fe05d1c06e9ab.jpg","Still Image","Ida County Soil and Water Conservation District Historical Collection ",1,0
97212,https://www.iowaheritage.org/items/show/97212,"Scrapbook - 1990 to 1996.","Dickinson County Soil and Water Conservation District ","Scrapbook with newspaper clippings, photographs, and documents from the years 1990 to 1996.","Dickinson County Soil and Water Conservation District ",,"State Library of Iowa|Dickinson County Soil and Water Conservation District ",1990-,"Dickinson County Soil and Water Conservation District of Iowa. For questions about copyright, contact the State Library of Iowa at  <a href=""http://www.statelibraryofiowa.org"">http://www.statelibraryofiowa.org</a>.","This item is protected by copyright and/or related rights. Your are free to use this Item in any way that is permitted by the copyright and related rights legislation that applies to your use. For other uses you need to obtain permission from the rights-holder(s). <a href=""http://rightsstatements.org/"">http://rightsstatements.org</a>",,pdf,eng,"Text: Document ",,,,,,,,,,,,,,,,,,,,,,,,,,,,,,,,,,,,,,,,,DickinsonSWCD_Scrapbook_1990_1996.pdf,,,,,,,,,,,,,,,,,,,,,,,,,,,,,,,,,,,,"Clean Water Alliance Project,Doug Harr,Karmin Blunt,Orville Berg,Outdoor Classrooms,Owen Primavera,Pesticides,Roger McGinnis,West Okoboji Lake,Wetlands",https://www.iowaheritage.org/files/original/54bb6262315aa014f59332e1dc1343f0.pdf,Document,"Dickinson County Soil and Water Conservation District Historical Collection",1,0
97846,https://www.iowaheritage.org/items/show/97846," Monroe County Soil and Water Conservation District scrapbook, 1980-1994","Monroe County Soil and Water Conservation District |Lake Miami|Teno, Don|Bolts, John","District created scrapbook of local newspapers articles regarding soil and water conservation and related activities in Monroe County. ","Monroe County Soil and Water Conservation District",,"State Library of Iowa",1980-1994,"Monroe County Soil and Water Conservation District. For questions about copyright, contact the State Library of Iowa at  <a href=""http://www.statelibraryofiowa.org"">http://www.statelibraryofiowa.org</a>.","This item is protected by copyright and/or related rights. Your are free to use this Item in any way that is permitted by the copyright and related rights legislation that applies to your use. For other uses you need to obtain permission from the rights-holder(s). <a href=""http://rightsstatements.org/"">http://rightsstatements.org</a>",,pdf,eng,"Text; Document",,,,,,,,,,,,,,,,,,,,,,,,,,,,,,,,,,,,,,,,,Monroe_Co_Scrapbook_1980_1994_OCR,,,,,,,,,,,,,,,,,,,,,,,,,,,,,,,,,,,,"Agnes Gergely,Albert Etcher,Albia FFA,Bill Henderson,Bob McGinnis,Cedar Creek,Clifford Lowery,Conservation Awards,Dan Snyder,Dave Teno,Delbert Love,Don Teno,Don Tibbals,Duane Chance,Earl Albertson,Ed Crall,Ed Yarkosky,Field Day,Flooding,Garon Cady,George Teno,Governor Branstad,Helen Tierney,Jack Lagrod,Jack Langford,John Beary,John Bolts,John Botts,John Comer,John Frieden,John Lawless,John Slagter,Kay McGee,Kendra Schweer,Lake Miami,Leo Duree,Lloyd Clark,Mary Ammons,Melissa DeMoss,Monroe Soil and Water Conservation District,Mr. and Mrs. Ray Gardner,Ollie Kaldenberg,Orlo DeBruin,Poster Contest,RAMP,Randy Rozenboom,Ray Gardner,Rita Gergely,Ronald Goode,Soap Creek Watershed,Steve Strasko,Storm Damage,Sylvan Runkel,Terry Romp,Timber Rattlesnake,Tom Mock,Tree Planting,Vernon DeTar,Wetlands,Wildlife Habitat- Iowa,William McGrath",https://www.iowaheritage.org/files/original/05ea44bb2395956fe5172a3e9e8cef72.pdf,Document,"Monroe County Soil and Water Conservation District Historical Collection",1,0
97872,https://www.iowaheritage.org/items/show/97872,"News articles from the 1990's.","Delaware County Soil and Water Conservation District ","Various news articles dating from the 1990-1999.","Delaware County Soil and Water Conservation District ",,"State Library of Iowa|Delaware County Soil and Water Conservation District ",1990-1999,"Delaware County Soil and Water Conservation District . For questions about copyright, contact the State Library of Iowa at  <a href=""http://www.statelibraryofiowa.org"">http://www.statelibraryofiowa.org</a>.","This item is protected by copyright and/or related rights. Your are free to use this Item in any way that is permitted by the copyright and related rights legislation that applies to your use. For other uses you need to obtain permission from the rights-holder(s). <a href=""http://rightsstatements.org/"">http://rightsstatements.org</a>",,pdf,eng,"Text; Document",,,,,,,,,,,,,,,,,,,,,,,,,,,,,,,,,,,,,,,,,DelawareSWCD_NewsArticles_1990s.pdf,,,,,,,,,,,,,,,,,,,,,,,,,,,,,,,,,,,,"Cliff Kuhse,Conservation Tillage,Cover Crop,CRP,Delaware County Iowa,Gary Burrack,ISU Big Spring Basin Project,Low In-put Sustainable Agriculture LISA,Mike Strohm,No Till Planter,Roger Koster,Soil and Water Conservation,Wetlands",https://www.iowaheritage.org/files/original/955f8766714edc2a9cfb67e7d4041392.pdf,Document,"Delaware County Soil and Water Conservation District Historical Collection",1,0
97873,https://www.iowaheritage.org/items/show/97873,"News articles with no date.","Delaware County Soil and Water Conservation District ","Various news articles with no date.","Delaware County Soil and Water Conservation District ",,"State Library of Iowa|Delaware County Soil and Water Conservation District ","Unknown ","Delaware County Soil and Water Conservation District . For questions about copyright, contact the State Library of Iowa at  <a href=""http://www.statelibraryofiowa.org"">http://www.statelibraryofiowa.org</a>.","This item is protected by copyright and/or related rights. Your are free to use this Item in any way that is permitted by the copyright and related rights legislation that applies to your use. For other uses you need to obtain permission from the rights-holder(s). <a href=""http://rightsstatements.org/"">http://rightsstatements.org</a>",,pdf,eng,"Text; Document",,,,,,,,,,,,,,,,,,,,,,,,,,,,,,,,,,,,,,,,,DelawareSWCD_NewsArticles_NoDate.pdf,,,,,,,,,,,,,,,,,,,,,,,,,,,,,,,,,,,,"Albin Pape,Cecilia Biswell,Conservation Awards,Conservation Reserve Program,Contour Farming,Dan Cocking,Dennis Hunt,Don Eibey,Don Skinner,Dwight Hettinger,Erosion,Gary Hilby,Henry and Deloris Brunsman,Iowa Rivers Basin Study,Joan Wickman,Karen and Lynn Brunsman,Kathy Winter,Keith Hunt,Kermith Huehn,Kevin Winter,Linda Engelken,Lonnie Hentges,Matt Kolbert,Maurice Minor,Michael Gudenkauf,Paul Burson,Paul Kramer,Poster Contest,Randy Hilby,Robert Hall,Scott Lammers,Seedlings to Schools,Soil Stewardship,Teacher Awards,Teachers Workshop,Tim Manternach,Tom Gibbs,Tom Maternach,Verne Hermann,Virgil Webster,Wes Lane,Wetlands,Willian Diamond",https://www.iowaheritage.org/files/original/ba685a3f41335e93c72c10d20380c147.pdf,Document,"Delaware County Soil and Water Conservation District Historical Collection",1,0
97881,https://www.iowaheritage.org/items/show/97881,"News articles from the 1980's.","Warren County Soil and Water Conservation District ","Various news articles dating from the 1980-1989.","Warren County Soil and Water Conservation District ",,"State Library of Iowa|Warren County Soil and Water Conservation District ",1980-1989,"Warren County Soil and Water Conservation District. For questions about copyright, contact the State Library of Iowa at  <a href=""http://www.statelibraryofiowa.org"">http://www.statelibraryofiowa.org</a>.","This item is protected by copyright and/or related rights. Your are free to use this Item in any way that is permitted by the copyright and related rights legislation that applies to your use. For other uses you need to obtain permission from the rights-holder(s). <a href=""http://rightsstatements.org/"">http://rightsstatements.org</a>",,pdf,eng,Document,,,,,,,,,,,,,,,,,,,,,,,,,,,,,,,,,,,,,,,,,,,,,,,,,,,,,,,,,,,,,,,,,,,,,,,,,,,,,"Ardene Downing,Arlan Becker,Arlie Tillotson Farm,Barb Overton,Barbie Wachter,Bart Brummer,Ben Kern,Beverly Dickerson,Bill Schnelle,Bob Downing,Bob R. Turner,Bud Butler,Bumper Stickers,Buzz Malone,Canh Hua,Carpenter Trust Farm,Charles Ginter,Charles Laverty,Chris Mowen,Cindy Brummer,Cody Brummer,Conservation Achievement Award,Conservation Field Day,Conservation Reserve Program,Conservation Tillage,Dale Faulkner,Daniel Bender,Darrell Goodhue,Dillon Brummer,Diversion,Donna Warren,Dora Guffey,Elaine Brown,Erosion Control,Essay Contest,Fairgrounds,Farm Pond,Flooding,FmHA,Friends of Agriculture,Garrett Davey,George Fischer,Gladys Black,Goodyear Conservation Award Program,Harold Brown,Heavy Rains,Henry Staubus,Jane Sereg,Jerome Dittmer,Joe Narigon,John McKee,Ken Kester,Kent Ruble,Kevin Graham,Lacona Iowa,Leslie Blake,Lisa Shehane,Mark Nation,Marvin Kester,Marvin Mahr,Men's Garden Club,Mike Fink,No Till,No Till Tour,No-interest Loans,Paul Rogalla,Pete Grissom,Photo Contest,Rachael Goodhue,Rasalie Gillespie,Ray Higgins,Ray Pehrson,Red Rock Group,Richard Davitt,Rick McGeough,Ridiculous Day Parade,Robert Fridley,Robert Morrison,Roger Kester,Roseanna Dittmer,Runoff,Rye Cover,Scholarship,Scott Mitchell,Seth Brummer,Silt Deposit,Slough Bill,Soil and Water Conservation,Soil Stewardship Week,Speech Contest,Stacie Van Wyk,Steve McCall,Swampbuster,Switchgrass,Tad Walles,Teacher Awards,Thomas Gillespie,Tom Hanks,Tom Harkin,Tom Klimowski,Tom Oswald,Tree Program,Warren County,Wendy Penick,Weston Brummer,Wetlands,Wildlife Week,Zach Brummer",https://www.iowaheritage.org/files/original/93a88458727314cca92f4f3aad5aa3ec.pdf,Document,"Warren County Soil and Water Conservation District Historical Collection",1,0
97883,https://www.iowaheritage.org/items/show/97883,"News articles from the 2000's.","Warren County Soil and Water Conservation District ","Various news articles dating from the 2000-2011.","Warren County Soil and Water Conservation District ",,"State Library of Iowa|Warren County Soil and Water Conservation District ",2000-2011,"Warren County Soil and Water Conservation District. For questions about copyright, contact the State Library of Iowa at  <a href=""http://www.statelibraryofiowa.org"">http://www.statelibraryofiowa.org</a>.","This item is protected by copyright and/or related rights. Your are free to use this Item in any way that is permitted by the copyright and related rights legislation that applies to your use. For other uses you need to obtain permission from the rights-holder(s). <a href=""http://rightsstatements.org/"">http://rightsstatements.org</a>",,pdf,eng,Document,,,,,,,,,,,,,,,,,,,,,,,,,,,,,,,,,,,,,,,,,,,,,,,,,,,,,,,,,,,,,,,,,,,,,,,,,,,,,"Ahquabi State Park,Biking Trail,Bobcat,Colin Shaul,Conservation Tillage,Dale Faulkner,Dianna Krejsa,Emma Niedermayer,Gift of Trees,Indianola Iowa,Insecticide,Kevin Ball,Lacona Iowa,Levi Ohnemus,Penick Hog Farm,Poster Contest,Raccoon River Trail,Richard Currier,Riparian,Scholarship,Soil and Water Conservation,Steve Currier,Stewardship Week,Summerset Trail,Urban Resources & Borderland Alliance Network,Warren County,Wetlands",https://www.iowaheritage.org/files/original/7a4201d7b0c7fd4c825120387e6410a2.pdf,Document,"Warren County Soil and Water Conservation District Historical Collection",1,0
97884,https://www.iowaheritage.org/items/show/97884,"News articles with no date.","Warren County Soil and Water Conservation District ","Various news articles with no date.","Warren County Soil and Water Conservation District ",,"State Library of Iowa|Warren County Soil and Water Conservation District ","Unknown ","Warren County Soil and Water Conservation District. For questions about copyright, contact the State Library of Iowa at  <a href=""http://www.statelibraryofiowa.org"">http://www.statelibraryofiowa.org</a>.","This item is protected by copyright and/or related rights. Your are free to use this Item in any way that is permitted by the copyright and related rights legislation that applies to your use. For other uses you need to obtain permission from the rights-holder(s). <a href=""http://rightsstatements.org/"">http://rightsstatements.org</a>",,pdf,eng,Document,,,,,,,,,,,,,,,,,,,,,,,,,,,,,,,,,,,,,,,,,,,,,,,,,,,,,,,,,,,,,,,,,,,,,,,,,,,,,"Antique Tools,Austin Keeney,Ben Kern,Bicentennial Exhibit,Carlisle Iowa,Compliance Plan,Conservation Plan,Crop Residue,Dean VanderLinden,Dick Kerr,Dr. Minoru Amemiya,Farm Survey,Field Day,Flooding,Georgia Voysey,Harold Amos,Henry Staubus,Indianola Iowa,Jim Davies,Kenneth Hatcher,Lake Ahquabi,Lester Davison,Lifetime Honorary Membership,Lisa Niedermayer,Maury Goode,Middle River,Mike Finck,Mildred Amos,Myron Criswell,Narrow Based Terraces,Nathan Naberhaus,No Till Crop,Oat Exemption,Plow,Poster Contest,Rients Terpstra,Robert Morrison,Save Your Leaves,Sodbusters,Soil and Water Conservation,Terrace,Terry Branstad,Tillage,Volunteer of the Year,Warren County,Water Quality,Wetlands,World Hunger Bar-B-Que",https://www.iowaheritage.org/files/original/835dbf597c013e9a3ec2186c7bc21f99.pdf,Document,"Warren County Soil and Water Conservation District Historical Collection",1,0
97984,https://www.iowaheritage.org/items/show/97984,"Annual Report, 1994","Annual Report - Fayette County Soil and Water Conservation District|Glovers Creek Watershed","Fayette County Soil and Water Conservation District annual report. Report features district activities, conservation award winners, fiscal report, cost-share report, and district related photographs of staff and commissioners. ","Fayette County Soil and Water Conservation District ",,"State Library of Iowa",1994-1995,"Fayette County Soil and Water Conservation District of Iowa. For questions about copyright, contact the State Library of Iowa at  <a href=""http://www.statelibraryofiowa.org"">http://www.statelibraryofiowa.org</a>.","This item is protected by copyright and/or related rights. Your are free to use this Item in any way that is permitted by the copyright and related rights legislation that applies to your use. For other uses you need to obtain permission from the rights-holder(s). <a href=""http://rightsstatements.org/"">http://rightsstatements.org</a>",,pdf,eng,"Text: Newspaper",,,,,,,,,,,,,,,,,,,,,,,,,,,,,,,,,,,,,,,,,Annual_Report_1994,,,,,,,,,,,,,,,,,,,,,,,,,,,,,,,,,,,,"Alan Crowe,Annual Report - Fayette County Soil and Water Conservation District,Becky Cowell,Bill Bennett,Buffer Strips,Carl Nus,Dawn DeVore,Don Ungerer,Forestry,Glovers Creek Watershed,Jerry Muff,John McMillan,Julie McCready,Ken Baker,Larry Reiling,LaVonne Koch,Leroy Brown,Lori Kohlmeyer,No Till,Pasture,Paul Nuss,Richard Jensen,Richard Menne,Roger Gamm,Strip Cropping,Terraces,Wallaces Farmer,Wetlands,William Stanley,Zone Tillage",https://www.iowaheritage.org/files/original/5954584b54c1d1db318fbb38c95abe8b.pdf,Document,"Fayette County Soil and Water Conservation District Historic Collection",1,0
