 




﻿"Item Id","Item URI","Dublin Core:Title","Dublin Core:Subject","Dublin Core:Description","Dublin Core:Creator","Dublin Core:Source","Dublin Core:Publisher","Dublin Core:Date","Dublin Core:Contributor","Dublin Core:Rights","Dublin Core:Relation","Dublin Core:Format","Dublin Core:Language","Dublin Core:Type","Dublin Core:Identifier","Dublin Core:Coverage","Item Type Metadata:Text","Item Type Metadata:Interviewer","Item Type Metadata:Interviewee","Item Type Metadata:Location","Item Type Metadata:Transcription","Item Type Metadata:Local URL","Item Type Metadata:Original Format","Item Type Metadata:Physical Dimensions","Item Type Metadata:Duration","Item Type Metadata:Compression","Item Type Metadata:Producer","Item Type Metadata:Director","Item Type Metadata:Bit Rate/Frequency","Item Type Metadata:Time Summary","Item Type Metadata:Email Body","Item Type Metadata:Subject Line","Item Type Metadata:From","Item Type Metadata:To","Item Type Metadata:CC","Item Type Metadata:BCC","Item Type Metadata:Number of Attachments","Item Type Metadata:Standards","Item Type Metadata:Objectives","Item Type Metadata:Materials","Item Type Metadata:Lesson Plan Text","Item Type Metadata:URL","Item Type Metadata:Event Type","Item Type Metadata:Participants","Item Type Metadata:Birth Date","Item Type Metadata:Birthplace","Item Type Metadata:Death Date","Item Type Metadata:Occupation","Item Type Metadata:Biographical Text","Item Type Metadata:Bibliography","Item Type Metadata:Digital Reproduction Information","Item Type Metadata:Repository","Item Type Metadata:Repository Collection","Item Type Metadata:Contact information.","Item Type Metadata:File Name","Item Type Metadata:Notes","Item Type Metadata:Digital item created","Item Type Metadata:Digital item modified","Item Type Metadata:Executive Orders","Item Type Metadata:Record Created","Item Type Metadata:Record Modified","Item Type Metadata:Transcription2","Item Type Metadata:Source URL","Omeka Legacy File:Additional Creator","Omeka Legacy File:Transcriber","Omeka Legacy File:Producer","Omeka Legacy File:Render Device","Omeka Legacy File:Render Details","Omeka Legacy File:Capture Date","Omeka Legacy File:Capture Device","Omeka Legacy File:Capture Details","Omeka Legacy File:Change History","Omeka Legacy File:Watermark","Omeka Legacy File:Encryption","Omeka Legacy File:Compression","Omeka Legacy File:Post Processing","Omeka Image File:Width","Omeka Image File:Height","Omeka Image File:Bit Depth","Omeka Image File:Channels","Omeka Image File:Exif String","Omeka Image File:Exif Array","Omeka Image File:IPTC String","Omeka Image File:IPTC Array","Omeka Video File:Bitrate","Omeka Video File:Duration","Omeka Video File:Sample Rate","Omeka Video File:Codec","Omeka Video File:Width","Omeka Video File:Height",tags,file,itemType,collection,public,featured
16926,https://www.iowaheritage.org/items/show/16926,"Waterwheel, China, 1944",Waterwheels|China|1940-1950|Rivers,,unidentified,,"University of Iowa. Libraries. Special Collections Dept.",1944|2004-08-27,,"Educational use only, no other permissions given. U.S. and international copyright laws may protect this item. Commercial use or distribution of this digital object is not permitted without written permission of the University of Iowa Special Collections Dept.","Henry A. Wallace Collection|Henry Agard Wallace papers|http://lib.uiowa.edu/collguides/?MSC0177|Photographs & images|Scanned with Ricoh 3228C scanner at 600 ppi. Archival tiff available.",jpeg,,"Still image|Photographs",MSC0177|1|wal73cd-29.jpg|https://digital.lib.uiowa.edu/,,,,,,,,,,,,,,,,,,,,,,,,,,,,,,,,,,,,,,,,,,,,,,,,"<a href=""https://digital.lib.uiowa.edu/"" target=""_blank"">View this item in its source respository</a>",,,,,,,,,,,,,,,,,,,,,,,,,,,,,https://www.iowaheritage.org/files/original/ee474428579addf711eece78125a5800.jpg,"Remote Item","Henry A. Wallace Collection",1,0
16754,https://www.iowaheritage.org/items/show/16754,"Waterwheel, China, 1944",Waterwheels|China|1940-1950|Forests,,unidentified,,"University of Iowa. Libraries. Special Collections Dept.",1944|2009-02-18,,"Educational use only, no other permissions given. U.S. and international copyright laws may protect this item. Commercial use or distribution of this digital object is not permitted without written permission of the University of Iowa Special Collections Dept.","Henry A. Wallace Collection|Henry Agard Wallace papers|http://lib.uiowa.edu/collguides/?MSC0177|Photographs & images|China-Siberia Trip, 1944|Scanned with Ricoh 3228C scanner at 600 ppi. Archival tiff available.",jpeg,,"Still image|Photographs",MSC0177|7|100|wal73-100.jpg|https://digital.lib.uiowa.edu/,,,,,,,,,,,,,,,,,,,,,,,,,,,,,,,,,,,,,,,,,,,,,,,,"<a href=""https://digital.lib.uiowa.edu/"" target=""_blank"">View this item in its source respository</a>",,,,,,,,,,,,,,,,,,,,,,,,,,,,,https://www.iowaheritage.org/files/original/b0eab484370869b32095b3cca67bf6c3.jpg,"Remote Item","Henry A. Wallace Collection",1,0
16914,https://www.iowaheritage.org/items/show/16914,"Water wheel, China, 1944","Bodies of water|China|1940-1950|Waterwheels",,unidentified,,"University of Iowa. Libraries. Special Collections Dept.",1944|2004-08-27,,"Educational use only, no other permissions given. U.S. and international copyright laws may protect this item. Commercial use or distribution of this digital object is not permitted without written permission of the University of Iowa Special Collections Dept.","Henry A. Wallace Collection|Henry Agard Wallace papers|http://lib.uiowa.edu/collguides/?MSC0177|Photographs & images|Scanned with Ricoh 3228C scanner at 600 ppi. Archival tiff available.",jpeg,,"Still image|Photographs",MSC0177|1|wal73cd-23.jpg|https://digital.lib.uiowa.edu/,,,,,,,,,,,,,,,,,,,,,,,,,,,,,,,,,,,,,,,,,,,,,,,,"<a href=""https://digital.lib.uiowa.edu/"" target=""_blank"">View this item in its source respository</a>",,,,,,,,,,,,,,,,,,,,,,,,,,,,,https://www.iowaheritage.org/files/original/03cc5b78c6ccfb66e57dc31a16af4235.jpg,"Remote Item","Henry A. Wallace Collection",1,0
16633,https://www.iowaheritage.org/items/show/16633,"Water wheel, China, 1944",Rivers|China|1940-1950|Waterwheels,"For irrigation.",unidentified,,"University of Iowa. Libraries. Special Collections Dept.",1944|2009-02-18,,"Educational use only, no other permissions given. U.S. and international copyright laws may protect this item. Commercial use or distribution of this digital object is not permitted without written permission of the University of Iowa Special Collections Dept.","Henry A. Wallace Collection|Henry Agard Wallace papers|http://lib.uiowa.edu/collguides/?MSC0177|Photographs & images|China-Siberia Trip, 1944|Scanned with Ricoh 3228C scanner at 600 ppi. Archival tiff available.",jpeg,,"Still image|Photographs",MSC0177|7|32|wal73-032.jpg|https://digital.lib.uiowa.edu/,,,,,,,,,,,,,,,,,,,,,,,,,,,,,,,,,,,,,,,,,,,,,,,,"<a href=""https://digital.lib.uiowa.edu/"" target=""_blank"">View this item in its source respository</a>",,,,,,,,,,,,,,,,,,,,,,,,,,,,,https://www.iowaheritage.org/files/original/3720e5e120f4bb0f848653110908cade.jpg,"Remote Item","Henry A. Wallace Collection",1,0
17185,https://www.iowaheritage.org/items/show/17185,"Water wheel and small shed, Grande Prairie, Canada, 1944","Waterwheels|Canada -- Alberta -- Grande Prairie|1940-1950|Huts",,unidentified,,"University of Iowa. Libraries. Special Collections Dept.",1944|2009-02-16,,"Educational use only, no other permissions given. U.S. and international copyright laws may protect this item. Commercial use or distribution of this digital object is not permitted without written permission of the University of Iowa Special Collections Dept.","Henry A. Wallace Collection|Henry Agard Wallace papers|http://lib.uiowa.edu/collguides/?MSC0177|Photographs & images|China-Siberia Trip, 1944|Scanned with Ricoh 3228C scanner at 600 ppi. Archival tiff available.",jpeg,,"Still image|Photographs",MSC0177|7|wal73sa-062.jpg|https://digital.lib.uiowa.edu/,,,,,,,,,,,,,,,,,,,,,,,,,,,,,,,,,,,,,,,,,,,,,,,,"<a href=""https://digital.lib.uiowa.edu/"" target=""_blank"">View this item in its source respository</a>",,,,,,,,,,,,,,,,,,,,,,,,,,,,,https://www.iowaheritage.org/files/original/424b1a0c8ed81d422fcc478c449c8ad1.jpg,"Remote Item","Henry A. Wallace Collection",1,0
17071,https://www.iowaheritage.org/items/show/17071,"War-wrecked German tanks turned scrap metal, Siberia, 1944","Tanks (Military science)|Americans|Russia -- Siberia -- Komsomolsk|1940-1950|Metals|Junkyards|Russians",,unidentified,,"University of Iowa. Libraries. Special Collections Dept.",1944|2009-02-20,,"Educational use only, no other permissions given. U.S. and international copyright laws may protect this item. Commercial use or distribution of this digital object is not permitted without written permission of the University of Iowa Special Collections Dept.","Henry A. Wallace Collection|Henry Agard Wallace papers|http://lib.uiowa.edu/collguides/?MSC0177|Photographs & images|China-Siberia Trip, 1944|Scanned with Ricoh 3228C scanner at 600 ppi. Archival tiff available.",jpeg,,"Still image; Text|Photographs",MSC0177|7|wal73sa-021.jpg|https://digital.lib.uiowa.edu/,,,,,,,,,,,,,,,,,,,,,,,,,,,,,,,,,,,,,,,,,,,,,,,,"<a href=""https://digital.lib.uiowa.edu/"" target=""_blank"">View this item in its source respository</a>",,,,,,,,,,,,,,,,,,,,,,,,,,,,,https://www.iowaheritage.org/files/original/8bef08519e0052129be887b339e19223.jpg,"Remote Item","Henry A. Wallace Collection",1,0
16543,https://www.iowaheritage.org/items/show/16543,"Wallace papers index. Volume 2|The Wallace papers : an index to the microfilm editions of the Henry A. Wallace papers in the University of Iowa Libraries, the Library of Congress, and the Franklin D. Roosevelt Library / Earl M. Rogers, editor ; Leslie W. Dunlap, project director","Wallace, Henry Agard, 1888-1965 -- Archives|Documents on microfilm -- Indexes",,"Wallace, Henry Agard, 1888-1965; Rogers, Earl M; Dunlap, Leslie W. (Leslie Whittaker), 1911-",,"The University of Iowa Libraries|University of Iowa. Libraries. Special Collections",1975|2007-01-19,,"For The University of Iowa Libraries policy on Copyright Protection, see http://www.lib.uiowa.edu/spec-coll/help/copyright.html","Henry A. Wallace Collection|Henry A. Wallace Papers Index|Scanned with Ricoh 3228C scanner with Automatic Document Feeder. Bitonal TIFF, 300 ppi.","viii, 448 p ; 29 cm",,Text,"Main Reference Collection FOLIO Z6616.W27 I63. InfoHawk system number: 000926669|https://digital.lib.uiowa.edu/",,,,,,,,,,,,,,,,,,,,,,,,,,,,,,,,,,,,,,,,,,,,,,,,"<a href=""https://digital.lib.uiowa.edu/"" target=""_blank"">View this item in its source respository</a>",,,,,,,,,,,,,,,,,,,,,,,,,,,,,https://www.iowaheritage.org/files/original/fe42d65a5a7cbf3d06d7f11228020554.jpg,"Remote Item","Henry A. Wallace Collection",1,0
16541,https://www.iowaheritage.org/items/show/16541,"Wallace papers index. Volume 1|The Wallace papers : an index to the microfilm editions of the Henry A. Wallace papers in the University of Iowa Libraries, the Library of Congress, and the Franklin D. Roosevelt Library / Earl M. Rogers, editor ; Leslie W. Dunlap, project director","Wallace, Henry Agard, 1888-1965 -- Archives|Documents on microfilm -- Indexes",,"Wallace, Henry Agard, 1888-1965; Rogers, Earl M; Dunlap, Leslie W. (Leslie Whittaker), 1911-",,"The University of Iowa Libraries|University of Iowa. Libraries. Special Collections",1975|2007-01-19,,"For The University of Iowa Libraries policy on Copyright Protection, see http://www.lib.uiowa.edu/spec-coll/help/copyright.html","Henry A. Wallace Collection|Henry A. Wallace Papers Index|Scanned with Ricoh 3228C scanner with Automatic Document Feeder. Bitonal TIFF, 300 ppi.","xii, 448 p ; 29 cm",,Text,"Main Reference Collection FOLIO Z6616.W27 I63. InfoHawk system number: 000926669|https://digital.lib.uiowa.edu/",,,,,,,,,,,,,,,,,,,,,,,,,,,,,,,,,,,,,,,,,,,,,,,,"<a href=""https://digital.lib.uiowa.edu/"" target=""_blank"">View this item in its source respository</a>",,,,,,,,,,,,,,,,,,,,,,,,,,,,,https://www.iowaheritage.org/files/original/ce72846b9417b56c4dc4916653ec4e9c.jpg,"Remote Item","Henry A. Wallace Collection",1,0
17521,https://www.iowaheritage.org/items/show/17521,"Wallace gets the lowdown, Chicago, Ill., July 15, 1940","Spouses|Wallace, Henry A. (Henry Agard), 1888-1965|United States -- Illinois -- Chicago|1940-1950|Legislators|Cabinet officers|Conversation|Barkley, Alben William, 1877-1956|Barkley, Dorothy Brower",,unidentified,,"University of Iowa. Libraries. Special Collections Dept.",1940-07-15|2010-02-01,,"Educational use only, no other permissions given. U.S. and international copyright laws may protect this item. Commercial use or distribution of this digital object is not permitted without written permission of the University of Iowa Special Collections Dept.","Henry A. Wallace Collection|Henry Agard Wallace papers|http://lib.uiowa.edu/collguides/?MSC0177|Photographs & images|Press Photographs - 7 x 9s|Scanned with Ricoh 3228C scanner at 300 ppi. Archival tiff available.",jpeg,,"Still image|Photographs",MSC0177|7|12|wal-032.jpg|https://digital.lib.uiowa.edu/,,,,,,,,,,,,,,,,,,,,,,,,,,,,,,,,,,,,,,,,,,,,,,,,"<a href=""https://digital.lib.uiowa.edu/"" target=""_blank"">View this item in its source respository</a>",,,,,,,,,,,,,,,,,,,,,,,,,,,,,https://www.iowaheritage.org/files/original/7eb55e438414da50e658fd0e7fa8e4f6.jpg,"Remote Item","Henry A. Wallace Collection",1,0
16920,https://www.iowaheritage.org/items/show/16920,"Village, China, 1944","Cities & towns|Chinese|China|1940-1950",,unidentified,,"University of Iowa. Libraries. Special Collections Dept.",1944|2004-08-27,,"Educational use only, no other permissions given. U.S. and international copyright laws may protect this item. Commercial use or distribution of this digital object is not permitted without written permission of the University of Iowa Special Collections Dept.","Henry A. Wallace Collection|Henry Agard Wallace papers|http://lib.uiowa.edu/collguides/?MSC0177|Photographs & images|Scanned with Ricoh 3228C scanner at 600 ppi. Archival tiff available.",jpeg,,"Still image|Photographs",MSC0177|1|wal73cd-26.jpg|https://digital.lib.uiowa.edu/,,,,,,,,,,,,,,,,,,,,,,,,,,,,,,,,,,,,,,,,,,,,,,,,"<a href=""https://digital.lib.uiowa.edu/"" target=""_blank"">View this item in its source respository</a>",,,,,,,,,,,,,,,,,,,,,,,,,,,,,https://www.iowaheritage.org/files/original/e6ea6697ddb9bce532d9fb6a33ea2c9b.jpg,"Remote Item","Henry A. Wallace Collection",1,0
