 




﻿"Item Id","Item URI","Dublin Core:Title","Dublin Core:Subject","Dublin Core:Description","Dublin Core:Creator","Dublin Core:Source","Dublin Core:Publisher","Dublin Core:Date","Dublin Core:Contributor","Dublin Core:Rights","Dublin Core:Relation","Dublin Core:Format","Dublin Core:Language","Dublin Core:Type","Dublin Core:Identifier","Dublin Core:Coverage","Item Type Metadata:Text","Item Type Metadata:Interviewer","Item Type Metadata:Interviewee","Item Type Metadata:Location","Item Type Metadata:Transcription","Item Type Metadata:Local URL","Item Type Metadata:Original Format","Item Type Metadata:Physical Dimensions","Item Type Metadata:Duration","Item Type Metadata:Compression","Item Type Metadata:Producer","Item Type Metadata:Director","Item Type Metadata:Bit Rate/Frequency","Item Type Metadata:Time Summary","Item Type Metadata:Email Body","Item Type Metadata:Subject Line","Item Type Metadata:From","Item Type Metadata:To","Item Type Metadata:CC","Item Type Metadata:BCC","Item Type Metadata:Number of Attachments","Item Type Metadata:Standards","Item Type Metadata:Objectives","Item Type Metadata:Materials","Item Type Metadata:Lesson Plan Text","Item Type Metadata:URL","Item Type Metadata:Event Type","Item Type Metadata:Participants","Item Type Metadata:Birth Date","Item Type Metadata:Birthplace","Item Type Metadata:Death Date","Item Type Metadata:Occupation","Item Type Metadata:Biographical Text","Item Type Metadata:Bibliography","Item Type Metadata:Digital Reproduction Information","Item Type Metadata:Repository","Item Type Metadata:Repository Collection","Item Type Metadata:Contact information.","Item Type Metadata:File Name","Item Type Metadata:Notes","Item Type Metadata:Digital item created","Item Type Metadata:Digital item modified","Item Type Metadata:Executive Orders","Item Type Metadata:Record Created","Item Type Metadata:Record Modified","Item Type Metadata:Transcription2","Item Type Metadata:Source URL","Omeka Legacy File:Additional Creator","Omeka Legacy File:Transcriber","Omeka Legacy File:Producer","Omeka Legacy File:Render Device","Omeka Legacy File:Render Details","Omeka Legacy File:Capture Date","Omeka Legacy File:Capture Device","Omeka Legacy File:Capture Details","Omeka Legacy File:Change History","Omeka Legacy File:Watermark","Omeka Legacy File:Encryption","Omeka Legacy File:Compression","Omeka Legacy File:Post Processing","Omeka Image File:Width","Omeka Image File:Height","Omeka Image File:Bit Depth","Omeka Image File:Channels","Omeka Image File:Exif String","Omeka Image File:Exif Array","Omeka Image File:IPTC String","Omeka Image File:IPTC Array","Omeka Video File:Bitrate","Omeka Video File:Duration","Omeka Video File:Sample Rate","Omeka Video File:Codec","Omeka Video File:Width","Omeka Video File:Height",tags,file,itemType,collection,public,featured
99351,https://www.iowaheritage.org/items/show/99351,"Alvin Petersen waterway under construction, 1967","Jackson County Soil and Water Conservation District|Waterway|Alvin Petersen","B&W photograph of Alvin Petersen standing in area of a future waterway.","USDA Soil Conservation Service",,"State Library of Iowa",1967,"Jackson County Soil and Water Conservation District of Iowa. For questions about copyright, contact the State Library of Iowa at  <a href=""http://www.statelibraryofiowa.org"">http://www.statelibraryofiowa.org</a>.","This item is protected by copyright and/or related rights. Your are free to use this Item in any way that is permitted by the copyright and related rights legislation that applies to your use. For other uses you need to obtain permission from the rights-holder(s). <a href=""http://rightsstatements.org/"">http://rightsstatements.org</a>",,jpg,,"Still Image; Photograph",,,,,,,,,,,,,,,,,,,,,,,,,,,,,,,,,,,,,,,,,Jackson_1967_Alvin_Petersen_Waterway_Under_Construction_001|Jackson_1967_Alvin_Petersen_Waterway_Under_Construction_002,,,,,,,,,,,,,,,,,,,,,,,,,,,,,,,,,,,,"Alvin Petersen,Jackson County Soil and Water Conservation District,Waterway","https://www.iowaheritage.org/files/original/56d56003568e53b75a63a341e6ccb08f.jpg,https://www.iowaheritage.org/files/original/63d08e1bfa24def83d0dc7e99c3cc974.jpg","Still Image","Jackson County Soil and Water Conservation District Historic Collection",1,0
99350,https://www.iowaheritage.org/items/show/99350,"Flood detention dam and waterway, 1966","Jackson County Soil and Water Conservation District|Flood Control|Waterway","B&W photograph of John Kramer standing near flood detention dam and waterway after removal of rock fragments and silt.","USDA Soil Conservation Service",,"State Library of Iowa",1966-12,"Jackson County Soil and Water Conservation District of Iowa. For questions about copyright, contact the State Library of Iowa at  <a href=""http://www.statelibraryofiowa.org"">http://www.statelibraryofiowa.org</a>.","This item is protected by copyright and/or related rights. Your are free to use this Item in any way that is permitted by the copyright and related rights legislation that applies to your use. For other uses you need to obtain permission from the rights-holder(s). <a href=""http://rightsstatements.org/"">http://rightsstatements.org</a>",,jpg,,"Still Image; Photograph",,,,,,,,,,,,,,,,,,,,,,,,,,,,,,,,,,,,,,,,,Jackson_1966_John_Kramer_Flood_Detention_Dam_&_Waterway_2_20191217_001|Jackson_1966_John_Kramer_Flood_Detention_Dam_&_Waterway_2_20191217_002|Jackson_1966_John_Kramer_Flood_Detention_Dam_&_Waterway_3_20191217_001|Jackson_1966_John_Kramer_Flood_Detention_Dam_&_Waterway_3_20191217_002,,,,,,,,,,,,,,,,,,,,,,,,,,,,,,,,,,,,"Flood Control,Flood Detention Dam,Jackson County Soil and Water Conservation District,John Kramer,Waterway","https://www.iowaheritage.org/files/original/d1fadba9cb18e1354813488879c6e59e.jpg,https://www.iowaheritage.org/files/original/6f54bc8f25d800a104139c00d25b4559.jpg","Still Image","Jackson County Soil and Water Conservation District Historic Collection",1,0
99349,https://www.iowaheritage.org/items/show/99349,"Outlet pipe of earth dam, 1966","Jackson County Soil and Water Conservation District|Outlet Pipe|Earth Dam","B&W photograph of Harold Wilms and Chas. Kurt view outlet pipe of earth dam on Wilms land.","USDA Soil Conservation Service",,"State Library of Iowa",1966-10,"Jackson County Soil and Water Conservation District of Iowa. For questions about copyright, contact the State Library of Iowa at  <a href=""http://www.statelibraryofiowa.org"">http://www.statelibraryofiowa.org</a>.","This item is protected by copyright and/or related rights. Your are free to use this Item in any way that is permitted by the copyright and related rights legislation that applies to your use. For other uses you need to obtain permission from the rights-holder(s). <a href=""http://rightsstatements.org/"">http://rightsstatements.org</a>",,jpg,,"Still Image; Photograph",,,,,,,,,,,,,,,,,,,,,,,,,,,,,,,,,,,,,,,,,Jackson_1966_charles_Kurt_with_SCD_Commissioner_Harold_Wilms_Lt_001|Jackson_1966_charles_Kurt_with_SCD_Commissioner_Harold_Wilms_Lt_002|Jackson_1966_Harold_Wilms_SCD_Commissioner_On_Lt_&_Charles_Kurt_001|Jackson_1966_Harold_Wilms_SCD_Commissioner_On_Lt_&_Charles_Kurt_002,,,,,,,,,,,,,,,,,,,,,,,,,,,,,,,,,,,,"Chas. Kurt,Earth Dam,Harold Wilms,Jackson County Soil and Water Conservation District,Outlet Pipe","https://www.iowaheritage.org/files/original/ee31aa29559362d64245dd5a1a6fd4fb.jpg,https://www.iowaheritage.org/files/original/e345f6b6433ee6acf23430479b65d766.jpg","Still Image","Jackson County Soil and Water Conservation District Historic Collection",1,0
99348,https://www.iowaheritage.org/items/show/99348,"Vincent Nemmers road culvert, 1965","Jackson County Soil and Water Conservation District|Road Culvert|Vincent Nemmers","B&W photograph of Vincent Nemmers and unidentified person standing near a concrete road culvert below an active gully.","USDA Soil Conservation Service",,"State Library of Iowa",1965,"Jackson County Soil and Water Conservation District of Iowa. For questions about copyright, contact the State Library of Iowa at  <a href=""http://www.statelibraryofiowa.org"">http://www.statelibraryofiowa.org</a>.","This item is protected by copyright and/or related rights. Your are free to use this Item in any way that is permitted by the copyright and related rights legislation that applies to your use. For other uses you need to obtain permission from the rights-holder(s). <a href=""http://rightsstatements.org/"">http://rightsstatements.org</a>",,jpg,,"Still Image; Photograph",,,,,,,,,,,,,,,,,,,,,,,,,,,,,,,,,,,,,,,,,Jackson_1965_Vincent_Nemmers_Road_Culvert_Below_Active_Gully_001|Jackson_1965_Vincent_Nemmers_Road_Culvert_Below_Active_Gully_002,,,,,,,,,,,,,,,,,,,,,,,,,,,,,,,,,,,,"Gully,Jackson County Soil and Water Conservation District,Road Culvert,Vincent Nemmers","https://www.iowaheritage.org/files/original/d84086007a20c5f9df67d4d7998434ad.jpg,https://www.iowaheritage.org/files/original/cffbc4c6fb9bb34a03c2587bfadafe18.jpg","Still Image","Jackson County Soil and Water Conservation District Historic Collection",1,0
99334,https://www.iowaheritage.org/items/show/99334,"Albert Knake farm at various stages of conservation construction, 1965","Jackson County Soil and Water Conservation District|Erosion Control|Albert Knake","B&W photographs of Albert Knake farm at various stages of conservation construction. One photograph features a pipe running through land. (7)","USDA Soil Conservation Service",,"State Library of Iowa",1965,"Jackson County Soil and Water Conservation District of Iowa. For questions about copyright, contact the State Library of Iowa at  <a href=""http://www.statelibraryofiowa.org"">http://www.statelibraryofiowa.org</a>.","This item is protected by copyright and/or related rights. Your are free to use this Item in any way that is permitted by the copyright and related rights legislation that applies to your use. For other uses you need to obtain permission from the rights-holder(s). <a href=""http://rightsstatements.org/"">http://rightsstatements.org</a>",,jpg,,"Still Image; Photograph",,,,,,,,,,,,,,,,,,,,,,,,,,,,,,,,,,,,,,,,,Jackson_1965_Albert_Knake_Farm_001|Jackson_1965_Albert_Knake_Farm_2_001|Jackson_1965_Albert_Knake_Farm_2_001|Jackson_1965_Albert_Knake_Farm_Earth_Structure_No_Pipe_001,,,,,,,,,,,,,,,,,,,,,,,,,,,,,,,,,,,,"Albert Knake,Conservation Construction,Erosion Control,Jackson County Soil and Water Conservation District","https://www.iowaheritage.org/files/original/f0c2fc441431d4c4a0738a7b274a2e63.jpg,https://www.iowaheritage.org/files/original/234ce5d88307ef4678e6f03b2b52a10d.jpg,https://www.iowaheritage.org/files/original/9b94f0161ba1289df8c12c635cb498a4.jpg,https://www.iowaheritage.org/files/original/06e23f1449d0223e682fdf0fbb6da4e9.jpg,https://www.iowaheritage.org/files/original/ccf5da2f7f3654457180bec2a38bcdb3.jpg,https://www.iowaheritage.org/files/original/cf32fdac77abf68fc45d60b48d7781ae.jpg,https://www.iowaheritage.org/files/original/5186ef7bc50395d7dea9e790c0d5fa9c.jpg","Still Image","Jackson County Soil and Water Conservation District Historic Collection",1,0
99330,https://www.iowaheritage.org/items/show/99330,"Cattle grazing on Raymond Kurth farm, 1963","Jackson County Soil and Water Conservation District|Livestock|Raymond Kurth","B&W photograph of beef cattle graizing on Raymond Kurth pasture grass.","USDA Soil Conservation Service ",,"State Library of Iowa",1963,"Jackson County Soil and Water Conservation District of Iowa. For questions about copyright, contact the State Library of Iowa at  <a href=""http://www.statelibraryofiowa.org"">http://www.statelibraryofiowa.org</a>.","This item is protected by copyright and/or related rights. Your are free to use this Item in any way that is permitted by the copyright and related rights legislation that applies to your use. For other uses you need to obtain permission from the rights-holder(s). <a href=""http://rightsstatements.org/"">http://rightsstatements.org</a>",,jpg,,"Still Image; Photograph",,,,,,,,,,,,,,,,,,,,,,,,,,,,,,,,,,,,,,,,,Jackson_1963_Raymond_Kurth_Farm_20191216_001|Jackson_1963_Raymond_Kurth_Farm_20191216_002,,,,,,,,,,,,,,,,,,,,,,,,,,,,,,,,,,,,"Cattle,Jackson County Soil and Water Conservation District,Livestock,Pasture,Raymond Kurth","https://www.iowaheritage.org/files/original/652e1b003d7613b1254760b56cc15fd7.jpg,https://www.iowaheritage.org/files/original/ccd2f80c25c80a400e28dce4a6259cd1.jpg","Still Image","Jackson County Soil and Water Conservation District Historic Collection",1,0
99329,https://www.iowaheritage.org/items/show/99329,"Construction of Edward Rubel wildlife pond, 1963","Jackson County Soil and Water Conservation District|Pond|Edward Rubel","B&W photograph of two unidentified people standing in front of construction of wildlife pond on Edward Rubel land.","USDA Soil Conservation Service ",,"State Library of Iowa",1963,"Jackson County Soil and Water Conservation District of Iowa. For questions about copyright, contact the State Library of Iowa at  <a href=""http://www.statelibraryofiowa.org"">http://www.statelibraryofiowa.org</a>.","This item is protected by copyright and/or related rights. Your are free to use this Item in any way that is permitted by the copyright and related rights legislation that applies to your use. For other uses you need to obtain permission from the rights-holder(s). <a href=""http://rightsstatements.org/"">http://rightsstatements.org</a>",,jpg,,"Still Image; Photograph",,,,,,,,,,,,,,,,,,,,,,,,,,,,,,,,,,,,,,,,,Jackson_1963_Edward_Rubel_WL_Pond_001|Jackson_1963_Edward_Rubel_WL_Pond_002,,,,,,,,,,,,,,,,,,,,,,,,,,,,,,,,,,,,"Edward Rubel,Farm Pond,Jackson County Soil and Water Conservation District,Pond","https://www.iowaheritage.org/files/original/104507b21ae2d6c3bbf63241e4c66769.jpg,https://www.iowaheritage.org/files/original/2f097f8259994b3621f7d221b45938a9.jpg","Still Image","Jackson County Soil and Water Conservation District Historic Collection",1,0
99464,https://www.iowaheritage.org/items/show/99464,"Joe Gerlack Jr. strip cropping, 1963","Jackson County Soil and Water Conservation District |Joe Gerlack Jr. |Strip Cropping","B&W image of Joe Gerlack Jr. standing in a field of young corn with strips in the background. ","U.S. Soil Conservation Services ",,"State Library of Iowa",,"Jackson County Soil and Water Conservation District of Iowa. For questions about copyright, contact the State Library of Iowa <a href=""http://www.statelibraryofiowa.org"">http://www.statelibraryofiowa.org</a>.","This item is protected by copyright and/or related rights. Your are free to use this Item in any way that is permitted by the copyright and related rights legislation that applies to your use. For other uses you need to obtain permission from the rights-holder(s). <a href=""http://rightsstatements.org/"">http://rightsstatements.org</a>",,jpg,eng,"Still Image; Photograph ",,,,,,,,,,,,,,,,,,,,,,,,,,,,,,,,,,,,,,,,,Jackson_1963_Joe_Gerlack_Jr_Strip_Cropping_20191216_001|Jackson_1963_Joe_Gerlack_Jr_Strip_Cropping_20191216_002,,,,,,,,,,,,,,,,,,,,,,,,,,,,,,,,,,,,"Jackson County Soil and Water Conservation District,Joe Gerlack Jr.,Strip Cropping","https://www.iowaheritage.org/files/original/fbd1a0b54da538d9219cb70ed7400ab9.jpg,https://www.iowaheritage.org/files/original/0f4a9f85ad587bae05ba0c27ff0a2670.jpg","Still Image","Jackson County Soil and Water Conservation District Historic Collection",1,0
99463,https://www.iowaheritage.org/items/show/99463,"Chester Gray drop spillway, 1963","Jackson County Soil and Water Conservation District |Drop Spillway|Chester Gray","B&W images of drop spillway on Chester Gray's farm. (2)","U.S. Soil Conservation Services",,"State Library of Iowa",1963,"Jackson County Soil and Water Conservation District of Iowa. For questions about copyright, contact the State Library of Iowa <a href=""http://www.statelibraryofiowa.org"">http://www.statelibraryofiowa.org</a>.","This item is protected by copyright and/or related rights. Your are free to use this Item in any way that is permitted by the copyright and related rights legislation that applies to your use. For other uses you need to obtain permission from the rights-holder(s). <a href=""http://rightsstatements.org/"">http://rightsstatements.org</a>",,jpg,eng,"Still Image; Photograph ",,,,,,,,,,,,,,,,,,,,,,,,,,,,,,,,,,,,,,,,,Jackson_1963_Chester_Gray_Drop_Spillway_Dam_20191216_001|Jackson_1963_Chester_Gray_Drop_Spillway_Dam_20191216_002|Jackson_1963_Chester_Gray_Farm_20191216_001|Jackson_1963_Chester_Gray_Farm_20191216_002,,,,,,,,,,,,,,,,,,,,,,,,,,,,,,,,,,,,"Chester Gray,Drop Spillway,Jackson County Soil and Water Conservation District,Waterway","https://www.iowaheritage.org/files/original/1a2b155093338b190edaa465e1a1dca5.jpg,https://www.iowaheritage.org/files/original/35927a2dc060bbc6d64a59122b32ca63.jpg,https://www.iowaheritage.org/files/original/87af845ffe99353767fb06d6c37671cf.jpg,https://www.iowaheritage.org/files/original/99d17e954d0fe2117e8a51378b1fa948.jpg","Still Image","Jackson County Soil and Water Conservation District Historic Collection",1,0
99461,https://www.iowaheritage.org/items/show/99461,"Drop spillway on Chester Gray's land, 1962","Jackson County Soil and Water Conservation District |Chester Gray|Drop Spillway","B&W images of drop spillway on Chester Gray's land. (2)","U.S. Soil Conservation Services",,"State Library of Iowa",1962,"Jackson County Soil and Water Conservation District of Iowa. For questions about copyright, contact the State Library of Iowa <a href=""http://www.statelibraryofiowa.org"">http://www.statelibraryofiowa.org</a>.","This item is protected by copyright and/or related rights. Your are free to use this Item in any way that is permitted by the copyright and related rights legislation that applies to your use. For other uses you need to obtain permission from the rights-holder(s). <a href=""http://rightsstatements.org/"">http://rightsstatements.org</a>",,jpg,eng,"Still Image; Photograph ",,,,,,,,,,,,,,,,,,,,,,,,,,,,,,,,,,,,,,,,,Jackson_1962_Chester_Gray_Drop_Spillway_20191216_001|Jackson_1962_Chester_Gray_Drop_Spillway_20191216_002|Jackson_1962_Chester_Gray_Waterway_20191216_001|Jackson_1962_Chester_Gray_Waterway_20191216_002,,,,,,,,,,,,,,,,,,,,,,,,,,,,,,,,,,,,"Chester Gray,Jackson County Soil and Water Conservation District,Spillway,Waterway","https://www.iowaheritage.org/files/original/604b1d4f71285ba4056cb807b34bf960.jpg,https://www.iowaheritage.org/files/original/129bb4dc61e42566e95e390ac805aeb7.jpg,https://www.iowaheritage.org/files/original/dc4b227bf4ff5ef2ef7e0a0e48e8f192.jpg,https://www.iowaheritage.org/files/original/77f277bb39db1ff079542d06ff679a3b.jpg","Still Image","Jackson County Soil and Water Conservation District Historic Collection",1,0
