 




﻿"Item Id","Item URI","Dublin Core:Title","Dublin Core:Subject","Dublin Core:Description","Dublin Core:Creator","Dublin Core:Source","Dublin Core:Publisher","Dublin Core:Date","Dublin Core:Contributor","Dublin Core:Rights","Dublin Core:Relation","Dublin Core:Format","Dublin Core:Language","Dublin Core:Type","Dublin Core:Identifier","Dublin Core:Coverage","Item Type Metadata:Text","Item Type Metadata:Interviewer","Item Type Metadata:Interviewee","Item Type Metadata:Location","Item Type Metadata:Transcription","Item Type Metadata:Local URL","Item Type Metadata:Original Format","Item Type Metadata:Physical Dimensions","Item Type Metadata:Duration","Item Type Metadata:Compression","Item Type Metadata:Producer","Item Type Metadata:Director","Item Type Metadata:Bit Rate/Frequency","Item Type Metadata:Time Summary","Item Type Metadata:Email Body","Item Type Metadata:Subject Line","Item Type Metadata:From","Item Type Metadata:To","Item Type Metadata:CC","Item Type Metadata:BCC","Item Type Metadata:Number of Attachments","Item Type Metadata:Standards","Item Type Metadata:Objectives","Item Type Metadata:Materials","Item Type Metadata:Lesson Plan Text","Item Type Metadata:URL","Item Type Metadata:Event Type","Item Type Metadata:Participants","Item Type Metadata:Birth Date","Item Type Metadata:Birthplace","Item Type Metadata:Death Date","Item Type Metadata:Occupation","Item Type Metadata:Biographical Text","Item Type Metadata:Bibliography","Item Type Metadata:Digital Reproduction Information","Item Type Metadata:Repository","Item Type Metadata:Repository Collection","Item Type Metadata:Contact information.","Item Type Metadata:File Name","Item Type Metadata:Notes","Item Type Metadata:Digital item created","Item Type Metadata:Digital item modified","Item Type Metadata:Executive Orders","Item Type Metadata:Record Created","Item Type Metadata:Record Modified","Item Type Metadata:Transcription2","Item Type Metadata:Source URL","Omeka Legacy File:Additional Creator","Omeka Legacy File:Transcriber","Omeka Legacy File:Producer","Omeka Legacy File:Render Device","Omeka Legacy File:Render Details","Omeka Legacy File:Capture Date","Omeka Legacy File:Capture Device","Omeka Legacy File:Capture Details","Omeka Legacy File:Change History","Omeka Legacy File:Watermark","Omeka Legacy File:Encryption","Omeka Legacy File:Compression","Omeka Legacy File:Post Processing","Omeka Image File:Width","Omeka Image File:Height","Omeka Image File:Bit Depth","Omeka Image File:Channels","Omeka Image File:Exif String","Omeka Image File:Exif Array","Omeka Image File:IPTC String","Omeka Image File:IPTC Array","Omeka Video File:Bitrate","Omeka Video File:Duration","Omeka Video File:Sample Rate","Omeka Video File:Codec","Omeka Video File:Width","Omeka Video File:Height",tags,file,itemType,collection,public,featured
64435,https://www.iowaheritage.org/items/show/64435,"This is 911 ... I'm sorry, but all available police officers have been called to a disturbance in the Persian Gulf ...","Violence|Gorbachev, Mikhail Sergeevich, 1931-|Alleys|1990-2000|War|Foreign relations|Aggression|Abuse|Zhang, Zemin|Telephones|Presidents|Men|Women|Leaders|Fighting|Garbage cans|Stars|Purses|Briefcases|Shoes|Bottles","Phone; Baltics; Chinese dissidents","Duffy, Brian, 1955-",,"University of Iowa. Libraries. Special Collections Dept.",1991-02-13|2011-04,,"Educational use only, no other permissions given. Copyright to this digital object is owned by The Des Moines Register; it may not be downloaded, reproduced, or distributed without written permission. For more information, contact the Special Collections Department.","Editorial Cartoons of Brian Duffy; Des Moines Register Cartoonists|Papers of Brian Duffy|Des Moines Register",,English,"Still image|Editorial cartoons",MSC916|duffy-910213|http://digital.lib.uiowa.edu/cdm/ref/collection/duffy/id/273,,,,,,,,,,,,,,,,,,,,,,,,,,,,,,,,,,,,,,,,,,,,,,,,"<a href=""http://digital.lib.uiowa.edu/cdm/ref/collection/duffy/id/273"" target=""_blank"">View this item in its source respository</a>",,,,,,,,,,,,,,,,,,,,,,,,,,,,,https://www.iowaheritage.org/files/original/a137bd76d4cb60dae096facd8716648e.jpg,"Remote Item","Editorial Cartoons of Brian Duffy",1,0
64428,https://www.iowaheritage.org/items/show/64428,War,"War|Iraq|Fighter planes|1990-2000|Wars|Oil|Airplanes|Pilots|Oil wells",,"Duffy, Brian, 1955-",,"University of Iowa. Libraries. Special Collections Dept.",1991-01|2011-04,,"Educational use only, no other permissions given. Copyright to this digital object is owned by The Des Moines Register; it may not be downloaded, reproduced, or distributed without written permission. For more information, contact the Special Collections Department.","Editorial Cartoons of Brian Duffy; Des Moines Register Cartoonists|Papers of Brian Duffy|Des Moines Register",,English,"Still image|Editorial cartoons","MSC916|duffy-9101xx-undated 5|http://digital.lib.uiowa.edu/cdm/ref/collection/duffy/id/266",,,,,,,,,,,,,,,,,,,,,,,,,,,,,,,,,,,,,,,,,,,,,,,,"<a href=""http://digital.lib.uiowa.edu/cdm/ref/collection/duffy/id/266"" target=""_blank"">View this item in its source respository</a>",,,,,,,,,,,,,,,,,,,,,,,,,,,,,https://www.iowaheritage.org/files/original/6ee911dfdd86a9c7cf6d03c79410563b.jpg,"Remote Item","Editorial Cartoons of Brian Duffy",1,0
64427,https://www.iowaheritage.org/items/show/64427,"The television war comes home","War|United States|Operation Desert Shield, 1990-1991|Doors|1990-2000|Wars|Soldiers|Media influence|Television broadcasting|Death|Doorsteps|Houses|Homes|Soldiers|Soldiers, American|Living rooms|Women|Babies|Televisions|Portraits|Chairs|Doorbells",,"Duffy, Brian, 1955-",,"University of Iowa. Libraries. Special Collections Dept.",1991-01|2011-04,,"Educational use only, no other permissions given. Copyright to this digital object is owned by The Des Moines Register; it may not be downloaded, reproduced, or distributed without written permission. For more information, contact the Special Collections Department.","Editorial Cartoons of Brian Duffy; Des Moines Register Cartoonists|Papers of Brian Duffy|Des Moines Register",,English,"Still image|Editorial cartoons","MSC916|duffy-9101xx-undated 4|http://digital.lib.uiowa.edu/cdm/ref/collection/duffy/id/265",,,,,,,,,,,,,,,,,,,,,,,,,,,,,,,,,,,,,,,,,,,,,,,,"<a href=""http://digital.lib.uiowa.edu/cdm/ref/collection/duffy/id/265"" target=""_blank"">View this item in its source respository</a>",,,,,,,,,,,,,,,,,,,,,,,,,,,,,https://www.iowaheritage.org/files/original/b4429ce550751bd359f27f2ac750db1a.jpg,"Remote Item","Editorial Cartoons of Brian Duffy",1,0
64426,https://www.iowaheritage.org/items/show/64426,"Bird sanctuary","Iraq -- Foreign relations -- Iran|Khomeini, Ruhollah|Iran|Iraq-Kuwait Crisis, 1990-1991|Fighter planes|1990-2000|Iran -- Foreign relations -- Iraq|War|Wars|Iraq|Airplanes|Pilots|Leaders","Iraq; Iran","Duffy, Brian, 1955-",,"University of Iowa. Libraries. Special Collections Dept.",1991-01|2011-04,,"Educational use only, no other permissions given. Copyright to this digital object is owned by The Des Moines Register; it may not be downloaded, reproduced, or distributed without written permission. For more information, contact the Special Collections Department.","Editorial Cartoons of Brian Duffy; Des Moines Register Cartoonists|Papers of Brian Duffy|Des Moines Register",,English,"Still image|Editorial cartoons","MSC916|duffy-9101xx-undated 3|http://digital.lib.uiowa.edu/cdm/ref/collection/duffy/id/264",,,,,,,,,,,,,,,,,,,,,,,,,,,,,,,,,,,,,,,,,,,,,,,,"<a href=""http://digital.lib.uiowa.edu/cdm/ref/collection/duffy/id/264"" target=""_blank"">View this item in its source respository</a>",,,,,,,,,,,,,,,,,,,,,,,,,,,,,https://www.iowaheritage.org/files/original/5b4c8b271f26c1efc3c977b6753986d4.jpg,"Remote Item","Editorial Cartoons of Brian Duffy",1,0
64425,https://www.iowaheritage.org/items/show/64425,"Iraqi anti-aircraft fire","War|Iraq|Operation Desert Shield, 1990-1991|Fighter planes|1990-2000|Wars|Media influence|Television broadcasting|Public opinion|Public interest|Airplanes|Pilots|Televisions|Bombs|Missiles|Clouds",,"Duffy, Brian, 1955-",,"University of Iowa. Libraries. Special Collections Dept.",1991-01|2011-04,,"Educational use only, no other permissions given. Copyright to this digital object is owned by The Des Moines Register; it may not be downloaded, reproduced, or distributed without written permission. For more information, contact the Special Collections Department.","Editorial Cartoons of Brian Duffy; Des Moines Register Cartoonists|Papers of Brian Duffy|Des Moines Register",,English,"Still image|Editorial cartoons","MSC916|duffy-9101xx-undated 2|http://digital.lib.uiowa.edu/cdm/ref/collection/duffy/id/263",,,,,,,,,,,,,,,,,,,,,,,,,,,,,,,,,,,,,,,,,,,,,,,,"<a href=""http://digital.lib.uiowa.edu/cdm/ref/collection/duffy/id/263"" target=""_blank"">View this item in its source respository</a>",,,,,,,,,,,,,,,,,,,,,,,,,,,,,https://www.iowaheritage.org/files/original/25b52081d63a9fc27f3100325dffbc9c.jpg,"Remote Item","Editorial Cartoons of Brian Duffy",1,0
64422,https://www.iowaheritage.org/items/show/64422,"The creature from the black lagoon","War|Hussein, Saddam, 1937-2006|Iraq|Iraq-Kuwait Crisis, 1990-1991|Presidents|1990-2000|Wars|Oil|Oil spills|Dictators|Dictatorships|Pollution|Operation Desert Shield, 1990-1991|Dictators|Oil spills|Oilcans|Barrels|Birds|Smoke",,"Duffy, Brian, 1955-",,"University of Iowa. Libraries. Special Collections Dept.",1991-01-29|2011-04,,"Educational use only, no other permissions given. Copyright to this digital object is owned by The Des Moines Register; it may not be downloaded, reproduced, or distributed without written permission. For more information, contact the Special Collections Department.","Editorial Cartoons of Brian Duffy; Des Moines Register Cartoonists|Papers of Brian Duffy|Des Moines Register",,English,"Still image|Editorial cartoons",MSC916|duffy-910129(2)|http://digital.lib.uiowa.edu/cdm/ref/collection/duffy/id/260,,,,,,,,,,,,,,,,,,,,,,,,,,,,,,,,,,,,,,,,,,,,,,,,"<a href=""http://digital.lib.uiowa.edu/cdm/ref/collection/duffy/id/260"" target=""_blank"">View this item in its source respository</a>",,,,,,,,,,,,,,,,,,,,,,,,,,,,,https://www.iowaheritage.org/files/original/41a9e530b1f577741a85243241f3a15a.jpg,"Remote Item","Editorial Cartoons of Brian Duffy",1,0
64418,https://www.iowaheritage.org/items/show/64418,"Launch another missile at some civilians in Israel ... also, I want those POW's used as human shields","War|Hussein, Saddam, 1937-2006|Iraq|Iraq-Kuwait Crisis, 1990-1991|Hell|1990-2000|Wars|Dictators|Dictatorships|Civilians|Urban pollution|Casualties|Strategy|Operation Desert Shield, 1990-1991|Dictators|Pitchforks|Flames|Skulls|Maps|Smoke|Horns|Caves|Telephones|Toys|Satan|Stairways","Saddam's underground bunker","Duffy, Brian, 1955-",,"University of Iowa. Libraries. Special Collections Dept.",1991-01-24|2011-04,,"Educational use only, no other permissions given. Copyright to this digital object is owned by The Des Moines Register; it may not be downloaded, reproduced, or distributed without written permission. For more information, contact the Special Collections Department.","Editorial Cartoons of Brian Duffy; Des Moines Register Cartoonists|Papers of Brian Duffy|Des Moines Register",,English,"Still image|Editorial cartoons",MSC916|duffy-910124|http://digital.lib.uiowa.edu/cdm/ref/collection/duffy/id/256,,,,,,,,,,,,,,,,,,,,,,,,,,,,,,,,,,,,,,,,,,,,,,,,"<a href=""http://digital.lib.uiowa.edu/cdm/ref/collection/duffy/id/256"" target=""_blank"">View this item in its source respository</a>",,,,,,,,,,,,,,,,,,,,,,,,,,,,,https://www.iowaheritage.org/files/original/eea4d5796eaf49ed6e696cce89382008.jpg,"Remote Item","Editorial Cartoons of Brian Duffy",1,0
64417,https://www.iowaheritage.org/items/show/64417,"What's it going to be, forward or reverse?","War|Hussein, Saddam, 1937-2006|Iraq|Iraq-Kuwait Crisis, 1990-1991|Dictators|1990-2000|Wars|Dictators|Dictatorships|Strategy|Presidents|Operation Desert Shield, 1990-1991|Presidents|Tanks|Cliffs",War,"Duffy, Brian, 1955-",,"University of Iowa. Libraries. Special Collections Dept.",1991-01-10|2011-04,,"Educational use only, no other permissions given. Copyright to this digital object is owned by The Des Moines Register; it may not be downloaded, reproduced, or distributed without written permission. For more information, contact the Special Collections Department.","Editorial Cartoons of Brian Duffy; Des Moines Register Cartoonists|Papers of Brian Duffy|Des Moines Register",,English,"Still image|Editorial cartoons",MSC916|duffy-910110|http://digital.lib.uiowa.edu/cdm/ref/collection/duffy/id/255,,,,,,,,,,,,,,,,,,,,,,,,,,,,,,,,,,,,,,,,,,,,,,,,"<a href=""http://digital.lib.uiowa.edu/cdm/ref/collection/duffy/id/255"" target=""_blank"">View this item in its source respository</a>",,,,,,,,,,,,,,,,,,,,,,,,,,,,,https://www.iowaheritage.org/files/original/60bb1217b22dd033b7ab9f4ffb428a6b.jpg,"Remote Item","Editorial Cartoons of Brian Duffy",1,0
64415,https://www.iowaheritage.org/items/show/64415,"Five seconds until the liberation of Palestine, four, three, two, one ...","War|Hussein, Saddam, 1937-2006|Iraq|Trucks|1990-2000|Wars|Occupation|Dictators|Dictatorships|Foreign relations|Aggression|Aggression (International law)|Dictators|Men|Missiles|Ropes",Palestinians,"Duffy, Brian, 1955-",,"University of Iowa. Libraries. Special Collections Dept.",1991-01-22|2011-04,,"Educational use only, no other permissions given. Copyright to this digital object is owned by The Des Moines Register; it may not be downloaded, reproduced, or distributed without written permission. For more information, contact the Special Collections Department.","Editorial Cartoons of Brian Duffy; Des Moines Register Cartoonists|Papers of Brian Duffy|Des Moines Register",,English,"Still image|Editorial cartoons",MSC916|duffy-910122|http://digital.lib.uiowa.edu/cdm/ref/collection/duffy/id/253,,,,,,,,,,,,,,,,,,,,,,,,,,,,,,,,,,,,,,,,,,,,,,,,"<a href=""http://digital.lib.uiowa.edu/cdm/ref/collection/duffy/id/253"" target=""_blank"">View this item in its source respository</a>",,,,,,,,,,,,,,,,,,,,,,,,,,,,,https://www.iowaheritage.org/files/original/23b7dac256e495251a9727c845648707.jpg,"Remote Item","Editorial Cartoons of Brian Duffy",1,0
64414,https://www.iowaheritage.org/items/show/64414,"Gas prices","War|United States|Automobiles|1990-2000|Oil|Oil -- Prices|Oil industry|Wars|Gasoline|Consumers|Consumption|Supply and demand|Supply|Men|Signs|Ladders|Gas pumps|Gas stations|Barrels|Shoes|Hoses","Unleaded; 3; 4; 1; 6.9","Duffy, Brian, 1955-",,"University of Iowa. Libraries. Special Collections Dept.",1991-01-19|2011-04,,"Educational use only, no other permissions given. Copyright to this digital object is owned by The Des Moines Register; it may not be downloaded, reproduced, or distributed without written permission. For more information, contact the Special Collections Department.","Editorial Cartoons of Brian Duffy; Des Moines Register Cartoonists|Papers of Brian Duffy|Des Moines Register",,English,"Still image|Editorial cartoons",MSC916|duffy-910119|http://digital.lib.uiowa.edu/cdm/ref/collection/duffy/id/252,,,,,,,,,,,,,,,,,,,,,,,,,,,,,,,,,,,,,,,,,,,,,,,,"<a href=""http://digital.lib.uiowa.edu/cdm/ref/collection/duffy/id/252"" target=""_blank"">View this item in its source respository</a>",,,,,,,,,,,,,,,,,,,,,,,,,,,,,https://www.iowaheritage.org/files/original/8fbbdcfb5f079bf6104ae95da438cfe3.jpg,"Remote Item","Editorial Cartoons of Brian Duffy",1,0
