 




﻿"Item Id","Item URI","Dublin Core:Title","Dublin Core:Subject","Dublin Core:Description","Dublin Core:Creator","Dublin Core:Source","Dublin Core:Publisher","Dublin Core:Date","Dublin Core:Contributor","Dublin Core:Rights","Dublin Core:Relation","Dublin Core:Format","Dublin Core:Language","Dublin Core:Type","Dublin Core:Identifier","Dublin Core:Coverage","Item Type Metadata:Text","Item Type Metadata:Interviewer","Item Type Metadata:Interviewee","Item Type Metadata:Location","Item Type Metadata:Transcription","Item Type Metadata:Local URL","Item Type Metadata:Original Format","Item Type Metadata:Physical Dimensions","Item Type Metadata:Duration","Item Type Metadata:Compression","Item Type Metadata:Producer","Item Type Metadata:Director","Item Type Metadata:Bit Rate/Frequency","Item Type Metadata:Time Summary","Item Type Metadata:Email Body","Item Type Metadata:Subject Line","Item Type Metadata:From","Item Type Metadata:To","Item Type Metadata:CC","Item Type Metadata:BCC","Item Type Metadata:Number of Attachments","Item Type Metadata:Standards","Item Type Metadata:Objectives","Item Type Metadata:Materials","Item Type Metadata:Lesson Plan Text","Item Type Metadata:URL","Item Type Metadata:Event Type","Item Type Metadata:Participants","Item Type Metadata:Birth Date","Item Type Metadata:Birthplace","Item Type Metadata:Death Date","Item Type Metadata:Occupation","Item Type Metadata:Biographical Text","Item Type Metadata:Bibliography","Item Type Metadata:Digital Reproduction Information","Item Type Metadata:Repository","Item Type Metadata:Repository Collection","Item Type Metadata:Contact information.","Item Type Metadata:File Name","Item Type Metadata:Notes","Item Type Metadata:Digital item created","Item Type Metadata:Digital item modified","Item Type Metadata:Executive Orders","Item Type Metadata:Record Created","Item Type Metadata:Record Modified","Item Type Metadata:Transcription2","Item Type Metadata:Source URL","Omeka Legacy File:Additional Creator","Omeka Legacy File:Transcriber","Omeka Legacy File:Producer","Omeka Legacy File:Render Device","Omeka Legacy File:Render Details","Omeka Legacy File:Capture Date","Omeka Legacy File:Capture Device","Omeka Legacy File:Capture Details","Omeka Legacy File:Change History","Omeka Legacy File:Watermark","Omeka Legacy File:Encryption","Omeka Legacy File:Compression","Omeka Legacy File:Post Processing","Omeka Image File:Width","Omeka Image File:Height","Omeka Image File:Bit Depth","Omeka Image File:Channels","Omeka Image File:Exif String","Omeka Image File:Exif Array","Omeka Image File:IPTC String","Omeka Image File:IPTC Array","Omeka Video File:Bitrate","Omeka Video File:Duration","Omeka Video File:Sample Rate","Omeka Video File:Codec","Omeka Video File:Width","Omeka Video File:Height",tags,file,itemType,collection,public,featured
64566,https://www.iowaheritage.org/items/show/64566,"Congress overhauling service","Congress|United States|Gas stations|1980-1990|Politics|Legislation|Farm aid|Farm policy|Farm relief|Farm vote|Gas pumps|Tractors|Men|Telephones|Mechanics","Farm bill; Drink cola; Closed; Don't call us, we'll call you!; We fix  flats!","Duffy, Brian, 1955-",,"University of Iowa. Libraries. Special Collections Dept.",1985-07-26|2011-04,,"Educational use only, no other permissions given. Copyright to this digital object is owned by The Des Moines Register; it may not be downloaded, reproduced, or distributed without written permission. For more information, contact the Special Collections Department.","Editorial Cartoons of Brian Duffy; Des Moines Register Cartoonists|Papers of Brian Duffy|Des Moines Register",,English,"Still image|Editorial cartoons","MSC916|duffy-850726 2|http://digital.lib.uiowa.edu/cdm/ref/collection/duffy/id/404",,,,,,,,,,,,,,,,,,,,,,,,,,,,,,,,,,,,,,,,,,,,,,,,"<a href=""http://digital.lib.uiowa.edu/cdm/ref/collection/duffy/id/404"" target=""_blank"">View this item in its source respository</a>",,,,,,,,,,,,,,,,,,,,,,,,,,,,,https://www.iowaheritage.org/files/original/1170b39157f27fefa8712f84c578d57f.jpg,"Remote Item","Editorial Cartoons of Brian Duffy",1,0
64520,https://www.iowaheritage.org/items/show/64520,"For sale 400 acres all buildings contact Farmer S & L","Farm vote|Mondale, Walter F., 1928-|United States|Farms|1980-1990|Farms|Farmers|Banks|Media influence|Presidents|Campaigning|Campaigns|Reagan, Ronald|Presidents|Barns|Tractors|Signs|Briefcases|Press|Microphones|Men|Candidates","Hello, I'm Ronald Reagan, and I'd like your vote ... is there anyone here?; Fritz on the farm","Duffy, Brian, 1955-",,"University of Iowa. Libraries. Special Collections Dept.",1984-08-18|2011-04,,"Educational use only, no other permissions given. Copyright to this digital object is owned by The Des Moines Register; it may not be downloaded, reproduced, or distributed without written permission. For more information, contact the Special Collections Department.","Editorial Cartoons of Brian Duffy; Des Moines Register Cartoonists|Papers of Brian Duffy|Des Moines Register",,English,"Still image|Editorial cartoons",MSC916|duffy-840818|http://digital.lib.uiowa.edu/cdm/ref/collection/duffy/id/358,,,,,,,,,,,,,,,,,,,,,,,,,,,,,,,,,,,,,,,,,,,,,,,,"<a href=""http://digital.lib.uiowa.edu/cdm/ref/collection/duffy/id/358"" target=""_blank"">View this item in its source respository</a>",,,,,,,,,,,,,,,,,,,,,,,,,,,,,https://www.iowaheritage.org/files/original/1cc24ab89c03d75f54b7294993479fbc.jpg,"Remote Item","Editorial Cartoons of Brian Duffy",1,0
64455,https://www.iowaheritage.org/items/show/64455,"The President tours flood damaged Iowa","Presidents|Clinton, Bill, 1946-|Iowa|Submarines|1990-2000|Floods|Farmland|Fish|Bubbles|People|Windows|Water|Tractors|Corn|Chickens|Presidents|Presidential seal|Periscopes",,"Duffy, Brian, 1955-",,"University of Iowa. Libraries. Special Collections Dept.",1993-07-04|2011-04,,"Educational use only, no other permissions given. Copyright to this digital object is owned by The Des Moines Register; it may not be downloaded, reproduced, or distributed without written permission. For more information, contact the Special Collections Department.","Editorial Cartoons of Brian Duffy; Des Moines Register Cartoonists|Papers of Brian Duffy|Des Moines Register",,English,"Still image|Editorial cartoons","MSC916|duffy-930704 (2)|http://digital.lib.uiowa.edu/cdm/ref/collection/duffy/id/293",,,,,,,,,,,,,,,,,,,,,,,,,,,,,,,,,,,,,,,,,,,,,,,,"<a href=""http://digital.lib.uiowa.edu/cdm/ref/collection/duffy/id/293"" target=""_blank"">View this item in its source respository</a>",,,,,,,,,,,,,,,,,,,,,,,,,,,,,https://www.iowaheritage.org/files/original/aba45fee22ca03047d22e8d677168214.jpg,"Remote Item","Editorial Cartoons of Brian Duffy",1,0
64341,https://www.iowaheritage.org/items/show/64341,"If it ain't broke, don't fix it!","Governors|Branstad, Terry E.|Iowa|Governors|1980-1990|Property|Taxes|Farm Bureau|Farms|Farmers|Men|Farmers|Tractors|Smoke|Tools","Property tax system; Farm bureau","Duffy, Brian, 1955-",,"University of Iowa. Libraries. Special Collections Dept.",1983-09-12|2011-04,,"Educational use only, no other permissions given. Copyright to this digital object is owned by The Des Moines Register; it may not be downloaded, reproduced, or distributed without written permission. For more information, contact the Special Collections Department.","Editorial Cartoons of Brian Duffy; Des Moines Register Cartoonists|Papers of Brian Duffy|Des Moines Register",,English,"Still image|Editorial cartoons",MSC916|duffy-830912(2)|http://digital.lib.uiowa.edu/cdm/ref/collection/duffy/id/179,,,,,,,,,,,,,,,,,,,,,,,,,,,,,,,,,,,,,,,,,,,,,,,,"<a href=""http://digital.lib.uiowa.edu/cdm/ref/collection/duffy/id/179"" target=""_blank"">View this item in its source respository</a>",,,,,,,,,,,,,,,,,,,,,,,,,,,,,https://www.iowaheritage.org/files/original/d7aff66f77c7b148d0e38edc431dd973.jpg,"Remote Item","Editorial Cartoons of Brian Duffy",1,0
24387,https://www.iowaheritage.org/items/show/24387,"Machinery set up for Mecca Day, The University of Iowa, 1916","Universities & colleges|University of Iowa|United States -- Iowa -- Iowa City|1910-1920|Parades & processions|Celebrations|Tractors|Machinery|Carts & wagons","Mecca Day was put on by the College of Engineers. The name Mecca derives from the first letters of the names of  the engineerng departments:  mechanical, electrical, civil, chemical, and architectural.  Mecca Day events included a parade highlighting progress in engineering plus more humorous floats; in the evening was a play put on by engineering students.","Kent, Frederick W. (Frederick Wallace), 1894-1984",,"University of Iowa. Libraries. University Archives",1916|2008-05,,"Educational use only, no other permissions given. U.S. and international copyright laws may protect this digital object. Commercial use or distribution of the object is not permitted without prior permission of the copyright holder.","Iowa City Town and Campus Scenes|Frederick W. Kent Collection of Photographs, 1866-2000|http://www.lib.uiowa.edu/collguides/?RG30.0001.01|Prints|Events and activities|Parades, Mecca Day|Parades, Mecca Day|Scanned with Ricoh Aficio 3228C @ 600 ppi, full color. Master image saved in TIFF format.",9|14,,"Still image|Photographs; Postcards|jpeg",RG30.0001.01|https://digital.lib.uiowa.edu/,,,,,,,,,,,,,,,,,,,,,,,,,,,,,,,,,,,,,,,,,,,,,,,,"<a href=""https://digital.lib.uiowa.edu/"" target=""_blank"">View this item in its source respository</a>",,,,,,,,,,,,,,,,,,,,,,,,,,,,,https://www.iowaheritage.org/files/original/c7729f796dda3cc9deec1a9f0f0d6630.jpg,"Remote Item","Iowa City Town and Campus Scenes",1,0
24235,https://www.iowaheritage.org/items/show/24235,"Engineers' parade, The University of Iowa, 1910s","Universities & colleges|University of Iowa|United States -- Iowa -- Iowa City|1910-1920|Parades & processions|Tractors|Carriages & coaches",,"Kent, Frederick W. (Frederick Wallace), 1894-1984",,"University of Iowa. Libraries. University Archives",1910/1919|2008-05,,"Educational use only, no other permissions given. U.S. and international copyright laws may protect this digital object. Commercial use or distribution of the object is not permitted without prior permission of the copyright holder.","Iowa City Town and Campus Scenes|Frederick W. Kent Collection of Photographs, 1866-2000|http://www.lib.uiowa.edu/collguides/?RG30.0001.01|Prints|Events and activities|Parades, Miscellaneous|Parades, Miscellaneous|Scanned with Ricoh Aficio 3228C @ 600 ppi, full color. Master image saved in TIFF format.",9|14,,"Still image|Photographs; Postcards|jpeg",RG30.0001.01|https://digital.lib.uiowa.edu/,,,,,,,,,,,,,,,,,,,,,,,,,,,,,,,,,,,,,,,,,,,,,,,,"<a href=""https://digital.lib.uiowa.edu/"" target=""_blank"">View this item in its source respository</a>",,,,,,,,,,,,,,,,,,,,,,,,,,,,,https://www.iowaheritage.org/files/original/99646aea7e18c0b4d27c930e46c5eef7.jpg,"Remote Item","Iowa City Town and Campus Scenes",1,0
24229,https://www.iowaheritage.org/items/show/24229,"Engineers' parade, The University of Iowa, 1917","Universities & colleges|University of Iowa|United States -- Iowa -- Iowa City|1910-1920|Parades & processions|Tractors|Carts & wagons",,"Kent, Frederick W. (Frederick Wallace), 1894-1984",,"University of Iowa. Libraries. University Archives",1917|2008-05,,"Educational use only, no other permissions given. U.S. and international copyright laws may protect this digital object. Commercial use or distribution of the object is not permitted without prior permission of the copyright holder.","Iowa City Town and Campus Scenes|Frederick W. Kent Collection of Photographs, 1866-2000|http://www.lib.uiowa.edu/collguides/?RG30.0001.01|Prints|Events and activities|Parades, Miscellaneous|Parades, Miscellaneous|Scanned with Ricoh Aficio 3228C @ 600 ppi, full color. Master image saved in TIFF format.",9|14,,"Still image|Photographs; Postcards|jpeg",RG30.0001.01|https://digital.lib.uiowa.edu/,,,,,,,,,,,,,,,,,,,,,,,,,,,,,,,,,,,,,,,,,,,,,,,,"<a href=""https://digital.lib.uiowa.edu/"" target=""_blank"">View this item in its source respository</a>",,,,,,,,,,,,,,,,,,,,,,,,,,,,,https://www.iowaheritage.org/files/original/6d482c6f667119b951d1e8fbccb315fa.jpg,"Remote Item","Iowa City Town and Campus Scenes",1,0
24205,https://www.iowaheritage.org/items/show/24205,"Engineers' parade, The University of Iowa, 1917","Universities & colleges|University of Iowa|United States -- Iowa -- Iowa City|1910-1920|Parades & processions|Tractors|Floats (Parades)|Artillery (Weaponry)",,"Kent, Frederick W. (Frederick Wallace), 1894-1984",,"University of Iowa. Libraries. University Archives",1917|2008-05,,"Educational use only, no other permissions given. U.S. and international copyright laws may protect this digital object. Commercial use or distribution of the object is not permitted without prior permission of the copyright holder.","Iowa City Town and Campus Scenes|Frederick W. Kent Collection of Photographs, 1866-2000|http://www.lib.uiowa.edu/collguides/?RG30.0001.01|Prints|Events and activities|Parades, Miscellaneous|Parades, Miscellaneous|Scanned with Ricoh Aficio 3228C @ 600 ppi, full color. Master image saved in TIFF format.",9|14,,"Still image|Photographs; Postcards|jpeg",RG30.0001.01|https://digital.lib.uiowa.edu/,,,,,,,,,,,,,,,,,,,,,,,,,,,,,,,,,,,,,,,,,,,,,,,,"<a href=""https://digital.lib.uiowa.edu/"" target=""_blank"">View this item in its source respository</a>",,,,,,,,,,,,,,,,,,,,,,,,,,,,,https://www.iowaheritage.org/files/original/9a25e899aac9f3079104269e6d699d89.jpg,"Remote Item","Iowa City Town and Campus Scenes",1,0
16366,https://www.iowaheritage.org/items/show/16366,"Evelyn Birkby driving tractor pulling hay wagon, Shenandoah, Iowa, 1950s","Women|Radio personalities|Birkby, Bob|United States -- Iowa -- Shenandoah|1950-1960|Children|Tractors|Farm life|Hay|Housewives|Carts & wagons|Families|Birkby, Evelyn|Barnard, Larry|Barnard, Luanne","Seated on hay wagon are Evelyn Birkby's niece Luanne and nephew Larry Barnard of Omaha and to the right is her son Bob.",unknown,,"University of Iowa. Libraries. Iowa Women's Archives",1950/1959|2008-01-01,,"Educational use only, no other permissions given. Copyright to this resource is held by the Iowa Women's Archives, the University of Iowa Libraries, and is provided here for educational purposes only. It may not be reproduced or distributed in any format without written permission of the Iowa Women's Archives.","Evelyn Birkby Digital Collection; Iowa Women's Archives Digital Collections|Evelyn Birkby Collection of Radio Homemaker Materials, 1919-2001|http://www.lib.uiowa.edu/findingaids/IWATitleDetail.aspx?CollectionIdentifier=IWA0126",jpeg,,"Still image|Photographs",IWA0126|159935583|https://digital.lib.uiowa.edu/,,,,,,,,,,,,,,,,,,,,,,,,,,,,,,,,,,,,,,,,,,,,,,,,"<a href=""https://digital.lib.uiowa.edu/"" target=""_blank"">View this item in its source respository</a>",,,,,,,,,,,,,,,,,,,,,,,,,,,,,https://www.iowaheritage.org/files/original/cdb9942f7b04f505b9ca8484629ca04e.jpg,"Remote Item","Evelyn Birkby Collection",1,0
16348,https://www.iowaheritage.org/items/show/16348,"Wesley and Ray Maynard on tractor at Birkby farm, Shenandoah, Iowa, 1950s","Boys|Maynard, Wesley|United States -- Iowa -- Shenandoah|1950-1960|Tractors|Farms|Maynard, Ray","Sons of Ed and Eleanor Maynard of Chicago, who were friends of Robert and Evelyn Birkby.",unknown,,"University of Iowa. Libraries. Iowa Women's Archives",1950/1959|2008-01-01,,"Educational use only, no other permissions given. Copyright to this resource is held by the Iowa Women's Archives, the University of Iowa Libraries, and is provided here for educational purposes only. It may not be reproduced or distributed in any format without written permission of the Iowa Women's Archives.","Evelyn Birkby Digital Collection; Iowa Women's Archives Digital Collections|Evelyn Birkby Collection of Radio Homemaker Materials, 1919-2001|http://www.lib.uiowa.edu/findingaids/IWATitleDetail.aspx?CollectionIdentifier=IWA0126",jpeg,,"Still image|Photographs",IWA0126|159935583|https://digital.lib.uiowa.edu/,,,,,,,,,,,,,,,,,,,,,,,,,,,,,,,,,,,,,,,,,,,,,,,,"<a href=""https://digital.lib.uiowa.edu/"" target=""_blank"">View this item in its source respository</a>",,,,,,,,,,,,,,,,,,,,,,,,,,,,,https://www.iowaheritage.org/files/original/ab8cf0cace173e916908149bd5f8173f.jpg,"Remote Item","Evelyn Birkby Collection",1,0
