 




﻿"Item Id","Item URI","Dublin Core:Title","Dublin Core:Subject","Dublin Core:Description","Dublin Core:Creator","Dublin Core:Source","Dublin Core:Publisher","Dublin Core:Date","Dublin Core:Contributor","Dublin Core:Rights","Dublin Core:Relation","Dublin Core:Format","Dublin Core:Language","Dublin Core:Type","Dublin Core:Identifier","Dublin Core:Coverage","Item Type Metadata:Text","Item Type Metadata:Interviewer","Item Type Metadata:Interviewee","Item Type Metadata:Location","Item Type Metadata:Transcription","Item Type Metadata:Local URL","Item Type Metadata:Original Format","Item Type Metadata:Physical Dimensions","Item Type Metadata:Duration","Item Type Metadata:Compression","Item Type Metadata:Producer","Item Type Metadata:Director","Item Type Metadata:Bit Rate/Frequency","Item Type Metadata:Time Summary","Item Type Metadata:Email Body","Item Type Metadata:Subject Line","Item Type Metadata:From","Item Type Metadata:To","Item Type Metadata:CC","Item Type Metadata:BCC","Item Type Metadata:Number of Attachments","Item Type Metadata:Standards","Item Type Metadata:Objectives","Item Type Metadata:Materials","Item Type Metadata:Lesson Plan Text","Item Type Metadata:URL","Item Type Metadata:Event Type","Item Type Metadata:Participants","Item Type Metadata:Birth Date","Item Type Metadata:Birthplace","Item Type Metadata:Death Date","Item Type Metadata:Occupation","Item Type Metadata:Biographical Text","Item Type Metadata:Bibliography","Item Type Metadata:Digital Reproduction Information","Item Type Metadata:Repository","Item Type Metadata:Repository Collection","Item Type Metadata:Contact information.","Item Type Metadata:File Name","Item Type Metadata:Notes","Item Type Metadata:Digital item created","Item Type Metadata:Digital item modified","Item Type Metadata:Executive Orders","Item Type Metadata:Record Created","Item Type Metadata:Record Modified","Item Type Metadata:Transcription2","Item Type Metadata:Source URL","Omeka Legacy File:Additional Creator","Omeka Legacy File:Transcriber","Omeka Legacy File:Producer","Omeka Legacy File:Render Device","Omeka Legacy File:Render Details","Omeka Legacy File:Capture Date","Omeka Legacy File:Capture Device","Omeka Legacy File:Capture Details","Omeka Legacy File:Change History","Omeka Legacy File:Watermark","Omeka Legacy File:Encryption","Omeka Legacy File:Compression","Omeka Legacy File:Post Processing","Omeka Image File:Width","Omeka Image File:Height","Omeka Image File:Bit Depth","Omeka Image File:Channels","Omeka Image File:Exif String","Omeka Image File:Exif Array","Omeka Image File:IPTC String","Omeka Image File:IPTC Array","Omeka Video File:Bitrate","Omeka Video File:Duration","Omeka Video File:Sample Rate","Omeka Video File:Codec","Omeka Video File:Width","Omeka Video File:Height",tags,file,itemType,collection,public,featured
64514,https://www.iowaheritage.org/items/show/64514,"I shall part the Red Sea!","Deficits|Reagan, Ronald|United States|Presidents|1980-1990|Presidents|Campaigns|Campaigning|Elections|Elections -- United States|Issues|Economy|Politicians|Politics|Mondale, Walter F., 1928-|Men|Leaders|Water|Fish|Staffs (Sticks)","You couldn't part your hair! I shall do it; Break out the snorkels!; Deficit","Duffy, Brian, 1955-",,"University of Iowa. Libraries. Special Collections Dept.",1984-08-10|2011-04,,"Educational use only, no other permissions given. Copyright to this digital object is owned by The Des Moines Register; it may not be downloaded, reproduced, or distributed without written permission. For more information, contact the Special Collections Department.","Editorial Cartoons of Brian Duffy; Des Moines Register Cartoonists|Papers of Brian Duffy|Des Moines Register",,English,"Still image|Editorial cartoons",MSC916|duffy-840810|http://digital.lib.uiowa.edu/cdm/ref/collection/duffy/id/352,,,,,,,,,,,,,,,,,,,,,,,,,,,,,,,,,,,,,,,,,,,,,,,,"<a href=""http://digital.lib.uiowa.edu/cdm/ref/collection/duffy/id/352"" target=""_blank"">View this item in its source respository</a>",,,,,,,,,,,,,,,,,,,,,,,,,,,,,https://www.iowaheritage.org/files/original/0eb66b156ace2cdf140d82697a71c362.jpg,"Remote Item","Editorial Cartoons of Brian Duffy",1,0
64537,https://www.iowaheritage.org/items/show/64537,Kids!,"Soviet Union -- Economic conditions|Gorbachev, Mikhail Sergeevich, 1931-|Soviet Union|Bears|1980-1990|Presidents|Presidents -- Soviet Union|Economic conditions|Economy|Communism|Communism -- Soviet Union|Communism -- Soviet Union -- Caricatures and cartoons|Bears, Russian|Presidents|Hoops|Staffs (Sticks)|Circus acts|Circuses","Economic improvement; Gorbachev","Duffy, Brian, 1955-",,"University of Iowa. Libraries. Special Collections Dept.",1985-03-13|2011-04,,"Educational use only, no other permissions given. Copyright to this digital object is owned by The Des Moines Register; it may not be downloaded, reproduced, or distributed without written permission. For more information, contact the Special Collections Department.","Editorial Cartoons of Brian Duffy; Des Moines Register Cartoonists|Papers of Brian Duffy|Des Moines Register",,English,"Still image|Editorial cartoons",MSC916|duffy-850313|http://digital.lib.uiowa.edu/cdm/ref/collection/duffy/id/375,,,,,,,,,,,,,,,,,,,,,,,,,,,,,,,,,,,,,,,,,,,,,,,,"<a href=""http://digital.lib.uiowa.edu/cdm/ref/collection/duffy/id/375"" target=""_blank"">View this item in its source respository</a>",,,,,,,,,,,,,,,,,,,,,,,,,,,,,https://www.iowaheritage.org/files/original/4b7ba2aebee309a79d5298675a24a64d.jpg,"Remote Item","Editorial Cartoons of Brian Duffy",1,0
64564,https://www.iowaheritage.org/items/show/64564,"Get well soon","Presidents|Reagan, Ronald|United States|Hospitals|1980-1990|Budgets -- United States|Economy|Popularity|United States -- Economic conditions|United States -- Monetary policy|Patients|Machines|Medical equipment & supplies|Arrows|Charts|Balloons|Flowers|Greeting cards|Presidents","Reagan, R; Up; Down; Up; Down; Eject; Budget '86","Duffy, Brian, 1955-",,"University of Iowa. Libraries. Special Collections Dept.",1985-07-18|2011-04,,"Educational use only, no other permissions given. Copyright to this digital object is owned by The Des Moines Register; it may not be downloaded, reproduced, or distributed without written permission. For more information, contact the Special Collections Department.","Editorial Cartoons of Brian Duffy; Des Moines Register Cartoonists|Papers of Brian Duffy|Des Moines Register",,English,"Still image|Editorial cartoons",MSC916|duffy-850718|http://digital.lib.uiowa.edu/cdm/ref/collection/duffy/id/402,,,,,,,,,,,,,,,,,,,,,,,,,,,,,,,,,,,,,,,,,,,,,,,,"<a href=""http://digital.lib.uiowa.edu/cdm/ref/collection/duffy/id/402"" target=""_blank"">View this item in its source respository</a>",,,,,,,,,,,,,,,,,,,,,,,,,,,,,https://www.iowaheritage.org/files/original/720d227224e1729699a2116e4254c90a.jpg,"Remote Item","Editorial Cartoons of Brian Duffy",1,0
64582,https://www.iowaheritage.org/items/show/64582,Inflation,"Gasoline|United States|Uncle Sam|1980-1990|Inflation|Economy|Petroleum|Oil|Oil -- Prices|Uncle Sam--dismayed|Uncle Sam--worried|Hot air|Gas pumps|Clouds|Balloons (aircraft)","Gas prices","Duffy, Brian, 1955-",,"University of Iowa. Libraries. Special Collections Dept.",1989-05-25|2011-04,,"Educational use only, no other permissions given. Copyright to this digital object is owned by The Des Moines Register; it may not be downloaded, reproduced, or distributed without written permission. For more information, contact the Special Collections Department.","Editorial Cartoons of Brian Duffy; Des Moines Register Cartoonists|Papers of Brian Duffy|Des Moines Register",,English,"Still image|Editorial cartoons",MSC916|duffy-890525|http://digital.lib.uiowa.edu/cdm/ref/collection/duffy/id/420,,,,,,,,,,,,,,,,,,,,,,,,,,,,,,,,,,,,,,,,,,,,,,,,"<a href=""http://digital.lib.uiowa.edu/cdm/ref/collection/duffy/id/420"" target=""_blank"">View this item in its source respository</a>",,,,,,,,,,,,,,,,,,,,,,,,,,,,,https://www.iowaheritage.org/files/original/2ceace6abfb6b51c17b284eb57da5511.jpg,"Remote Item","Editorial Cartoons of Brian Duffy",1,0
64602,https://www.iowaheritage.org/items/show/64602,"Is anybody home?","Census|United States|Men|1990-2000|Homeless persons|Economy|Unemployed|Unemployment|Alleys|Census|Boxes|Shoes|Bottles|Garbage","Knock knock; No ... just homeless; This end up; Census","Duffy, Brian, 1955-",,"University of Iowa. Libraries. Special Collections Dept.",1990-03-21|2011-04,,"Educational use only, no other permissions given. Copyright to this digital object is owned by The Des Moines Register; it may not be downloaded, reproduced, or distributed without written permission. For more information, contact the Special Collections Department.","Editorial Cartoons of Brian Duffy; Des Moines Register Cartoonists|Papers of Brian Duffy|Des Moines Register",,English,"Still image|Editorial cartoons",MSC916|duffy-900321|http://digital.lib.uiowa.edu/cdm/ref/collection/duffy/id/440,,,,,,,,,,,,,,,,,,,,,,,,,,,,,,,,,,,,,,,,,,,,,,,,"<a href=""http://digital.lib.uiowa.edu/cdm/ref/collection/duffy/id/440"" target=""_blank"">View this item in its source respository</a>",,,,,,,,,,,,,,,,,,,,,,,,,,,,,https://www.iowaheritage.org/files/original/d3d4620b0f51ec61b9c54e748773d6e6.jpg,"Remote Item","Editorial Cartoons of Brian Duffy",1,0
64613,https://www.iowaheritage.org/items/show/64613,"Financial institutions","Banks|United States|Men|1990-2000|Savings|Loans|Taxpayers|Taxes|Economy|Ruins|Sweating|Capitals (Columns)","Banks; S & L; Taxpayers","Duffy, Brian, 1955-",,"University of Iowa. Libraries. Special Collections Dept.",1990-08-02|2011-04,,"Educational use only, no other permissions given. Copyright to this digital object is owned by The Des Moines Register; it may not be downloaded, reproduced, or distributed without written permission. For more information, contact the Special Collections Department.","Editorial Cartoons of Brian Duffy; Des Moines Register Cartoonists|Papers of Brian Duffy|Des Moines Register",,English,"Still image|Editorial cartoons",MSC916|duffy-900802|http://digital.lib.uiowa.edu/cdm/ref/collection/duffy/id/451,,,,,,,,,,,,,,,,,,,,,,,,,,,,,,,,,,,,,,,,,,,,,,,,"<a href=""http://digital.lib.uiowa.edu/cdm/ref/collection/duffy/id/451"" target=""_blank"">View this item in its source respository</a>",,,,,,,,,,,,,,,,,,,,,,,,,,,,,https://www.iowaheritage.org/files/original/63c8ad84323ae487bd6b0fd036644e14.jpg,"Remote Item","Editorial Cartoons of Brian Duffy",1,0
64616,https://www.iowaheritage.org/items/show/64616,Economy,"Economy|United States|Graphs|1990-2000|Economic conditions|Economic cycles|Oil|Arrows|Uncle Sam--dismayed|Uncle Sam--falling|Uncle Sam--worried|Barrels",,"Duffy, Brian, 1955-",,"University of Iowa. Libraries. Special Collections Dept.",1990-08-14|2011-04,,"Educational use only, no other permissions given. Copyright to this digital object is owned by The Des Moines Register; it may not be downloaded, reproduced, or distributed without written permission. For more information, contact the Special Collections Department.","Editorial Cartoons of Brian Duffy; Des Moines Register Cartoonists|Papers of Brian Duffy|Des Moines Register",,English,"Still image|Editorial cartoons",MSC916|duffy-900814|http://digital.lib.uiowa.edu/cdm/ref/collection/duffy/id/454,,,,,,,,,,,,,,,,,,,,,,,,,,,,,,,,,,,,,,,,,,,,,,,,"<a href=""http://digital.lib.uiowa.edu/cdm/ref/collection/duffy/id/454"" target=""_blank"">View this item in its source respository</a>",,,,,,,,,,,,,,,,,,,,,,,,,,,,,https://www.iowaheritage.org/files/original/a31d8917e97d7b34f6278cf90cb1b9c3.jpg,"Remote Item","Editorial Cartoons of Brian Duffy",1,0
64636,https://www.iowaheritage.org/items/show/64636,"We're stuck, and it's all your fault!","Christmas|Bush, George, 1924-|United States|Presidents|1990-2000|Presidents -- United States|Congress|Economy|Economic conditions|Recession|Men|Santa Claus|Bags|Roofs|Chimneys|Snow|Windows|Children|Fireplaces|Christmas trees|Christmas stockings|Firewood|Candles|Wreaths","Gimme the matches; It's your fault!; ... is not!; ... is too!; Congress; Economy","Duffy, Brian, 1955-",,"University of Iowa. Libraries. Special Collections Dept.",1991-12-13|2011-04,,"Educational use only, no other permissions given. Copyright to this digital object is owned by The Des Moines Register; it may not be downloaded, reproduced, or distributed without written permission. For more information, contact the Special Collections Department.","Editorial Cartoons of Brian Duffy; Des Moines Register Cartoonists|Papers of Brian Duffy|Des Moines Register",,English,"Still image|Editorial cartoons",MSC916|duffy-911213|http://digital.lib.uiowa.edu/cdm/ref/collection/duffy/id/474,,,,,,,,,,,,,,,,,,,,,,,,,,,,,,,,,,,,,,,,,,,,,,,,"<a href=""http://digital.lib.uiowa.edu/cdm/ref/collection/duffy/id/474"" target=""_blank"">View this item in its source respository</a>",,,,,,,,,,,,,,,,,,,,,,,,,,,,,https://www.iowaheritage.org/files/original/91c3a793644f2158c21bf78ff2f3475d.jpg,"Remote Item","Editorial Cartoons of Brian Duffy",1,0
64638,https://www.iowaheritage.org/items/show/64638,"I want a really, really, really big Christmas!","Economy|United States|Santa Claus|1990-2000|Economic conditions|Recession|Retail trade|Christmas|Salesmen|Businessmen|Children|Toys|Chairs","How about a little puppy instead; Retailers","Duffy, Brian, 1955-",,"University of Iowa. Libraries. Special Collections Dept.",1991-12-01|2011-04,,"Educational use only, no other permissions given. Copyright to this digital object is owned by The Des Moines Register; it may not be downloaded, reproduced, or distributed without written permission. For more information, contact the Special Collections Department.","Editorial Cartoons of Brian Duffy; Des Moines Register Cartoonists|Papers of Brian Duffy|Des Moines Register",,English,"Still image|Editorial cartoons",MSC916|duffy-911201|http://digital.lib.uiowa.edu/cdm/ref/collection/duffy/id/476,,,,,,,,,,,,,,,,,,,,,,,,,,,,,,,,,,,,,,,,,,,,,,,,"<a href=""http://digital.lib.uiowa.edu/cdm/ref/collection/duffy/id/476"" target=""_blank"">View this item in its source respository</a>",,,,,,,,,,,,,,,,,,,,,,,,,,,,,https://www.iowaheritage.org/files/original/54b747517ed2d56f3ed4a22bffa1174d.jpg,"Remote Item","Editorial Cartoons of Brian Duffy",1,0
64643,https://www.iowaheritage.org/items/show/64643,"Gulp! economy","Economy|Bush, George, 1924-|United States|Grinch (Fictitious character)|1990-2000|Economic conditions|Recession|Finance, Public -- United States|Presidents|Presidents|Lists|Chairs",,"Duffy, Brian, 1955-",,"University of Iowa. Libraries. Special Collections Dept.",1991-12-10|2011-04,,"Educational use only, no other permissions given. Copyright to this digital object is owned by The Des Moines Register; it may not be downloaded, reproduced, or distributed without written permission. For more information, contact the Special Collections Department.","Editorial Cartoons of Brian Duffy; Des Moines Register Cartoonists|Papers of Brian Duffy|Des Moines Register",,English,"Still image|Editorial cartoons",MSC916|duffy-911210|http://digital.lib.uiowa.edu/cdm/ref/collection/duffy/id/481,,,,,,,,,,,,,,,,,,,,,,,,,,,,,,,,,,,,,,,,,,,,,,,,"<a href=""http://digital.lib.uiowa.edu/cdm/ref/collection/duffy/id/481"" target=""_blank"">View this item in its source respository</a>",,,,,,,,,,,,,,,,,,,,,,,,,,,,,https://www.iowaheritage.org/files/original/8e5ccc22815948805fcc76bd36fd524c.jpg,"Remote Item","Editorial Cartoons of Brian Duffy",1,0
