 




﻿"Item Id","Item URI","Dublin Core:Title","Dublin Core:Subject","Dublin Core:Description","Dublin Core:Creator","Dublin Core:Source","Dublin Core:Publisher","Dublin Core:Date","Dublin Core:Contributor","Dublin Core:Rights","Dublin Core:Relation","Dublin Core:Format","Dublin Core:Language","Dublin Core:Type","Dublin Core:Identifier","Dublin Core:Coverage","Item Type Metadata:Text","Item Type Metadata:Interviewer","Item Type Metadata:Interviewee","Item Type Metadata:Location","Item Type Metadata:Transcription","Item Type Metadata:Local URL","Item Type Metadata:Original Format","Item Type Metadata:Physical Dimensions","Item Type Metadata:Duration","Item Type Metadata:Compression","Item Type Metadata:Producer","Item Type Metadata:Director","Item Type Metadata:Bit Rate/Frequency","Item Type Metadata:Time Summary","Item Type Metadata:Email Body","Item Type Metadata:Subject Line","Item Type Metadata:From","Item Type Metadata:To","Item Type Metadata:CC","Item Type Metadata:BCC","Item Type Metadata:Number of Attachments","Item Type Metadata:Standards","Item Type Metadata:Objectives","Item Type Metadata:Materials","Item Type Metadata:Lesson Plan Text","Item Type Metadata:URL","Item Type Metadata:Event Type","Item Type Metadata:Participants","Item Type Metadata:Birth Date","Item Type Metadata:Birthplace","Item Type Metadata:Death Date","Item Type Metadata:Occupation","Item Type Metadata:Biographical Text","Item Type Metadata:Bibliography","Item Type Metadata:Digital Reproduction Information","Item Type Metadata:Repository","Item Type Metadata:Repository Collection","Item Type Metadata:Contact information.","Item Type Metadata:File Name","Item Type Metadata:Notes","Item Type Metadata:Digital item created","Item Type Metadata:Digital item modified","Item Type Metadata:Executive Orders","Item Type Metadata:Record Created","Item Type Metadata:Record Modified","Item Type Metadata:Transcription2","Item Type Metadata:Source URL","Omeka Legacy File:Additional Creator","Omeka Legacy File:Transcriber","Omeka Legacy File:Producer","Omeka Legacy File:Render Device","Omeka Legacy File:Render Details","Omeka Legacy File:Capture Date","Omeka Legacy File:Capture Device","Omeka Legacy File:Capture Details","Omeka Legacy File:Change History","Omeka Legacy File:Watermark","Omeka Legacy File:Encryption","Omeka Legacy File:Compression","Omeka Legacy File:Post Processing","Omeka Image File:Width","Omeka Image File:Height","Omeka Image File:Bit Depth","Omeka Image File:Channels","Omeka Image File:Exif String","Omeka Image File:Exif Array","Omeka Image File:IPTC String","Omeka Image File:IPTC Array","Omeka Video File:Bitrate","Omeka Video File:Duration","Omeka Video File:Sample Rate","Omeka Video File:Codec","Omeka Video File:Width","Omeka Video File:Height",tags,file,itemType,collection,public,featured
9990,https://www.iowaheritage.org/items/show/9990,"Center of Kasama village, Shinkyo commune, Nara-ken, Japan, April 1965","Collective settlements|Japanese|Shinkyo|Japan -- Nara-ken|1960-1970|Collective farms",,"Plath, David W.",,"University of Iowa. Libraries. University Archives",1965-04|2008-03-03,,"Educational use only, no other permissions given. U.S. and international copyright laws may protect this item. Commercial use or distribution of this digital object is not permitted without written permission of the University Archives at The University of Iowa Libraries.","Anthropology at Iowa Digital Collection|David Plath Japanese Fieldwork Collection|David Plath Papers|In process",,,"Still image|Photographs|jpeg",https://digital.lib.uiowa.edu/,,,,,,,,,,,,,,,,,,,,,,,,,,,,,,,,,,,,,,,,,,,,,,,,"<a href=""https://digital.lib.uiowa.edu/"" target=""_blank"">View this item in its source respository</a>",,,,,,,,,,,,,,,,,,,,,,,,,,,,,https://www.iowaheritage.org/files/original/3f1951f90d3974126021b44285627879.jpg,"Remote Item","African American Women in Iowa Collection",1,0
10092,https://www.iowaheritage.org/items/show/10092,"Chicken farming, Atarashiki Mura commune, Saitama-ken, Japan, 1965","Collective settlements|Japanese|Atarashiki Mura|Japan -- Saitama-ken|1960-1970|Collective farms|Chicken industry|Poultry houses",,"Plath, David W.",,"University of Iowa. Libraries. University Archives",1965,,"Educational use only, no other permissions given. U.S. and international copyright laws may protect this item. Commercial use or distribution of this digital object is not permitted without written permission of the University Archives at The University of Iowa Libraries.","Anthropology at Iowa Digital Collection|David Plath Japanese Fieldwork Collection|David Plath Papers",5|5,,"Still image|Color slides|jpeg",PLA-slide044.jpg|https://digital.lib.uiowa.edu/,,,,,,,,,,,,,,,,,,,,,,,,,,,,,,,,,,,,,,,,,,,,,,,,"<a href=""https://digital.lib.uiowa.edu/"" target=""_blank"">View this item in its source respository</a>",,,,,,,,,,,,,,,,,,,,,,,,,,,,,https://www.iowaheritage.org/files/original/7aaeac23b2609f995571be10d8d6967c.jpg,"Remote Item","African American Women in Iowa Collection",1,0
10093,https://www.iowaheritage.org/items/show/10093,"Chicken farming, Atarashiki Mura commune, Saitama-ken, Japan, 1965","Collective settlements|Japanese|Atarashiki Mura|Japan -- Saitama-ken|1960-1970|Collective farms|Chicken industry|Poultry houses",,"Plath, David W.",,"University of Iowa. Libraries. University Archives",1965,,"Educational use only, no other permissions given. U.S. and international copyright laws may protect this item. Commercial use or distribution of this digital object is not permitted without written permission of the University Archives at The University of Iowa Libraries.","Anthropology at Iowa Digital Collection|David Plath Japanese Fieldwork Collection|David Plath Papers",5|5,,"Still image|Color slides|jpeg",PLA-slide045.jpg|https://digital.lib.uiowa.edu/,,,,,,,,,,,,,,,,,,,,,,,,,,,,,,,,,,,,,,,,,,,,,,,,"<a href=""https://digital.lib.uiowa.edu/"" target=""_blank"">View this item in its source respository</a>",,,,,,,,,,,,,,,,,,,,,,,,,,,,,https://www.iowaheritage.org/files/original/f71c8fbcd473ff74581de98064cf43c2.jpg,"Remote Item","African American Women in Iowa Collection",1,0
10097,https://www.iowaheritage.org/items/show/10097,"Chicken farming, Atarashiki Mura commune, Saitama-ken, Japan, 1965","Collective settlements|Japanese|Atarashiki Mura|Japan -- Saitama-ken|1960-1970|Collective farms|Chicken industry|Poultry houses",,"Plath, David W.",,"University of Iowa. Libraries. University Archives",1965,,"Educational use only, no other permissions given. U.S. and international copyright laws may protect this item. Commercial use or distribution of this digital object is not permitted without written permission of the University Archives at The University of Iowa Libraries.","Anthropology at Iowa Digital Collection|David Plath Japanese Fieldwork Collection|David Plath Papers",5|5,,"Still image|Color slides|jpeg",PLA-slide049.jpg|https://digital.lib.uiowa.edu/,,,,,,,,,,,,,,,,,,,,,,,,,,,,,,,,,,,,,,,,,,,,,,,,"<a href=""https://digital.lib.uiowa.edu/"" target=""_blank"">View this item in its source respository</a>",,,,,,,,,,,,,,,,,,,,,,,,,,,,,https://www.iowaheritage.org/files/original/d5101a788b7fab4c99e0ac0d63ce50af.jpg,"Remote Item","African American Women in Iowa Collection",1,0
10059,https://www.iowaheritage.org/items/show/10059,"Collective living, laundry sorter, Yamagishi Kai, Mie-ken, Japan, 1965","Collective settlements|Japanese|Yamagishi Kai|Japan -- Mie-ken|1960-1970|Laundries (Rooms & spaces)",,"Plath, David W.",,"University of Iowa. Libraries. University Archives",1965,,"Educational use only, no other permissions given. U.S. and international copyright laws may protect this item. Commercial use or distribution of this digital object is not permitted without written permission of the University Archives at The University of Iowa Libraries.","Anthropology at Iowa Digital Collection|David Plath Japanese Fieldwork Collection|David Plath Papers",5|5,,"Still image|Color slides|jpeg",https://digital.lib.uiowa.edu/,,,,,,,,,,,,,,,,,,,,,,,,,,,,,,,,,,,,,,,,,,,,,,,,"<a href=""https://digital.lib.uiowa.edu/"" target=""_blank"">View this item in its source respository</a>",,,,,,,,,,,,,,,,,,,,,,,,,,,,,https://www.iowaheritage.org/files/original/820437b713defcea496681da09d9b594.jpg,"Remote Item","African American Women in Iowa Collection",1,0
9996,https://www.iowaheritage.org/items/show/9996,"Communal bath, Shinkyo commune, Nara-ken, Japan, 1968","People|Japanese|Shinkyo|Japan -- Nara-ken|1960-1970|Bathhouses|Collective settlements|Collective farms","Original artwork, reproduced as illustrations for: Sugihara, Yoshie and David W. Plath. Sensei and his people. (Berkeley, Calif.: University of California Press, 1969). P. 177.","Mizota, Kotoe",,"University of Iowa. Libraries. University Archives",1968|2008-03-03,,"Educational use only, no other permissions given. U.S. and international copyright laws may protect this item. Commercial use or distribution of this digital object is not permitted without written permission of the University Archives at The University of Iowa Libraries.","Anthropology at Iowa Digital Collection|David Plath Japanese Fieldwork Collection|David Plath Papers|In process",,,"Still image|Drawings (Visual works); Illustrations (Layout features); Pen-and-wash drawings|jpeg",https://digital.lib.uiowa.edu/,,,,,,,,,,,,,,,,,,,,,,,,,,,,,,,,,,,,,,,,,,,,,,,,"<a href=""https://digital.lib.uiowa.edu/"" target=""_blank"">View this item in its source respository</a>",,,,,,,,,,,,,,,,,,,,,,,,,,,,,https://www.iowaheritage.org/files/original/9e4f5ee33b3b7f2aeba6e42f0be67ec2.jpg,"Remote Item","African American Women in Iowa Collection",1,0
10005,https://www.iowaheritage.org/items/show/10005,"Communal kitchen, Atarashiki Mura commune, Hyuga, Japan, 1965","Kitchens|Japanese|Atarashiki Mura|Japan -- Hyuga|1960-1970|Collective settlements|Collective farms",,"Plath, David W.",,"University of Iowa. Libraries. University Archives",1965|2008-03-03,,"Educational use only, no other permissions given. U.S. and international copyright laws may protect this item. Commercial use or distribution of this digital object is not permitted without written permission of the University Archives at The University of Iowa Libraries.","Anthropology at Iowa Digital Collection|David Plath Japanese Fieldwork Collection|David Plath Papers|In process",,,"Still image|Photographs|jpeg",AM05.jpg|https://digital.lib.uiowa.edu/,,,,,,,,,,,,,,,,,,,,,,,,,,,,,,,,,,,,,,,,,,,,,,,,"<a href=""https://digital.lib.uiowa.edu/"" target=""_blank"">View this item in its source respository</a>",,,,,,,,,,,,,,,,,,,,,,,,,,,,,https://www.iowaheritage.org/files/original/86c6aba6115eeb336c54061016da79b5.jpg,"Remote Item","African American Women in Iowa Collection",1,0
9972,https://www.iowaheritage.org/items/show/9972,"Cooks preparing meal, Shinkyo commune, Nara-ken, Japan, 1965","Men|Japanese|Shinkyo|Japan -- Nara-ken|1960-1970|Women|People|Cookery|Collective settlements|Collective farms",,"Plath, David W.",,"University of Iowa. Libraries. University Archives",1965-04|2008-03-03,,"Educational use only, no other permissions given. U.S. and international copyright laws may protect this item. Commercial use or distribution of this digital object is not permitted without written permission of the University Archives at The University of Iowa Libraries.","Anthropology at Iowa Digital Collection|David Plath Japanese Fieldwork Collection|David Plath Papers|In process",,,"Still image|Photographs|jpeg",https://digital.lib.uiowa.edu/,,,,,,,,,,,,,,,,,,,,,,,,,,,,,,,,,,,,,,,,,,,,,,,,"<a href=""https://digital.lib.uiowa.edu/"" target=""_blank"">View this item in its source respository</a>",,,,,,,,,,,,,,,,,,,,,,,,,,,,,https://www.iowaheritage.org/files/original/02ff93e5b61146f268e89101a67fad8c.jpg,"Remote Item","African American Women in Iowa Collection",1,0
10047,https://www.iowaheritage.org/items/show/10047,"David Plath field notes on Japanese communes, Mar.-Apr. 1965","Collective settlements|Japanese|Plath, David W.|Shinkyo|Japan|1960-1970|Collective farms|Yamagishi Kai",,"Plath, David W.",,"University of Iowa. Libraries. University Archives",1965-03|2008-03-03,,"Educational use only, no other permissions given. U.S. and international copyright laws may protect this item. Commercial use or distribution of this digital object is not permitted without written permission of the University Archives at The University of Iowa Libraries.","Anthropology at Iowa Digital Collection|David Plath Japanese Fieldwork Collection|David Plath Papers|In process",,,"Text|Field notes|jpeg",https://digital.lib.uiowa.edu/,,,,,,,,,,,,,,,,,,,,,,,,,,,,,,,,,,,,,,,,,,,,,,,,"<a href=""https://digital.lib.uiowa.edu/"" target=""_blank"">View this item in its source respository</a>",,,,,,,,,,,,,,,,,,,,,,,,,,,,,https://www.iowaheritage.org/files/original/8c8ef631a89faf84730cfc10aa3cc225.jpg,"Remote Item","African American Women in Iowa Collection",1,0
10022,https://www.iowaheritage.org/items/show/10022,"David Plath with Prof. Kusakari Zenzo of Hokkaido Educational University, Yamagishi Kai Pioneer Farm, Hokkaido,  Japan, 1965","Men|Japanese|Plath, David W.|Yamagishi Kai|Japan -- Hokkaido|1960-1970|People|Anthropologists|Collective settlements|Collective farms",,unknown,,"University of Iowa. Libraries. University Archives",1965|2008-03-03,,"Educational use only, no other permissions given. U.S. and international copyright laws may protect this item. Commercial use or distribution of this digital object is not permitted without written permission of the University Archives at The University of Iowa Libraries.","Anthropology at Iowa Digital Collection|David Plath Japanese Fieldwork Collection|David Plath Papers|In process",,,"Still image|Photographs|jpeg",P2.jpg|https://digital.lib.uiowa.edu/,,,,,,,,,,,,,,,,,,,,,,,,,,,,,,,,,,,,,,,,,,,,,,,,"<a href=""https://digital.lib.uiowa.edu/"" target=""_blank"">View this item in its source respository</a>",,,,,,,,,,,,,,,,,,,,,,,,,,,,,https://www.iowaheritage.org/files/original/0086fec0f6d3f966afce31e77d9c9ec4.jpg,"Remote Item","African American Women in Iowa Collection",1,0
