 




﻿"Item Id","Item URI","Dublin Core:Title","Dublin Core:Subject","Dublin Core:Description","Dublin Core:Creator","Dublin Core:Source","Dublin Core:Publisher","Dublin Core:Date","Dublin Core:Contributor","Dublin Core:Rights","Dublin Core:Relation","Dublin Core:Format","Dublin Core:Language","Dublin Core:Type","Dublin Core:Identifier","Dublin Core:Coverage","Item Type Metadata:Text","Item Type Metadata:Interviewer","Item Type Metadata:Interviewee","Item Type Metadata:Location","Item Type Metadata:Transcription","Item Type Metadata:Local URL","Item Type Metadata:Original Format","Item Type Metadata:Physical Dimensions","Item Type Metadata:Duration","Item Type Metadata:Compression","Item Type Metadata:Producer","Item Type Metadata:Director","Item Type Metadata:Bit Rate/Frequency","Item Type Metadata:Time Summary","Item Type Metadata:Email Body","Item Type Metadata:Subject Line","Item Type Metadata:From","Item Type Metadata:To","Item Type Metadata:CC","Item Type Metadata:BCC","Item Type Metadata:Number of Attachments","Item Type Metadata:Standards","Item Type Metadata:Objectives","Item Type Metadata:Materials","Item Type Metadata:Lesson Plan Text","Item Type Metadata:URL","Item Type Metadata:Event Type","Item Type Metadata:Participants","Item Type Metadata:Birth Date","Item Type Metadata:Birthplace","Item Type Metadata:Death Date","Item Type Metadata:Occupation","Item Type Metadata:Biographical Text","Item Type Metadata:Bibliography","Item Type Metadata:Digital Reproduction Information","Item Type Metadata:Repository","Item Type Metadata:Repository Collection","Item Type Metadata:Contact information.","Item Type Metadata:File Name","Item Type Metadata:Notes","Item Type Metadata:Digital item created","Item Type Metadata:Digital item modified","Item Type Metadata:Executive Orders","Item Type Metadata:Record Created","Item Type Metadata:Record Modified","Item Type Metadata:Transcription2","Item Type Metadata:Source URL","Omeka Legacy File:Additional Creator","Omeka Legacy File:Transcriber","Omeka Legacy File:Producer","Omeka Legacy File:Render Device","Omeka Legacy File:Render Details","Omeka Legacy File:Capture Date","Omeka Legacy File:Capture Device","Omeka Legacy File:Capture Details","Omeka Legacy File:Change History","Omeka Legacy File:Watermark","Omeka Legacy File:Encryption","Omeka Legacy File:Compression","Omeka Legacy File:Post Processing","Omeka Image File:Width","Omeka Image File:Height","Omeka Image File:Bit Depth","Omeka Image File:Channels","Omeka Image File:Exif String","Omeka Image File:Exif Array","Omeka Image File:IPTC String","Omeka Image File:IPTC Array","Omeka Video File:Bitrate","Omeka Video File:Duration","Omeka Video File:Sample Rate","Omeka Video File:Codec","Omeka Video File:Width","Omeka Video File:Height",tags,file,itemType,collection,public,featured
68634,https://www.iowaheritage.org/items/show/68634,"Pamphlets and essays for and against suffrage in Iowa, 1910s","Women's suffrage|Iowa Equal Suffrage Association|United States -- Iowa -- Oskaloosa|1910-1920|Meetings|Organizations|Churches|Priests|Women|Men|Voting|Political elections|Political participation|Iowa Association Opposed to Women's Suffrage|United States -- Iowa -- Davenport|United States -- Iowa|United States -- Iowa -- Des Moines",,unidentified,,"Des Moines Printing Company|State Historical Society of Iowa, Des Moines",1910/1919|2011-03-24,,"Educational use only, no other permissions given. U.S. and International copyright laws may protect this item. Commercial use or distribution of this digital object is not permitted without written permission of the State Historical Society of Iowa.","Iowa Women's Suffrage|Iowa Women's Suffrage Collection|http://www.lib.iastate.edu/arch/rgrp/21-7-3.html|Pamphlets; Suffrage songs 1916; Anti-suffrage",jpeg|28|22,,"Text|Clippings (information artifacts); Fliers (printed matter); Postcards; Programs (documents); Essays",SHSDM071|suf-SHSDM071-13|http://digital.lib.uiowa.edu/cdm/ref/collection/suffrage/id/3168,,,,,,,,,,,,,,,,,,,,,,,,,,,,,,,,,,,,,,,,,,,,,,,,"<a href=""http://digital.lib.uiowa.edu/cdm/ref/collection/suffrage/id/3168"" target=""_blank"">View this item in its source respository</a>",,,,,,,,,,,,,,,,,,,,,,,,,,,,,https://www.iowaheritage.org/files/original/9ace469c1aab7c9acd07650970a84064.jpg,"Remote Item",,1,0
68628,https://www.iowaheritage.org/items/show/68628,"Joseph A. Dugdale correspondence, 1870","Women's suffrage|Dugdale, Joseph A., 1810-1896|Iowa Peace Society|United States -- Iowa|1870-1880|Politics & government|Pacifism|Meetings|Churches|Abolition movement|Activists|United States -- Iowa -- Wapello|United States -- Iowa -- Mount Pleasant","Dugdale was a Quaker reformer devoted to social justice causes including the anti-slavery movement, the woman’s rights movement, various peace movements, prison reform and aiding Indians.  Dugdale called for an Iowa Woman’s Enfranchisement Convention to be held in Mount Pleasant June 16-17 and an Iowa Peace Convention to be held on June 18. The Iowa Peace Society was established at this 1870 convention.","Carpenter, Cyrus Clay, 1829-1898; Child, Mrs (Lydia Maria), 1802-1880",,"State Historical Society of Iowa, Des Moines",1870|2011-03-24,,"Educational use only, no other permissions given. U.S. and International copyright laws may protect this item. Commercial use or distribution of this digital object is not permitted without written permission of the State Historical Society of Iowa.","Iowa Women's Suffrage|Dugdale, Joseph|http://infohawk.uiowa.edu/F?func=direct&doc_number=004335876&local_base=iow06|Correspondence re: Mt. Pleasant suffrage convention 1870",jpeg|26|21,,Text|Correspondence,"SHSDM879|suf-SHSDM879-20; 004335876|http://digital.lib.uiowa.edu/cdm/ref/collection/suffrage/id/2954",,,,,,,,,,,,,,,,,,,,,,,,,,,,,,,,,,,,,,,,,,,,,,,,"<a href=""http://digital.lib.uiowa.edu/cdm/ref/collection/suffrage/id/2954"" target=""_blank"">View this item in its source respository</a>",,,,,,,,,,,,,,,,,,,,,,,,,,,,,https://www.iowaheritage.org/files/original/7f74da46771607131da89c6e7d5becff.jpg,"Remote Item",,1,0
68625,https://www.iowaheritage.org/items/show/68625,"Goletha L. Trotter funeral program, December 5, 1984","Women's suffrage|Trotter, Goletha L.|Order of the Eastern Star|United States -- Iowa -- Des Moines|1980-1990|Mothers|Families|Churches|Organizations|National Association for the Advancement of Colored People",,unidentified,,"Iowa Women's Archives",1984-12-05|2011-02-28,,"Educational use only, no other permissions given. U.S. and International copyright laws may protect this item. Commercial use or distribution of this digital object is not permitted without written permission of the Iowa Women's Archives.","Iowa Women's Suffrage|Fowler, Gwendolyn Wilson|Obituaries and funeral programs, T",jpeg|22|14,,"Text; Still image|Programs (documents)",IWA0365|suf0365-08-04|http://digital.lib.uiowa.edu/cdm/ref/collection/suffrage/id/2880,,,,,,,,,,,,,,,,,,,,,,,,,,,,,,,,,,,,,,,,,,,,,,,,"<a href=""http://digital.lib.uiowa.edu/cdm/ref/collection/suffrage/id/2880"" target=""_blank"">View this item in its source respository</a>",,,,,,,,,,,,,,,,,,,,,,,,,,,,,https://www.iowaheritage.org/files/original/f432f4b311caceb00587d3c5552e8715.jpg,"Remote Item",,1,0
68624,https://www.iowaheritage.org/items/show/68624,"Mary Lumpkin Ritchey funeral program, July 23, 1995","Women's suffrage|Ritchey, Mary Lumpkin|Young Women's Christian Association|United States -- Iowa -- Des Moines|1990-2000|Mothers|Families|Churches|Organizations|Voting",,unidentified,,"Iowa Women's Archives",1995-07-23|2011-02-28,,"Educational use only, no other permissions given. U.S. and International copyright laws may protect this item. Commercial use or distribution of this digital object is not permitted without written permission of the Iowa Women's Archives.","Iowa Women's Suffrage|Fowler, Gwendolyn Wilson|Obituaries and funeral programs, R",jpeg|22|14,,"Text; Still image|Programs (documents)",IWA0365|suf0365-08-02|http://digital.lib.uiowa.edu/cdm/ref/collection/suffrage/id/2875,,,,,,,,,,,,,,,,,,,,,,,,,,,,,,,,,,,,,,,,,,,,,,,,"<a href=""http://digital.lib.uiowa.edu/cdm/ref/collection/suffrage/id/2875"" target=""_blank"">View this item in its source respository</a>",,,,,,,,,,,,,,,,,,,,,,,,,,,,,https://www.iowaheritage.org/files/original/6e1823552c3a5595ed00ef373cec0b78.jpg,"Remote Item",,1,0
68623,https://www.iowaheritage.org/items/show/68623,"Edna Morris funeral program, June 9, 1984","Women's suffrage|Morris, Edna|League of Women Voters (U.S.)|United States -- Iowa -- Des Moines|1980-1990|Mothers|Families|Churches|Organizations|Order of the Eastern Star",,unidentified,,"Iowa Women's Archives",1984-06-09|2011-02-28,,"Educational use only, no other permissions given. U.S. and International copyright laws may protect this item. Commercial use or distribution of this digital object is not permitted without written permission of the Iowa Women's Archives.","Iowa Women's Suffrage|Fowler, Gwendolyn Wilson|Obituaries and funeral programs, M",jpeg|22|14,,"Text; Still image|Programs (documents)",IWA0365|suf0365-07-17|http://digital.lib.uiowa.edu/cdm/ref/collection/suffrage/id/2870,,,,,,,,,,,,,,,,,,,,,,,,,,,,,,,,,,,,,,,,,,,,,,,,"<a href=""http://digital.lib.uiowa.edu/cdm/ref/collection/suffrage/id/2870"" target=""_blank"">View this item in its source respository</a>",,,,,,,,,,,,,,,,,,,,,,,,,,,,,https://www.iowaheritage.org/files/original/d9d5ba4cac4796295b870725144a7581.jpg,"Remote Item",,1,0
68622,https://www.iowaheritage.org/items/show/68622,"Birdie B. Lewis funeral program, November 4, 1988","Women's suffrage|Lewis, Birdie B.|United States -- Iowa -- Des Moines|1980-1990|Mothers|Families|Churches|Organizations",,unidentified,,"Iowa Women's Archives",1988-11-04|2011-02-28,,"Educational use only, no other permissions given. U.S. and International copyright laws may protect this item. Commercial use or distribution of this digital object is not permitted without written permission of the Iowa Women's Archives.","Iowa Women's Suffrage|Fowler, Gwendolyn Wilson|Obituaries and funeral programs, L",jpeg|22|14,,"Text; Still image|Programs (documents)",IWA0365|suf0365-07-16|http://digital.lib.uiowa.edu/cdm/ref/collection/suffrage/id/2865,,,,,,,,,,,,,,,,,,,,,,,,,,,,,,,,,,,,,,,,,,,,,,,,"<a href=""http://digital.lib.uiowa.edu/cdm/ref/collection/suffrage/id/2865"" target=""_blank"">View this item in its source respository</a>",,,,,,,,,,,,,,,,,,,,,,,,,,,,,https://www.iowaheritage.org/files/original/8815d3848d69c0fb31ff8df8699a7d2d.jpg,"Remote Item",,1,0
68621,https://www.iowaheritage.org/items/show/68621,"Adah Frances Johnson funeral program, February 3, 1988","Women's suffrage|Johnson, Adah Frances|Young Women's Christian Association|United States -- Iowa -- Des Moines|1980-1990|Mothers|Families|Churches|Organizations",,unidentified,,"Iowa Women's Archives",1988-02-03|2011-02-28,,"Educational use only, no other permissions given. U.S. and International copyright laws may protect this item. Commercial use or distribution of this digital object is not permitted without written permission of the Iowa Women's Archives.","Iowa Women's Suffrage|Fowler, Gwendolyn Wilson|Obituaries and funeral programs, J",jpeg|14|11,,"Text; Still image|Programs (documents)",IWA0365|suf0365-07-15|http://digital.lib.uiowa.edu/cdm/ref/collection/suffrage/id/2860,,,,,,,,,,,,,,,,,,,,,,,,,,,,,,,,,,,,,,,,,,,,,,,,"<a href=""http://digital.lib.uiowa.edu/cdm/ref/collection/suffrage/id/2860"" target=""_blank"">View this item in its source respository</a>",,,,,,,,,,,,,,,,,,,,,,,,,,,,,https://www.iowaheritage.org/files/original/1b878e4f079e8920c9935ef35a15f66b.jpg,"Remote Item",,1,0
68620,https://www.iowaheritage.org/items/show/68620,"Mary Hardaway and Elizabeth ""Alta"" Herndon funeral programs, 1980s","Women's suffrage|Hardaway, Mary|Order of the Eastern Star|United States -- Iowa -- Des Moines|1980-1990|National Association for the Advancement of Colored People|Mothers|Families|Churches|Organizations|Herndon, Elizabeth (Alta)",,unidentified,,"Iowa Women's Archives",1980/1989|2011-02-28,,"Educational use only, no other permissions given. U.S. and International copyright laws may protect this item. Commercial use or distribution of this digital object is not permitted without written permission of the Iowa Women's Archives.","Iowa Women's Suffrage|Fowler, Gwendolyn Wilson|Obituaries and funeral programs, H",jpeg|22|14,,"Text; Still image|Programs (documents)",IWA0365|suf0365-07-14|http://digital.lib.uiowa.edu/cdm/ref/collection/suffrage/id/2853,,,,,,,,,,,,,,,,,,,,,,,,,,,,,,,,,,,,,,,,,,,,,,,,"<a href=""http://digital.lib.uiowa.edu/cdm/ref/collection/suffrage/id/2853"" target=""_blank"">View this item in its source respository</a>",,,,,,,,,,,,,,,,,,,,,,,,,,,,,https://www.iowaheritage.org/files/original/108cc9291ea644b707867f2bd2e1925a.jpg,"Remote Item",,1,0
68619,https://www.iowaheritage.org/items/show/68619,"Fannie Wilson Cooper funeral program, January 8, 1980","Women's suffrage|Cooper, Fannie Wilson|United States -- Iowa -- Des Moines|1980-1990|Mothers|Families|Churches|Organizations",,unidentified,,"Iowa Women's Archives",1980-01-08|2011-02-28,,"Educational use only, no other permissions given. U.S. and International copyright laws may protect this item. Commercial use or distribution of this digital object is not permitted without written permission of the Iowa Women's Archives.","Iowa Women's Suffrage|Fowler, Gwendolyn Wilson|Obituaries and funeral programs, C",jpeg|22|14,,"Text; Still image|Programs (documents)",IWA0365|suf0365-07-10|http://digital.lib.uiowa.edu/cdm/ref/collection/suffrage/id/2844,,,,,,,,,,,,,,,,,,,,,,,,,,,,,,,,,,,,,,,,,,,,,,,,"<a href=""http://digital.lib.uiowa.edu/cdm/ref/collection/suffrage/id/2844"" target=""_blank"">View this item in its source respository</a>",,,,,,,,,,,,,,,,,,,,,,,,,,,,,https://www.iowaheritage.org/files/original/0358a22f8980a8a5c66c410f0d971093.jpg,"Remote Item",,1,0
68616,https://www.iowaheritage.org/items/show/68616,"Leaders and pioneers of the Professional Women's League, 1890s","Women's suffrage|Petzold, Gertrud von, 1876-1952|Professional Women's League (Des Moines, Iowa)|United States -- Iowa -- Des Moines|1890-1900|Safford, Mary A|Jenney, Marie H.|Fuchs, Adele|Women|Clergy|Organizations|Churches",,unidentified,,"Iowa Women's Archives",189-|2011-02-14,,"Educational use only, no other permissions given. U.S. and International copyright laws may protect this item. Commercial use or distribution of this digital object is not permitted without written permission of the Iowa Women's Archives.","Iowa Women's Suffrage|Professional Women's League, Des Moines, Iowa|http://www.lib.uiowa.edu/collguides/?IWA0110|Photos",jpeg|22|14,,"Still image|Portraits; Photographs",IWA0110|suf0110-05-20|http://digital.lib.uiowa.edu/cdm/ref/collection/suffrage/id/2834,,,,,,,,,,,,,,,,,,,,,,,,,,,,,,,,,,,,,,,,,,,,,,,,"<a href=""http://digital.lib.uiowa.edu/cdm/ref/collection/suffrage/id/2834"" target=""_blank"">View this item in its source respository</a>",,,,,,,,,,,,,,,,,,,,,,,,,,,,,https://www.iowaheritage.org/files/original/96884aaf2c1b54c250ad12c0f7300dc3.jpg,"Remote Item",,1,0
