 




﻿"Item Id","Item URI","Dublin Core:Title","Dublin Core:Subject","Dublin Core:Description","Dublin Core:Creator","Dublin Core:Source","Dublin Core:Publisher","Dublin Core:Date","Dublin Core:Contributor","Dublin Core:Rights","Dublin Core:Relation","Dublin Core:Format","Dublin Core:Language","Dublin Core:Type","Dublin Core:Identifier","Dublin Core:Coverage","Item Type Metadata:Text","Item Type Metadata:Interviewer","Item Type Metadata:Interviewee","Item Type Metadata:Location","Item Type Metadata:Transcription","Item Type Metadata:Local URL","Item Type Metadata:Original Format","Item Type Metadata:Physical Dimensions","Item Type Metadata:Duration","Item Type Metadata:Compression","Item Type Metadata:Producer","Item Type Metadata:Director","Item Type Metadata:Bit Rate/Frequency","Item Type Metadata:Time Summary","Item Type Metadata:Email Body","Item Type Metadata:Subject Line","Item Type Metadata:From","Item Type Metadata:To","Item Type Metadata:CC","Item Type Metadata:BCC","Item Type Metadata:Number of Attachments","Item Type Metadata:Standards","Item Type Metadata:Objectives","Item Type Metadata:Materials","Item Type Metadata:Lesson Plan Text","Item Type Metadata:URL","Item Type Metadata:Event Type","Item Type Metadata:Participants","Item Type Metadata:Birth Date","Item Type Metadata:Birthplace","Item Type Metadata:Death Date","Item Type Metadata:Occupation","Item Type Metadata:Biographical Text","Item Type Metadata:Bibliography","Item Type Metadata:Digital Reproduction Information","Item Type Metadata:Repository","Item Type Metadata:Repository Collection","Item Type Metadata:Contact information.","Item Type Metadata:File Name","Item Type Metadata:Notes","Item Type Metadata:Digital item created","Item Type Metadata:Digital item modified","Item Type Metadata:Executive Orders","Item Type Metadata:Record Created","Item Type Metadata:Record Modified","Item Type Metadata:Transcription2","Item Type Metadata:Source URL","Omeka Legacy File:Additional Creator","Omeka Legacy File:Transcriber","Omeka Legacy File:Producer","Omeka Legacy File:Render Device","Omeka Legacy File:Render Details","Omeka Legacy File:Capture Date","Omeka Legacy File:Capture Device","Omeka Legacy File:Capture Details","Omeka Legacy File:Change History","Omeka Legacy File:Watermark","Omeka Legacy File:Encryption","Omeka Legacy File:Compression","Omeka Legacy File:Post Processing","Omeka Image File:Width","Omeka Image File:Height","Omeka Image File:Bit Depth","Omeka Image File:Channels","Omeka Image File:Exif String","Omeka Image File:Exif Array","Omeka Image File:IPTC String","Omeka Image File:IPTC Array","Omeka Video File:Bitrate","Omeka Video File:Duration","Omeka Video File:Sample Rate","Omeka Video File:Codec","Omeka Video File:Width","Omeka Video File:Height",tags,file,itemType,collection,public,featured
9835,https://www.iowaheritage.org/items/show/9835,"Hawkeye 1955 [excerpt]","Universities & colleges|African Americans|University of Iowa|United States -- Iowa -- Iowa City|1950-1960|Students|Women|Men|Student organizations",,"Student Publications, Inc.",,"University of Iowa. Libraries. University Archives",1955|2007-10-29,,"Educational use only, no other permissions given. U.S. and international copyright laws may protect this digital object. Commercial use or distribution of the object is not permitted without prior permission of the copyright holder.","African American Women in Iowa Digital Collection; African American Women Students at the University of Iowa, 1910-1960|http://digital.lib.uiowa.edu/aaws/|Yearbooks and Student Newspapers|http://www.lib.uiowa.edu/spec-coll/archives/faq/faqyearbooks.htm",jpeg|28|22,,"Text; Still image|Yearbooks",RG02.10|166295411|https://digital.lib.uiowa.edu/,,,,,,,,,,,,,,,,,,,,,,,,,,,,,,,,,,,,,,,,,,,,,,,,"<a href=""https://digital.lib.uiowa.edu/"" target=""_blank"">View this item in its source respository</a>",,,,,,,,,,,,,,,,,,,,,,,,,,,,,https://www.iowaheritage.org/files/original/5cc942391f9f0c677d91358c5aede760.jpg,"Remote Item","African American Women in Iowa Collection",1,0
9836,https://www.iowaheritage.org/items/show/9836,"Hawkeye 1956 [excerpt]","Universities & colleges|African Americans|University of Iowa|United States -- Iowa -- Iowa City|1950-1960|Students|Women|Men|Student organizations",,"Student Publications, Inc.",,"University of Iowa. Libraries. University Archives",1956|2007-10-29,,"Educational use only, no other permissions given. U.S. and international copyright laws may protect this digital object. Commercial use or distribution of the object is not permitted without prior permission of the copyright holder.","African American Women in Iowa Digital Collection; African American Women Students at the University of Iowa, 1910-1960|http://digital.lib.uiowa.edu/aaws/|Yearbooks and Student Newspapers|http://www.lib.uiowa.edu/spec-coll/archives/faq/faqyearbooks.htm",jpeg|28|22,,"Text; Still image|Yearbooks",RG02.10|166295411|https://digital.lib.uiowa.edu/,,,,,,,,,,,,,,,,,,,,,,,,,,,,,,,,,,,,,,,,,,,,,,,,"<a href=""https://digital.lib.uiowa.edu/"" target=""_blank"">View this item in its source respository</a>",,,,,,,,,,,,,,,,,,,,,,,,,,,,,https://www.iowaheritage.org/files/original/4b3eeb4b5fa8ddeac5e84ce790b07043.jpg,"Remote Item","African American Women in Iowa Collection",1,0
9837,https://www.iowaheritage.org/items/show/9837,"Hawkeye 1950 [excerpt]","Universities & colleges|African Americans|University of Iowa|United States -- Iowa -- Iowa City|1950-1960|Students|Women|Men|Student organizations",,"Student Publications, Inc.",,"University of Iowa. Libraries. University Archives",1950|2007-10-29,,"Educational use only, no other permissions given. U.S. and international copyright laws may protect this digital object. Commercial use or distribution of the object is not permitted without prior permission of the copyright holder.","African American Women in Iowa Digital Collection; African American Women Students at the University of Iowa, 1910-1960|http://digital.lib.uiowa.edu/aaws/|Yearbooks and Student Newspapers|http://www.lib.uiowa.edu/spec-coll/archives/faq/faqyearbooks.htm",jpeg|28|22,,"Text; Still image|Yearbooks",RG02.10|166295411|https://digital.lib.uiowa.edu/,,,,,,,,,,,,,,,,,,,,,,,,,,,,,,,,,,,,,,,,,,,,,,,,"<a href=""https://digital.lib.uiowa.edu/"" target=""_blank"">View this item in its source respository</a>",,,,,,,,,,,,,,,,,,,,,,,,,,,,,https://www.iowaheritage.org/files/original/d45bb45a95fa5a501936678162dacfb8.jpg,"Remote Item","African American Women in Iowa Collection",1,0
9855,https://www.iowaheritage.org/items/show/9855,"""Texas girl, 17, collects majority of male votes,"" December 12, 1955","Beauty contests|African Americans|Berry, Dora Martin|University of Iowa|United States -- Iowa -- Iowa City|1950-1960|Students|Race relations",,unknown,,"Bystander (Des Moines, Iowa)|University of Iowa. Libraries. University Archives",1955-12-16|2008-01-15,,"Educational use only, no other permissions given. U.S. and international copyright laws may protect this digital object. Commercial use or distribution of the object is not permitted without prior permission of the copyright holder.","African American Women in Iowa Digital Collection; African American Women Students at the University of Iowa, 1910-1960|http://digital.lib.uiowa.edu/aaws/|Alumni and Former Students Vertical Files|http://lib.uiowa.edu/collguides/?RG01.0015.01|Martin, Dora",jpeg,,"Text; Still image|Clippings (Information artifacts)",RG01.15.01|166295411|https://digital.lib.uiowa.edu/,,,,,,,,,,,,,,,,,,,,,,,,,,,,,,,,,,,,,,,,,,,,,,,,"<a href=""https://digital.lib.uiowa.edu/"" target=""_blank"">View this item in its source respository</a>",,,,,,,,,,,,,,,,,,,,,,,,,,,,,https://www.iowaheritage.org/files/original/cc1d48dc43fd8669e9f6dec425ad7a4b.jpg,"Remote Item","African American Women in Iowa Collection",1,0
9858,https://www.iowaheritage.org/items/show/9858,"""Presenting Dora Lee, queen of the campus,"" February 9, 1956","Beauty contests|African Americans|Berry, Dora Martin|1950-1960|Race relations|Students|Lucy, Autherine, 1930-","These articles contrast the experiences of two African American college students, Dora Martin and Autherine Lucy.",unknown,,"Daily Mail (London, England)|University of Iowa. Libraries. University Archives",1956-02-09|2008-01-15,,"Educational use only, no other permissions given. U.S. and international copyright laws may protect this digital object. Commercial use or distribution of the object is not permitted without prior permission of the copyright holder.","African American Women in Iowa Digital Collection; African American Women Students at the University of Iowa, 1910-1960|http://digital.lib.uiowa.edu/aaws/|Alumni and Former Students Vertical Files|http://lib.uiowa.edu/collguides/?RG01.0015.01|Martin, Dora",jpeg,,"Text; Still image|Clippings (Information artifacts)",RG01.15.01|166295411|https://digital.lib.uiowa.edu/,,,,,,,,,,,,,,,,,,,,,,,,,,,,,,,,,,,,,,,,,,,,,,,,"<a href=""https://digital.lib.uiowa.edu/"" target=""_blank"">View this item in its source respository</a>",,,,,,,,,,,,,,,,,,,,,,,,,,,,,https://www.iowaheritage.org/files/original/d76c003e4c05a5e9169e4edfb108f32a.jpg,"Remote Item","African American Women in Iowa Collection",1,0
9859,https://www.iowaheritage.org/items/show/9859,"Correspondence between Orval Nielsen and University of Iowa President Virgil Hancher, December 1955","Students|African Americans|Hancher, Virgil Melvin, 1896-1965|University of Iowa|United States -- Iowa -- Iowa City|1950-1960|Beauty contests|Race relations|Nielsen, Orval|Berry, Dora Martin|United States -- Iowa -- LeMars|","Correspondence between LeMars Elementary Schools Principal Orval Nielsen and University of Iowa President Virgil Hancher regarding the election of an African American homecoming queen.","Hancher, Virgil Melvin, 1896-1965; Nielsen, Orval",,"University of Iowa. Libraries. University Archives",1955-12|2008-01-16,,"Educational use only, no other permissions given. U.S. and international copyright laws may protect this digital object. Commercial use or distribution of the object is not permitted without prior permission of the copyright holder.","African American Women in Iowa Digital Collection; African American Women Students at the University of Iowa, 1910-1960|http://digital.lib.uiowa.edu/aaws/|Alumni and Former Students Vertical Files|http://lib.uiowa.edu/collguides/?RG01.0015.01|Martin, Dora",jpeg,,Text|Correspondence,RG01.15.01|166295411|https://digital.lib.uiowa.edu/,,,,,,,,,,,,,,,,,,,,,,,,,,,,,,,,,,,,,,,,,,,,,,,,"<a href=""https://digital.lib.uiowa.edu/"" target=""_blank"">View this item in its source respository</a>",,,,,,,,,,,,,,,,,,,,,,,,,,,,,https://www.iowaheritage.org/files/original/d933265d43cdfea82ebb04ae7385a7e5.jpg,"Remote Item","African American Women in Iowa Collection",1,0
9943,https://www.iowaheritage.org/items/show/9943,"Hawkeye 1953 [excerpt]","Universities & colleges|African Americans|University of Iowa|United States -- Iowa -- Iowa City|1950-1960|Students|Women|Men|Student organizations",,"Student Publications, Inc.",,"University of Iowa. Libraries. University Archives",1953|2008-01-17,,"Educational use only, no other permissions given. U.S. and international copyright laws may protect this digital object. Commercial use or distribution of the object is not permitted without prior permission of the copyright holder.","African American Women in Iowa Digital Collection; African American Women Students at the University of Iowa, 1910-1960|http://digital.lib.uiowa.edu/aaws/|Yearbooks and Student Newspapers|http://www.lib.uiowa.edu/spec-coll/archives/faq/faqyearbooks.htm",jpeg|28|22,,"Text; Still image|Yearbooks",RG02.10|166295411|https://digital.lib.uiowa.edu/,,,,,,,,,,,,,,,,,,,,,,,,,,,,,,,,,,,,,,,,,,,,,,,,"<a href=""https://digital.lib.uiowa.edu/"" target=""_blank"">View this item in its source respository</a>",,,,,,,,,,,,,,,,,,,,,,,,,,,,,https://www.iowaheritage.org/files/original/449b82b4b1ff175daa06d531b7246cc1.jpg,"Remote Item","African American Women in Iowa Collection",1,0
9948,https://www.iowaheritage.org/items/show/9948,"Esther Walls' speeches, 1959","Women|African Americans|Walls, Esther J., 1926-|American Library Association. Young Adult Services Division|Africa|1950-1960|Race relations|Travel|Books|Libraries|Librarians","Contents: Speech given to Milwaukee Public Library about the ALA Young Adult Services Division Project on Africa -- ""The Role of the Negro Woman: Its Implications for Today"" -- Speech given to NYPL branch library in Mott Haven about traveling in West Africa.","Walls, Esther J., 1926-",,"University of Iowa. Libraries. Iowa Women's Archives",1959|2007-09-12,,"Educational use only, no other permissions given. U.S. and international copyright laws may protect this item. Commercial use or distribution of this digital object is not permitted without written permission of the Iowa Women's Archives.","African American Women in Iowa Digital Collection|http://digital.lib.uiowa.edu/aaws/|Esther J. Walls papers, 1860s-1996|http://www.lib.uiowa.edu/collguides/?IWA0288|Writings: Speeches, 1950-1959|http://www.lib.uiowa.edu/iwa/Topical_holdings_lists/AAhold.html",jpeg,,Text|Speeches,"IWA0288|Writings - Speeches 1959|166295411|https://digital.lib.uiowa.edu/",,,,,,,,,,,,,,,,,,,,,,,,,,,,,,,,,,,,,,,,,,,,,,,,"<a href=""https://digital.lib.uiowa.edu/"" target=""_blank"">View this item in its source respository</a>",,,,,,,,,,,,,,,,,,,,,,,,,,,,,https://www.iowaheritage.org/files/original/235cc6dcefdb675644d5b701272665d4.jpg,"Remote Item","African American Women in Iowa Collection",1,0
9955,https://www.iowaheritage.org/items/show/9955,"Esther Walls' general correspondence, 1950-1959","Librarians|African Americans|Walls, Esther J., 1926-|New York Public Library|United States -- New York -- New York|1950-1960|Graduate students|Universities & colleges|Education|Examinations|Publishers|Publishing industry|Libraries|Jazz|Reading|Students|Books|Freehafer, Edward Geier, 1909-1985|Cory, John Mackenzie|Riley, Elizabeth|Chapman, Gilbert W.|Brown, Constance|Martin, Lowell Arthur, 1912-|Lester, Seelig L.|Thomas Y. Crowell, Publishers|Yale & Towne Manufacturing Company|New York (N.Y.). Board of Education|Rutgers University. Graduate School of Library Service|International House (New York, N.Y.)","Contents: Acceptance of invitation to conference, Mar. 2, 1959; Approval of grade 4 report topic, Mar. 21, 1955; Approval to not do grade 4 report and take executive training seminars, Oct. 31, 1955; Approval to take executive training seminars and assignment, Jan. 24, 1956; Edward Freehafer's letter of compliment, Oct. 9, 1958; Elizabeth Riley encouraging authoring a book on jazz, Jan. 19, 1955; Gilbert Chapman's thank you for the report, Sept. 16, 1958; Invitation to Holiday Hills Conference, Feb. 25, 1959; Invitation to ride to conference with Edward Freehafer, Apr. 10, 1959; Letter accompanying Douglas book galleys, Apr. 19, 1956; Permission request for grade 4 report topic, Feb. 23, 1955; Recommendation from Samuel Gompers Voc. and Tech. H.S., Apr. 28, 1954; Recommendation to eligible list for the grade of Supervising Librarian, Jul. 2, 1956; Request to take seminar instead of writing report, Oct. 10, 1955; Thank you from Charles Spiegler, Food Trades Voc. H.S., Oct. 13, 1954; Thank you from Constance Brown, Oct. 21, 1952; Thank you from Dean Lowell Martin, Rutgers, Feb. 13, 1959; Thank you from Edward Freehafer, May 24, 1955; Thank you from Elizabeth Riley, Dec. 30, 1955; Thank you from Mary T., Aug. 14, 1950; Thank you from Seelig Lester, Samuel Gompers Voc. and Tech. H.S., May 22, 1956; Thank you letter from Elizabeth Riley, July 31, 1956","Walls, Esther J., 1926-",,"University of Iowa. Iowa Women's Archives",1950/1959|2007-09-12,,"Educational use only, no other permissions given. U.S. and international copyright laws may protect this item. Commercial use or distribution of this digital object is not permitted without written permission of the Iowa Women's Archives.","African American Women in Iowa Digital Collection|http://digital.lib.uiowa.edu/aaws/|Esther J. Walls papers, 1860s-1996|http://www.lib.uiowa.edu/collguides/?IWA0288|Correspondence: General, 1950-1959|http://www.lib.uiowa.edu/iwa/Topical_holdings_lists/AAhold.html",jpeg,,Text|Correspondence,"IWA0288|Correspondence - General 1950-1959|166295411|https://digital.lib.uiowa.edu/",,,,,,,,,,,,,,,,,,,,,,,,,,,,,,,,,,,,,,,,,,,,,,,,"<a href=""https://digital.lib.uiowa.edu/"" target=""_blank"">View this item in its source respository</a>",,,,,,,,,,,,,,,,,,,,,,,,,,,,,https://www.iowaheritage.org/files/original/3aefbae5ecd4cda60c12dcd94e64a351.jpg,"Remote Item","African American Women in Iowa Collection",1,0
9960,https://www.iowaheritage.org/items/show/9960,"Invitations received and programs attended by Esther Walls, 1959-1965","Activists|African Americans|Walls, Esther J., 1926-|Union soudanaise R.D.A.|United States -- New York -- New York|1950-1960|Banquets|International organizations|Librarians|Organizations|Parties|Receptions|Women|Adjei, Ako|Quaison-Sackey, Alex|Ondo, Bonjean-Franc¸ois|American Library Association|United Nations|Milwaukee Public Schools||Mali|Ghana|United States -- Wisconsin -- Milwaukee|United States -- New York -- New Rochelle|1960-1970|1970-1980","Contents: 4eme Semaine de la Jeunesse de l'USRDA, Jul. 3-11, 1965;  ALA Watch for these new books, African Encounter; Buffet luncheon and High Life party invitation, Sept. 30, 1961; Carte d'invite no.49, Semaine de la Jeunesse, Mali; Conference program U.S. and Africa, Apr. 29, 1961; High Life buffet dinner invitation, Mar. 18, 1961; Invitation to 4eme Semaine de la Jeunesse, Mali, Jul. 7, 1965; Invitation to reception Carnegie Endowment Center, Dec. 30, 1959; Invitation to reception U.N., Oct. 2, 1959; Invitation to reception U.N., Sept. 21, 1959; Invitation to reception U.N., Jul. 1, 1961; Invitation to reception U.N., Mar. 7, 1960; Luncheon program, 2nd National Press briefing, Mar. 24, 1972; National Assembly admit bearer, Jul. 2, 1959; U.N. reception invitation, Oct. 2, 1961; UN reception invitation, Sept. 21, 1965; UN reception Republique Gabonaise, Sept. 17, 1965","Walls, Esther J., 1926-",,"University of Iowa. Iowa Women's Archives",1959/1965|2007-09-12,,"Educational use only, no other permissions given. U.S. and international copyright laws may protect this item. Commercial use or distribution of this digital object is not permitted without written permission of the Iowa Women's Archives.","African American Women in Iowa Digital Collection|http://digital.lib.uiowa.edu/aaws/|Esther J. Walls papers, 1860s-1996|http://www.lib.uiowa.edu/collguides/?IWA0288|Correspondence: Invitations and programs, 1959-1965|http://www.lib.uiowa.edu/iwa/Topical_holdings_lists/AAhold.html",jpeg,,"Text|Invitations; Programs","IWA0288|Correspondence - Invitations and Programs 1959-1965|166295411|https://digital.lib.uiowa.edu/",,,,,,,,,,,,,,,,,,,,,,,,,,,,,,,,,,,,,,,,,,,,,,,,"<a href=""https://digital.lib.uiowa.edu/"" target=""_blank"">View this item in its source respository</a>",,,,,,,,,,,,,,,,,,,,,,,,,,,,,https://www.iowaheritage.org/files/original/0cd6dc56d873325cb89eaa386ed9b0a6.jpg,"Remote Item","African American Women in Iowa Collection",1,0
