 




﻿"Item Id","Item URI","Dublin Core:Title","Dublin Core:Subject","Dublin Core:Description","Dublin Core:Creator","Dublin Core:Source","Dublin Core:Publisher","Dublin Core:Date","Dublin Core:Contributor","Dublin Core:Rights","Dublin Core:Relation","Dublin Core:Format","Dublin Core:Language","Dublin Core:Type","Dublin Core:Identifier","Dublin Core:Coverage","Item Type Metadata:Text","Item Type Metadata:Interviewer","Item Type Metadata:Interviewee","Item Type Metadata:Location","Item Type Metadata:Transcription","Item Type Metadata:Local URL","Item Type Metadata:Original Format","Item Type Metadata:Physical Dimensions","Item Type Metadata:Duration","Item Type Metadata:Compression","Item Type Metadata:Producer","Item Type Metadata:Director","Item Type Metadata:Bit Rate/Frequency","Item Type Metadata:Time Summary","Item Type Metadata:Email Body","Item Type Metadata:Subject Line","Item Type Metadata:From","Item Type Metadata:To","Item Type Metadata:CC","Item Type Metadata:BCC","Item Type Metadata:Number of Attachments","Item Type Metadata:Standards","Item Type Metadata:Objectives","Item Type Metadata:Materials","Item Type Metadata:Lesson Plan Text","Item Type Metadata:URL","Item Type Metadata:Event Type","Item Type Metadata:Participants","Item Type Metadata:Birth Date","Item Type Metadata:Birthplace","Item Type Metadata:Death Date","Item Type Metadata:Occupation","Item Type Metadata:Biographical Text","Item Type Metadata:Bibliography","Item Type Metadata:Digital Reproduction Information","Item Type Metadata:Repository","Item Type Metadata:Repository Collection","Item Type Metadata:Contact information.","Item Type Metadata:File Name","Item Type Metadata:Notes","Item Type Metadata:Digital item created","Item Type Metadata:Digital item modified","Item Type Metadata:Executive Orders","Item Type Metadata:Record Created","Item Type Metadata:Record Modified","Item Type Metadata:Transcription2","Item Type Metadata:Source URL","Omeka Legacy File:Additional Creator","Omeka Legacy File:Transcriber","Omeka Legacy File:Producer","Omeka Legacy File:Render Device","Omeka Legacy File:Render Details","Omeka Legacy File:Capture Date","Omeka Legacy File:Capture Device","Omeka Legacy File:Capture Details","Omeka Legacy File:Change History","Omeka Legacy File:Watermark","Omeka Legacy File:Encryption","Omeka Legacy File:Compression","Omeka Legacy File:Post Processing","Omeka Image File:Width","Omeka Image File:Height","Omeka Image File:Bit Depth","Omeka Image File:Channels","Omeka Image File:Exif String","Omeka Image File:Exif Array","Omeka Image File:IPTC String","Omeka Image File:IPTC Array","Omeka Video File:Bitrate","Omeka Video File:Duration","Omeka Video File:Sample Rate","Omeka Video File:Codec","Omeka Video File:Width","Omeka Video File:Height",tags,file,itemType,collection,public,featured
7908,https://www.iowaheritage.org/items/show/7908,"If it isn't one thing it's another.","Human nature|Snow|weather|winter|floods|floods.",,"Darling, Jay N. (Jay Norwood), 1876-1962","The Editorial cartoons of J.N. ""Ding"" Darling [electronic resource] : The Cowles Collection, Drake University, 1912-1962",,1936/03/17|1936,,"Copyright is owned by the ""Ding"" Darling Wildlife Society; it is administered on behalf of the Society by The University of Iowa. While use within the classroom is encouraged without specific authorization, publishing this cartoon in any format requires written permission. See policy and permissions procedure at: http://www.lib.uiowa.edu/spec-coll/services/dingdarling_fees.html","Cowles Library, Drake University, 2507 University Ave., Des Moines, IA 50311-4505.",,,,"360317.jpg|http://ddr.lib.drake.edu/u?/ddarling,4837",,,,,,,,,,,,,,,,,,,,,,,,,,,,,,,,,,,,,,,,,,,,,,,,"<a href=""http://ddr.lib.drake.edu/u?/ddarling,4837"" target=""_blank"">View this item in its source respository</a>",,,,,,,,,,,,,,,,,,,,,,,,,,,,,https://www.iowaheritage.org/files/original/40f916617e85cc96b54b75de8f967023.jpg,"Remote Item","Editorial Cartoons of J.N. ""Ding"" Darling, Drake University",1,0
8056,https://www.iowaheritage.org/items/show/8056,"Oh, by the way, are those drought relief plans done yet?","Human nature|Floods.|disasters|floods|drought|planning.",,"Darling, Jay N. (Jay Norwood), 1876-1962","The Editorial cartoons of J.N. ""Ding"" Darling [electronic resource] : The Cowles Collection, Drake University, 1912-1962",,1937/02/01|1937,,"Copyright is owned by the ""Ding"" Darling Wildlife Society; it is administered on behalf of the Society by The University of Iowa. While use within the classroom is encouraged without specific authorization, publishing this cartoon in any format requires written permission. See policy and permissions procedure at: http://www.lib.uiowa.edu/spec-coll/services/dingdarling_fees.html","Cowles Library, Drake University, 2507 University Ave., Des Moines, IA 50311-4505.",,,,"370201.jpg|http://ddr.lib.drake.edu/u?/ddarling,4985",,,,,,,,,,,,,,,,,,,,,,,,,,,,,,,,,,,,,,,,,,,,,,,,"<a href=""http://ddr.lib.drake.edu/u?/ddarling,4985"" target=""_blank"">View this item in its source respository</a>",,,,,,,,,,,,,,,,,,,,,,,,,,,,,https://www.iowaheritage.org/files/original/761b2f722545449b613286383c2a0625.jpg,"Remote Item","Editorial Cartoons of J.N. ""Ding"" Darling, Drake University",1,0
8257,https://www.iowaheritage.org/items/show/8257,"To the boats men: she's sprung a leak.","Human nature|Mississippi River Valley|Rain|weather|disasters|floods|agriculture|farming|Mississippi River|Arkansas|Missouri|Illinois|Mississippi|Louisiana|farms|animals.",,"Darling, Jay N. (Jay Norwood), 1876-1962","The Editorial cartoons of J.N. ""Ding"" Darling [electronic resource] : The Cowles Collection, Drake University, 1912-1962",,1912/05/29|1912,,"Copyright is owned by the ""Ding"" Darling Wildlife Society; it is administered on behalf of the Society by The University of Iowa. While use within the classroom is encouraged without specific authorization, publishing this cartoon in any format requires written permission. See policy and permissions procedure at: http://www.lib.uiowa.edu/spec-coll/services/dingdarling_fees.html","Cowles Library, Drake University, 2507 University Ave., Des Moines, IA 50311-4505.",,,,"120529|http://ddr.lib.drake.edu/u?/ddarling,5186",,,,,,,,,,,,,,,,,,,,,,,,,,,,,,,,,,,,,,,,,,,,,,,,"<a href=""http://ddr.lib.drake.edu/u?/ddarling,5186"" target=""_blank"">View this item in its source respository</a>",,,,,,,,,,,,,,,,,,,,,,,,,,,,,https://www.iowaheritage.org/files/original/b5a0c9ed0a7f5e19275ebbcf1e5a3c46.jpg,"Remote Item","Editorial Cartoons of J.N. ""Ding"" Darling, Drake University",1,0
9166,https://www.iowaheritage.org/items/show/9166,"We could use one of those landing barges right now.","War|World War, 1939-1945|Farms|production|agriculture|farming|weather|floods|farmers|floods.",,"Darling, Jay N. (Jay Norwood), 1876-1962","The Editorial cartoons of J.N. ""Ding"" Darling [electronic resource] : The Cowles Collection, Drake University, 1912-1962",,1944/05/07|1944,,"Copyright is owned by the ""Ding"" Darling Wildlife Society; it is administered on behalf of the Society by The University of Iowa. While use within the classroom is encouraged without specific authorization, publishing this cartoon in any format requires written permission. See policy and permissions procedure at: http://www.lib.uiowa.edu/spec-coll/services/dingdarling_fees.html","Cowles Library, Drake University, 2507 University Ave., Des Moines, IA 50311-4505.",,,,"440507.jpg|http://ddr.lib.drake.edu/u?/ddarling,6096",,,,,,,,,,,,,,,,,,,,,,,,,,,,,,,,,,,,,,,,,,,,,,,,"<a href=""http://ddr.lib.drake.edu/u?/ddarling,6096"" target=""_blank"">View this item in its source respository</a>",,,,,,,,,,,,,,,,,,,,,,,,,,,,,https://www.iowaheritage.org/files/original/1d3b1a062f66f64c08e8a639de4ca49f.jpg,"Remote Item","Editorial Cartoons of J.N. ""Ding"" Darling, Drake University",1,0
9499,https://www.iowaheritage.org/items/show/9499,"Call for Old Man Noah.","Weather|Mississippi River Valley|Floods|natural disasters|floods|Mississippi River|arks.",,"Darling, Jay N. (Jay Norwood), 1876-1962","The Editorial cartoons of J.N. ""Ding"" Darling [electronic resource] : The Cowles Collection, Drake University, 1912-1962",,1947/06/15|1947,,"Copyright is owned by the ""Ding"" Darling Wildlife Society; it is administered on behalf of the Society by The University of Iowa. While use within the classroom is encouraged without specific authorization, publishing this cartoon in any format requires written permission. See policy and permissions procedure at: http://www.lib.uiowa.edu/spec-coll/services/dingdarling_fees.html","Cowles Library, Drake University, 2507 University Ave., Des Moines, IA 50311-4505.",,,,"470615.jpg|http://ddr.lib.drake.edu/u?/ddarling,6429",,,,,,,,,,,,,,,,,,,,,,,,,,,,,,,,,,,,,,,,,,,,,,,,"<a href=""http://ddr.lib.drake.edu/u?/ddarling,6429"" target=""_blank"">View this item in its source respository</a>",,,,,,,,,,,,,,,,,,,,,,,,,,,,,https://www.iowaheritage.org/files/original/3ddf68ee7037e5682e32c7ce073a91f5.jpg,"Remote Item","Editorial Cartoons of J.N. ""Ding"" Darling, Drake University",1,0
9506,https://www.iowaheritage.org/items/show/9506,"Sometime those boys should get together.","Conservation|Erosion|natural resources|agriculture|rivers|soil|erosion|sustainable development|floods|mud.",,"Darling, Jay N. (Jay Norwood), 1876-1962","The Editorial cartoons of J.N. ""Ding"" Darling [electronic resource] : The Cowles Collection, Drake University, 1912-1962",,1947/07/01|1947,,"Copyright is owned by the ""Ding"" Darling Wildlife Society; it is administered on behalf of the Society by The University of Iowa. While use within the classroom is encouraged without specific authorization, publishing this cartoon in any format requires written permission. See policy and permissions procedure at: http://www.lib.uiowa.edu/spec-coll/services/dingdarling_fees.html","Cowles Library, Drake University, 2507 University Ave., Des Moines, IA 50311-4505.",,,,"470701.jpg|http://ddr.lib.drake.edu/u?/ddarling,6436",,,,,,,,,,,,,,,,,,,,,,,,,,,,,,,,,,,,,,,,,,,,,,,,"<a href=""http://ddr.lib.drake.edu/u?/ddarling,6436"" target=""_blank"">View this item in its source respository</a>",,,,,,,,,,,,,,,,,,,,,,,,,,,,,https://www.iowaheritage.org/files/original/3ffd1913d519ed697377af4e849bd74f.jpg,"Remote Item","Editorial Cartoons of J.N. ""Ding"" Darling, Drake University",1,0
9718,https://www.iowaheritage.org/items/show/9718,"Flooding Peter to save Paul.","Conservation|Missouri River|Floods|natural resources|public works|flood control|dams|U.S. Army Corps of Engineers|South Dakota|Pierre, South Dakota|refugees.",,"Darling, Jay N. (Jay Norwood), 1876-1962","The Editorial cartoons of J.N. ""Ding"" Darling [electronic resource] : The Cowles Collection, Drake University, 1912-1962",,1948/09/30|1948,,"Copyright is owned by the ""Ding"" Darling Wildlife Society; it is administered on behalf of the Society by The University of Iowa. While use within the classroom is encouraged without specific authorization, publishing this cartoon in any format requires written permission. See policy and permissions procedure at: http://www.lib.uiowa.edu/spec-coll/services/dingdarling_fees.html","Cowles Library, Drake University, 2507 University Ave., Des Moines, IA 50311-4505.",,,,"480930.jpg|http://ddr.lib.drake.edu/u?/ddarling,6648",,,,,,,,,,,,,,,,,,,,,,,,,,,,,,,,,,,,,,,,,,,,,,,,"<a href=""http://ddr.lib.drake.edu/u?/ddarling,6648"" target=""_blank"">View this item in its source respository</a>",,,,,,,,,,,,,,,,,,,,,,,,,,,,,https://www.iowaheritage.org/files/original/759a9d53ab19860820e73d2ee9a58732.jpg,"Remote Item","Editorial Cartoons of J.N. ""Ding"" Darling, Drake University",1,0
11872,https://www.iowaheritage.org/items/show/11872,"Jeff Davidson and Regenia Bailey interview about the Midwest floods of June 2008, Iowa City, Iowa, September 30, 2008","Floods|Davidson, Jeff|United States -- Iowa -- Iowa City|2000-2010|Evacuations|Disaster relief|Bailey, Regenia|United States -- Iowa -- Iowa River","Interview with colleagues Jeff Davidson (51) of Iowa City, Iowa and Regenia Bailey (48) of Knoxville, Iowa.|The Mayor of Iowa City, Regenia (age 48), talks with the director of city planning for Iowa City, Jeff (age 51), about the Iowa floods of 2008.|Jeff talks about flood disaster and flood recovery (00:01:04) -- Regenia talks about when she knew the flood would be a serious event (00:01:58) -- Unprecedented event for planning department. Evacuating mobile home area. Going door-to-door to 175 trailers. Tough experience. People without another place to go (00:02:39) -- Regenia - how city staff members were on the front lines (00:04:59) -- Having compassion for victims. Jeff remembers 1993 floods (00:06:54) -- Jeff was struck by the understanding people had about being told to leave. Temporary levy did hold. Trailer parks had high potential for devastation (00:08:32) -- Regenia - the recovery effort. Sense of defeat among people who had fought the river and lost. Surprised to see condominium people adrift (00:11:11) -- Jeff compares Iowa City to Cedar Rapids - both low and high income properties affected by flood. People not accustomed to victimization. People in trailer parks able to respond with more grace. Compassion to people in high-income areas (00:12:46) -- Jeff talks about theory that 95 percent of people he works with in municipal service are good people - 5 percent are really difficult but deserve the same attention (00:16:08) -- Regenia has received mostly positive feedback about municipal effort (00:17:23) -- What Regenia is working on now as Mayor of Iowa City in the aftermath of the flood (00:18:12) -- Jeff talks about programs going forward but not being able to do everything. Feeling guilty given that Cedar Rapids was much harder hit (00:19:21) -- Jeff and Regenia talk about a neighborhood near City Park and University, beauty of neighborhood (00:21:00) -- Event came early in Regenia's mayoral appointment (00:21:54) -- Director of Public Works giving news that reservoir would spill. Shock that this would exceed the 1993 floods. Regenia knew it would be big when members of Planning department were out sandbagging (00:22:32) -- Intensity of focus, people canceling their vacations. Hugh sandbagging operations. Jeff remembers comments about being younger in 1993 (00:25:00) -- Extraordinary community response (00:26:00) -- Never getting back to normal - a ""new normal."" Hopes people will be on their guard (00:27:00) -- Jeff talks about people loving the river and being by it despite the flood danger. Changes that will likely happen in the community. Building in the flood-plain (00:28:30) -- Regenia and Jeff's experiences going to school in flood-exposed buildings (00:31:37) -- Personal effect for Jeff's life. Changes and loss of things loved (00:32:42)","Davidson, Jeff; Bailey, Regenia",,"StoryCorps (Project); University of Iowa. Libraries. Digital Research & Publishing",2008-10-02|2008-10-02,,"Educational use only, no other permissions given. U.S. and international copyright laws may protect this item. Commercial use or distribution of this digital object is not permitted without written permission of the copyright holder.","Iowa City Flood|Flood Oral Histories",mpeg|00:34:05,English,"Sound|Oral histories (Document genres)",DDA000508.mp3|https://digital.lib.uiowa.edu/,,,,,,,,,,,,,,,,,,,,,,,,,,,,,,,,,,,,,,,,,,,,,,,,"<a href=""https://digital.lib.uiowa.edu/"" target=""_blank"">View this item in its source respository</a>",,,,,,,,,,,,,,,,,,,,,,,,,,,,,https://www.iowaheritage.org/files/original/35e08abf513fbcb1336f2dee0d53c4df.jpg,"Remote Item","Iowa City Flood",1,0
64298,https://www.iowaheritage.org/items/show/64298,Enough!,"States|Iowa|Men|2000-2010|Floods|Disasters, natural|Death|Parkersburg (Iowa)|Water|Clouds|Storms|Lightning|Tornadoes|Water|Floods","Parkersburg; Flooding; Boy Scouts","Duffy, Brian, 1955-",,"University of Iowa. Libraries. Special Collections Dept.",2008-06-13|2011-04,,"Educational use only, no other permissions given. Copyright to this digital object is owned by The Des Moines Register; it may not be downloaded, reproduced, or distributed without written permission. For more information, contact the Special Collections Department.","Editorial Cartoons of Brian Duffy; Des Moines Register Cartoonists|Papers of Brian Duffy|Des Moines Register",,English,"Still image|Editorial cartoons",MSC916|duffy-080613|http://digital.lib.uiowa.edu/cdm/ref/collection/duffy/id/136,,,,,,,,,,,,,,,,,,,,,,,,,,,,,,,,,,,,,,,,,,,,,,,,"<a href=""http://digital.lib.uiowa.edu/cdm/ref/collection/duffy/id/136"" target=""_blank"">View this item in its source respository</a>",,,,,,,,,,,,,,,,,,,,,,,,,,,,,https://www.iowaheritage.org/files/original/2171a2e6abff75c5eea6026cd4c93e1f.jpg,"Remote Item","Editorial Cartoons of Brian Duffy",1,0
64299,https://www.iowaheritage.org/items/show/64299,"I'm getting really tired of building one of these things every decade","Floods|Iowa|Noah's ark|2000-2010|Flood relief|Disasters, natural|Rivers|Men|Pigs|Inner tubes|Arks|Clouds|Tools",,"Duffy, Brian, 1955-",,"University of Iowa. Libraries. Special Collections Dept.",2008-06-15|2011-04,,"Educational use only, no other permissions given. Copyright to this digital object is owned by The Des Moines Register; it may not be downloaded, reproduced, or distributed without written permission. For more information, contact the Special Collections Department.","Editorial Cartoons of Brian Duffy; Des Moines Register Cartoonists|Papers of Brian Duffy|Des Moines Register",,English,"Still image|Editorial cartoons",MSC916|duffy-080615|http://digital.lib.uiowa.edu/cdm/ref/collection/duffy/id/137,,,,,,,,,,,,,,,,,,,,,,,,,,,,,,,,,,,,,,,,,,,,,,,,"<a href=""http://digital.lib.uiowa.edu/cdm/ref/collection/duffy/id/137"" target=""_blank"">View this item in its source respository</a>",,,,,,,,,,,,,,,,,,,,,,,,,,,,,https://www.iowaheritage.org/files/original/3d0580f9b06ab134d393cdafe629f41f.jpg,"Remote Item","Editorial Cartoons of Brian Duffy",1,0
