 




﻿"Item Id","Item URI","Dublin Core:Title","Dublin Core:Subject","Dublin Core:Description","Dublin Core:Creator","Dublin Core:Source","Dublin Core:Publisher","Dublin Core:Date","Dublin Core:Contributor","Dublin Core:Rights","Dublin Core:Relation","Dublin Core:Format","Dublin Core:Language","Dublin Core:Type","Dublin Core:Identifier","Dublin Core:Coverage","Item Type Metadata:Text","Item Type Metadata:Interviewer","Item Type Metadata:Interviewee","Item Type Metadata:Location","Item Type Metadata:Transcription","Item Type Metadata:Local URL","Item Type Metadata:Original Format","Item Type Metadata:Physical Dimensions","Item Type Metadata:Duration","Item Type Metadata:Compression","Item Type Metadata:Producer","Item Type Metadata:Director","Item Type Metadata:Bit Rate/Frequency","Item Type Metadata:Time Summary","Item Type Metadata:Email Body","Item Type Metadata:Subject Line","Item Type Metadata:From","Item Type Metadata:To","Item Type Metadata:CC","Item Type Metadata:BCC","Item Type Metadata:Number of Attachments","Item Type Metadata:Standards","Item Type Metadata:Objectives","Item Type Metadata:Materials","Item Type Metadata:Lesson Plan Text","Item Type Metadata:URL","Item Type Metadata:Event Type","Item Type Metadata:Participants","Item Type Metadata:Birth Date","Item Type Metadata:Birthplace","Item Type Metadata:Death Date","Item Type Metadata:Occupation","Item Type Metadata:Biographical Text","Item Type Metadata:Bibliography","Item Type Metadata:Digital Reproduction Information","Item Type Metadata:Repository","Item Type Metadata:Repository Collection","Item Type Metadata:Contact information.","Item Type Metadata:File Name","Item Type Metadata:Notes","Item Type Metadata:Digital item created","Item Type Metadata:Digital item modified","Item Type Metadata:Executive Orders","Item Type Metadata:Record Created","Item Type Metadata:Record Modified","Item Type Metadata:Transcription2","Item Type Metadata:Source URL","Omeka Legacy File:Additional Creator","Omeka Legacy File:Transcriber","Omeka Legacy File:Producer","Omeka Legacy File:Render Device","Omeka Legacy File:Render Details","Omeka Legacy File:Capture Date","Omeka Legacy File:Capture Device","Omeka Legacy File:Capture Details","Omeka Legacy File:Change History","Omeka Legacy File:Watermark","Omeka Legacy File:Encryption","Omeka Legacy File:Compression","Omeka Legacy File:Post Processing","Omeka Image File:Width","Omeka Image File:Height","Omeka Image File:Bit Depth","Omeka Image File:Channels","Omeka Image File:Exif String","Omeka Image File:Exif Array","Omeka Image File:IPTC String","Omeka Image File:IPTC Array","Omeka Video File:Bitrate","Omeka Video File:Duration","Omeka Video File:Sample Rate","Omeka Video File:Codec","Omeka Video File:Width","Omeka Video File:Height",tags,file,itemType,collection,public,featured
35659,https://www.iowaheritage.org/items/show/35659,"Mary Louise Smith sitting in the Iowa delegation at Republican National Convention, Miami Beach, Fla., August 1972","Political conventions|Smith, Mary Louise|Republican National Convention (30th : 1972 : Miami Beach, Fla.)|United States -- Florida -- Miami Beach|1970-1980|Women|Men|Governors|Reagan, Ronald|Newsweek book","From Newsweek coverage",unknown,,"University of Iowa. Libraries. Iowa Women's Archives",1968-08|2007-09-13,,"Educational use only, no other permissions given. U.S. and international copyright laws may protect this item. Commercial use or distribution of this digital object is not permitted without written permission of the Iowa Women's Archives.","Iowa Women's Archives Founders|Mary Louise Smith Papers, 1914-1997|http://lib.uiowa.edu/collguides/?IWA0027|MLS et al, 1968-1972, misc.",jpeg,,"Still image|Photographs",IWA0027|https://digital.lib.uiowa.edu/,,,,,,,,,,,,,,,,,,,,,,,,,,,,,,,,,,,,,,,,,,,,,,,,"<a href=""https://digital.lib.uiowa.edu/"" target=""_blank"">View this item in its source respository</a>",,,,,,,,,,,,,,,,,,,,,,,,,,,,,https://www.iowaheritage.org/files/original/b7eeb9795a0122e643a7904ff3b85f66.jpg,"Remote Item","Iowa Women's Archives Founders",1,0
64559,https://www.iowaheritage.org/items/show/64559,"President Donald Regan","Presidency|Regan, Donald T.|Washington (D.C.)|Offices|1980-1990|Presidents -- United States|Vice presidents|Congress|Power|Popularity|Reagan, Ronald|Bush, George, 1924-|Desks|Candy|Flags|Monuments|Windows|Signs|Men|Senators|Presidents",Bush,"Duffy, Brian, 1955-",,"University of Iowa. Libraries. Special Collections Dept.",1985-07-17|2011-04,,"Educational use only, no other permissions given. Copyright to this digital object is owned by The Des Moines Register; it may not be downloaded, reproduced, or distributed without written permission. For more information, contact the Special Collections Department.","Editorial Cartoons of Brian Duffy; Des Moines Register Cartoonists|Papers of Brian Duffy|Des Moines Register",,English,"Still image|Editorial cartoons",MSC916|duffy-850717|http://digital.lib.uiowa.edu/cdm/ref/collection/duffy/id/397,,,,,,,,,,,,,,,,,,,,,,,,,,,,,,,,,,,,,,,,,,,,,,,,"<a href=""http://digital.lib.uiowa.edu/cdm/ref/collection/duffy/id/397"" target=""_blank"">View this item in its source respository</a>",,,,,,,,,,,,,,,,,,,,,,,,,,,,,https://www.iowaheritage.org/files/original/7fad69ef5478dd7cb0af2f5a79923b5a.jpg,"Remote Item","Editorial Cartoons of Brian Duffy",1,0
35725,https://www.iowaheritage.org/items/show/35725,"Presidential and vice presidential candidates and spouses at the Republican National Convention, Kansas City, Mo., August 1976","Men|Dole, Elizabeth Hanford|Republican National Convention (31st : 1976 : Kansas City, Mo.)|United States -- Missouri -- Kansas City|1970-1980|Women|Presidents|Presidential elections|Political conventions|Political campaigns|Presidents' spouses|Spouses|Politicians|Dole, Robert J., 1923-|Reagan, Ronald|Reagan, Nancy, 1923-|Ford, Betty, 1918-|Ford, Gerald R., 1913-2006",,unknown,,"University of Iowa. Libraries. Iowa Women's Archives",1976-08|2007-09-13,,"Educational use only, no other permissions given. U.S. and international copyright laws may protect this item. Commercial use or distribution of this digital object is not permitted without written permission of the Iowa Women's Archives.","Iowa Women's Archives Founders|Mary Louise Smith Papers, 1914-1997|http://lib.uiowa.edu/collguides/?IWA0027|1976- Republican National Convention, from commemorative scrapbook",jpeg,,"Still image|Photographs",IWA0027|mls0372.jpg|https://digital.lib.uiowa.edu/,,,,,,,,,,,,,,,,,,,,,,,,,,,,,,,,,,,,,,,,,,,,,,,,"<a href=""https://digital.lib.uiowa.edu/"" target=""_blank"">View this item in its source respository</a>",,,,,,,,,,,,,,,,,,,,,,,,,,,,,https://www.iowaheritage.org/files/original/561a9aebcc800a37b84ae43c52e65bf9.jpg,"Remote Item","Iowa Women's Archives Founders",1,0
64519,https://www.iowaheritage.org/items/show/64519,"Q. What do Ronald Reagan and James Watt have in common?","Presidents|Reagan, Ronald|United States|Presidents|1980-1990|Foreign relations|Foreign policy|United States -- Foreign relations -- Soviet Union|Cold War|Watt, James G., 1938-|Bombs|Men|Arrows","Answer: the same gag writer; Two wild & crazy guys; I am pleased to tell you I just signed legislation which outlaws Russia forever the bombing begins in 5 minutes; ... a black, a woman, two Jews, and a cripple","Duffy, Brian, 1955-",,"University of Iowa. Libraries. Special Collections Dept.",1984-08-16|2011-04,,"Educational use only, no other permissions given. Copyright to this digital object is owned by The Des Moines Register; it may not be downloaded, reproduced, or distributed without written permission. For more information, contact the Special Collections Department.","Editorial Cartoons of Brian Duffy; Des Moines Register Cartoonists|Papers of Brian Duffy|Des Moines Register",,English,"Still image|Editorial cartoons",MSC916|duffy-840816|http://digital.lib.uiowa.edu/cdm/ref/collection/duffy/id/357,,,,,,,,,,,,,,,,,,,,,,,,,,,,,,,,,,,,,,,,,,,,,,,,"<a href=""http://digital.lib.uiowa.edu/cdm/ref/collection/duffy/id/357"" target=""_blank"">View this item in its source respository</a>",,,,,,,,,,,,,,,,,,,,,,,,,,,,,https://www.iowaheritage.org/files/original/6921c9bf1796a83c478dbb3702910753.jpg,"Remote Item","Editorial Cartoons of Brian Duffy",1,0
64539,https://www.iowaheritage.org/items/show/64539,"Someone must stand up to those who say here's the keys, there's the Treasury, take as many tax dollars as you want","Presidents|Reagan, Ronald|United States|Presidents|1980-1990|Taxation|Taxes|Treasuries|Government|Government spending|Government spending policy|Congress|Washington (D.C.)|Money|Men|Money bags|Monuments|Keys|Generals|Treasury Building|Thieves","Treasury; $; Here's the keys, the Treasury is empty!","Duffy, Brian, 1955-",,"University of Iowa. Libraries. Special Collections Dept.",1985-03-10|2011-04,,"Educational use only, no other permissions given. Copyright to this digital object is owned by The Des Moines Register; it may not be downloaded, reproduced, or distributed without written permission. For more information, contact the Special Collections Department.","Editorial Cartoons of Brian Duffy; Des Moines Register Cartoonists|Papers of Brian Duffy|Des Moines Register",,English,"Still image|Editorial cartoons",MSC916|duffy-850310|http://digital.lib.uiowa.edu/cdm/ref/collection/duffy/id/377,,,,,,,,,,,,,,,,,,,,,,,,,,,,,,,,,,,,,,,,,,,,,,,,"<a href=""http://digital.lib.uiowa.edu/cdm/ref/collection/duffy/id/377"" target=""_blank"">View this item in its source respository</a>",,,,,,,,,,,,,,,,,,,,,,,,,,,,,https://www.iowaheritage.org/files/original/c3e888194e2c7f1367d52daa1947141f.jpg,"Remote Item","Editorial Cartoons of Brian Duffy",1,0
64517,https://www.iowaheritage.org/items/show/64517,"Tax issue","Presidents|Reagan, Ronald|United States|Presidents|1980-1990|Taxes|Taxpayers|Issues|Vacations|Weeds|Hatchets|Stars|Shrubs",,"Duffy, Brian, 1955-",,"University of Iowa. Libraries. Special Collections Dept.",1984-08-14|2011-04,,"Educational use only, no other permissions given. Copyright to this digital object is owned by The Des Moines Register; it may not be downloaded, reproduced, or distributed without written permission. For more information, contact the Special Collections Department.","Editorial Cartoons of Brian Duffy; Des Moines Register Cartoonists|Papers of Brian Duffy|Des Moines Register",,English,"Still image|Editorial cartoons",MSC916|duffy-840814|http://digital.lib.uiowa.edu/cdm/ref/collection/duffy/id/355,,,,,,,,,,,,,,,,,,,,,,,,,,,,,,,,,,,,,,,,,,,,,,,,"<a href=""http://digital.lib.uiowa.edu/cdm/ref/collection/duffy/id/355"" target=""_blank"">View this item in its source respository</a>",,,,,,,,,,,,,,,,,,,,,,,,,,,,,https://www.iowaheritage.org/files/original/3229c60e45611b073b64bc07b0899bc4.jpg,"Remote Item","Editorial Cartoons of Brian Duffy",1,0
64596,https://www.iowaheritage.org/items/show/64596,"The Iran-Contra affair continued with trials of some former administration officials","Legislative hearings|Reagan, Ronald|United States|Iran-Contra Affair, 1985-1990|Courtrooms|1990-2000|Presidents|Crimes|Crimes and punishment|Criminals|Smuggling|Perjury|Poindexter, John M.|North, Oliver|Lawyers|Presidents|Judges|Gavels","Judge, we've found 12 jurors who are totally oblivious to the whole Iran Contra affair; Poindexter trial; Diversion?; Poindexter? Never saw him ... ; I don't recall; Never heard of him ... ; Maybe if you hum a few bars ... ; Never spoke to him ... ; Tower report?; Z; Z; White House?; Ollie who?","Duffy, Brian, 1955-",,"University of Iowa. Libraries. Special Collections Dept.",1990-03-07|2011-04,,"Educational use only, no other permissions given. Copyright to this digital object is owned by The Des Moines Register; it may not be downloaded, reproduced, or distributed without written permission. For more information, contact the Special Collections Department.","Editorial Cartoons of Brian Duffy; Des Moines Register Cartoonists|Papers of Brian Duffy|Des Moines Register",,English,"Still image|Editorial cartoons",MSC916|duffy-900307|http://digital.lib.uiowa.edu/cdm/ref/collection/duffy/id/434,,,,,,,,,,,,,,,,,,,,,,,,,,,,,,,,,,,,,,,,,,,,,,,,"<a href=""http://digital.lib.uiowa.edu/cdm/ref/collection/duffy/id/434"" target=""_blank"">View this item in its source respository</a>",,,,,,,,,,,,,,,,,,,,,,,,,,,,,https://www.iowaheritage.org/files/original/d06c0401d0afdf1f9d760fd6787615f2.jpg,"Remote Item","Editorial Cartoons of Brian Duffy",1,0
64390,https://www.iowaheritage.org/items/show/64390,"To Ollie : do not open until Christmas","Presidents|North, Oliver|United States|Men|1980-1990|Pardon|Crimes|Criminals|Crimes and punishment|Smuggling|Military|Military aid|Arms|Guerillas|Scandal|Reagan, Ronald|Soldiers|Packages|Doors|Doorsteps|Gifts|Cameras|Fences|Barbed wire","Rattle ... rattle; 602; The Presidential Pardon Co. 1600 Pennsylvania Ave. Washington, D.C.","Duffy, Brian, 1955-",,"University of Iowa. Libraries. Special Collections Dept.",1988-05|2011-04,,"Educational use only, no other permissions given. Copyright to this digital object is owned by The Des Moines Register; it may not be downloaded, reproduced, or distributed without written permission. For more information, contact the Special Collections Department.","Editorial Cartoons of Brian Duffy; Des Moines Register Cartoonists|Papers of Brian Duffy|Des Moines Register",,English,"Still image|Editorial cartoons","MSC916|duffy-8805xx-undated 3|http://digital.lib.uiowa.edu/cdm/ref/collection/duffy/id/228",,,,,,,,,,,,,,,,,,,,,,,,,,,,,,,,,,,,,,,,,,,,,,,,"<a href=""http://digital.lib.uiowa.edu/cdm/ref/collection/duffy/id/228"" target=""_blank"">View this item in its source respository</a>",,,,,,,,,,,,,,,,,,,,,,,,,,,,,https://www.iowaheritage.org/files/original/2589e42e3858a90812a1042127579278.jpg,"Remote Item","Editorial Cartoons of Brian Duffy",1,0
64540,https://www.iowaheritage.org/items/show/64540,"Ventriloquist Ronald Reagan","Presidents|Reagan, Ronald|United States|Presidents|1980-1990|Presidents -- United States|Presidential power|Presidential appointees|Press|Men|Ventriloquism|Dummies|Comedians|Stools|Eggs|Eggshells|Chickens|Bottles|Eyeglasses|Puppets",,"Duffy, Brian, 1955-",,"University of Iowa. Libraries. Special Collections Dept.",1985-03-03|2011-04,,"Educational use only, no other permissions given. Copyright to this digital object is owned by The Des Moines Register; it may not be downloaded, reproduced, or distributed without written permission. For more information, contact the Special Collections Department.","Editorial Cartoons of Brian Duffy; Des Moines Register Cartoonists|Papers of Brian Duffy|Des Moines Register",,English,"Still image|Editorial cartoons",MSC916|duffy-850303|http://digital.lib.uiowa.edu/cdm/ref/collection/duffy/id/378,,,,,,,,,,,,,,,,,,,,,,,,,,,,,,,,,,,,,,,,,,,,,,,,"<a href=""http://digital.lib.uiowa.edu/cdm/ref/collection/duffy/id/378"" target=""_blank"">View this item in its source respository</a>",,,,,,,,,,,,,,,,,,,,,,,,,,,,,https://www.iowaheritage.org/files/original/4408a022dd840bb26167a6c538dd0cc2.jpg,"Remote Item","Editorial Cartoons of Brian Duffy",1,0
64352,https://www.iowaheritage.org/items/show/64352,"We're right behind you old boy!","Presidents|Reagan, Ronald|United States|Presidents|1980-1990|Dictatorships|Economic sanctions|United States -- Foreign relations|United States -- Foreign economic relations|United States -- Foreign relations -- Libya|Great Britain|Western Europe|Germany|France|Libya|Leaders|Guns|Men|Caves|Skulls|Hunters|Hunting","Ja!; Oui!; Western Europe; Libya; Sanctions","Duffy, Brian, 1955-",,"University of Iowa. Libraries. Special Collections Dept.",1986-01-05|2011-04,,"Educational use only, no other permissions given. Copyright to this digital object is owned by The Des Moines Register; it may not be downloaded, reproduced, or distributed without written permission. For more information, contact the Special Collections Department.","Editorial Cartoons of Brian Duffy; Des Moines Register Cartoonists|Papers of Brian Duffy|Des Moines Register",,English,"Still image|Editorial cartoons",MSC916|duffy-860105|http://digital.lib.uiowa.edu/cdm/ref/collection/duffy/id/190,,,,,,,,,,,,,,,,,,,,,,,,,,,,,,,,,,,,,,,,,,,,,,,,"<a href=""http://digital.lib.uiowa.edu/cdm/ref/collection/duffy/id/190"" target=""_blank"">View this item in its source respository</a>",,,,,,,,,,,,,,,,,,,,,,,,,,,,,https://www.iowaheritage.org/files/original/53c9659ea35e79444b01c696355b3086.jpg,"Remote Item","Editorial Cartoons of Brian Duffy",1,0
