 




﻿"Item Id","Item URI","Dublin Core:Title","Dublin Core:Subject","Dublin Core:Description","Dublin Core:Creator","Dublin Core:Source","Dublin Core:Publisher","Dublin Core:Date","Dublin Core:Contributor","Dublin Core:Rights","Dublin Core:Relation","Dublin Core:Format","Dublin Core:Language","Dublin Core:Type","Dublin Core:Identifier","Dublin Core:Coverage","Item Type Metadata:Text","Item Type Metadata:Interviewer","Item Type Metadata:Interviewee","Item Type Metadata:Location","Item Type Metadata:Transcription","Item Type Metadata:Local URL","Item Type Metadata:Original Format","Item Type Metadata:Physical Dimensions","Item Type Metadata:Duration","Item Type Metadata:Compression","Item Type Metadata:Producer","Item Type Metadata:Director","Item Type Metadata:Bit Rate/Frequency","Item Type Metadata:Time Summary","Item Type Metadata:Email Body","Item Type Metadata:Subject Line","Item Type Metadata:From","Item Type Metadata:To","Item Type Metadata:CC","Item Type Metadata:BCC","Item Type Metadata:Number of Attachments","Item Type Metadata:Standards","Item Type Metadata:Objectives","Item Type Metadata:Materials","Item Type Metadata:Lesson Plan Text","Item Type Metadata:URL","Item Type Metadata:Event Type","Item Type Metadata:Participants","Item Type Metadata:Birth Date","Item Type Metadata:Birthplace","Item Type Metadata:Death Date","Item Type Metadata:Occupation","Item Type Metadata:Biographical Text","Item Type Metadata:Bibliography","Item Type Metadata:Digital Reproduction Information","Item Type Metadata:Repository","Item Type Metadata:Repository Collection","Item Type Metadata:Contact information.","Item Type Metadata:File Name","Item Type Metadata:Notes","Item Type Metadata:Digital item created","Item Type Metadata:Digital item modified","Item Type Metadata:Executive Orders","Item Type Metadata:Record Created","Item Type Metadata:Record Modified","Item Type Metadata:Transcription2","Item Type Metadata:Source URL","Omeka Legacy File:Additional Creator","Omeka Legacy File:Transcriber","Omeka Legacy File:Producer","Omeka Legacy File:Render Device","Omeka Legacy File:Render Details","Omeka Legacy File:Capture Date","Omeka Legacy File:Capture Device","Omeka Legacy File:Capture Details","Omeka Legacy File:Change History","Omeka Legacy File:Watermark","Omeka Legacy File:Encryption","Omeka Legacy File:Compression","Omeka Legacy File:Post Processing","Omeka Image File:Width","Omeka Image File:Height","Omeka Image File:Bit Depth","Omeka Image File:Channels","Omeka Image File:Exif String","Omeka Image File:Exif Array","Omeka Image File:IPTC String","Omeka Image File:IPTC Array","Omeka Video File:Bitrate","Omeka Video File:Duration","Omeka Video File:Sample Rate","Omeka Video File:Codec","Omeka Video File:Width","Omeka Video File:Height",tags,file,itemType,collection,public,featured
67774,https://www.iowaheritage.org/items/show/67774,"Portrait, John Mahlstede, 1966","Iowa State University|Iowa Agriculture and Home Economics Experiment Station","John Mahlstede, Associate Director of the Iowa Agriculture and Home Economics Experiment Station, is shown in this portrait taken in 1966.|The Agricultural Experiment Station began at the Iowa Agricultural College and Model Farm (now Iowa State University) as a result of the Hatch Act of 1887 and an act passed by the Iowa General Assembly in 1888. The purpose of the station is to conduct research relating to agriculture and associated disciplines and to disseminate that information.  The name of the station was changed in in 1957 to Agricultural and Home Economics Experiment Station and again in 1966 to Agriculture and Home Economics Experiment Station.","Elder, Iowa State University",09-02-A.Mahlstede.531-04-08,"Iowa State University Library Special Collections: http://www.add.lib.iastate.edu/spcl/index.html",1966|2012-06,,"U.S. and international copyright laws protect this digital image. Commercial use or distribution of the image is not permitted without prior permission of the copyright holder. For permission to use the digital image, please contact Iowa State University Library, Special Collections archives@iastate.edu  For reproductions see:  http://www.add.lib.iastate.edu/spcl/services/photfees.html","University Photographs; http://www.add.lib.iastate.edu/spcl/collections/images.html","Photograph| 9.5 x 12.2 cm",,Image|Image,09-02-A.Mahlstede.531-04-08|https://digitalcollections.lib.iastate.edu/,,,,,,,,,,,,,,,,,,,,,,,,,,,,,,,,,,,,,,,,,,,,,,,,"<a href=""https://digitalcollections.lib.iastate.edu/"" target=""_blank"">View this item in its source respository</a>",,,,,,,,,,,,,,,,,,,,,,,,,,,,,https://www.iowaheritage.org/files/original/206b22f03d9c54bb41002b148bd3f36c.jpg,"Remote Item","Iowa State University Library Photograph Collection",1,0
67835,https://www.iowaheritage.org/items/show/67835,"Agricultural education lecturer speaking to a class of adult men, 1966.","Iowa State University|Iowa Agriculture and Home Economics Experiment Station|Education","A man in a suit presents an agricultural education lecture for a class of adult men, 1966.  The class sits on folding chairs at folding tables, with bags of corn kernels or soybeans in front of them as examples.  The lecturer stands behind a lectern on a table, with a portable blackboard, a slide projector, and an overhead projector to his right.  A young man in a suit stands by him holding a bag of corn or soybeans.|The Agricultural Experiment Station began at the Iowa Agricultural College and Model Farm (now Iowa State University) as a result of the Hatch Act of 1887 and an act passed by the Iowa General Assembly in 1888. The purpose of the station is to conduct research relating to agriculture and associated disciplines and to disseminate that information.  The name of the station was changed in in 1957 to Agricultural and Home Economics Experiment Station and again in 1966 to Agriculture and Home Economics Experiment Station.","Elder, Iowa State University",09-02-E.IAHEES.531-07-02,"Iowa State University Library Special Collections: http://www.add.lib.iastate.edu/spcl/index.html",1966|2012-06,,"U.S. and international copyright laws protect this digital image. Commercial use or distribution of the image is not permitted without prior permission of the copyright holder. For permission to use the digital image, please contact Iowa State University Library, Special Collections archives@iastate.edu  For reproductions see:  http://www.add.lib.iastate.edu/spcl/services/photfees.html","University Photographs; http://www.add.lib.iastate.edu/spcl/collections/images.html","Photograph| 5.5 x 5.6 cm",,Image|Image,09-02-E.IAHEES.531-07-02|https://digitalcollections.lib.iastate.edu/,,,,,,,,,,,,,,,,,,,,,,,,,,,,,,,,,,,,,,,,,,,,,,,,"<a href=""https://digitalcollections.lib.iastate.edu/"" target=""_blank"">View this item in its source respository</a>",,,,,,,,,,,,,,,,,,,,,,,,,,,,,https://www.iowaheritage.org/files/original/8bd5153103e78b3122eefaa22a819627.jpg,"Remote Item","Iowa State University Library Photograph Collection",1,0
72917,https://www.iowaheritage.org/items/show/72917,"Portrait, John Mahlstede, 1966","Iowa State University|Iowa Agriculture and Home Economics Experiment Station","John Mahlstede, Associate Director of the Iowa Agriculture and Home Economics Experiment Station, is shown in this portrait taken in 1966.|The Agricultural Experiment Station began at the Iowa Agricultural College and Model Farm (now Iowa State University) as a result of the Hatch Act of 1887 and an act passed by the Iowa General Assembly in 1888. The purpose of the station is to conduct research relating to agriculture and associated disciplines and to disseminate that information.  The name of the station was changed in in 1957 to Agricultural and Home Economics Experiment Station and again in 1966 to Agriculture and Home Economics Experiment Station.","Elder, Iowa State University",09-02-A.Mahlstede.531-04-08,"Iowa State University Library Special Collections: http://www.add.lib.iastate.edu/spcl/index.html",1966|2012-06,,"U.S. and international copyright laws protect this digital image. Commercial use or distribution of the image is not permitted without prior permission of the copyright holder. For permission to use the digital image, please contact Iowa State University Library, Special Collections archives@iastate.edu  For reproductions see:  http://www.add.lib.iastate.edu/spcl/services/photfees.html","University Photographs; http://www.add.lib.iastate.edu/spcl/collections/images.html","Photograph| 9.5 x 12.2 cm",,Image|Image,09-02-A.Mahlstede.531-04-08|https://digitalcollections.lib.iastate.edu/,,,,,,,,,,,,,,,,,,,,,,,,,,,,,,,,,,,,,,,,,,,,,,,,"<a href=""https://digitalcollections.lib.iastate.edu/"" target=""_blank"">View this item in its source respository</a>",,,,,,,,,,,,,,,,,,,,,,,,,,,,,https://www.iowaheritage.org/files/original/ba3b45b0531a17027b79110e4aa2cd05.jpg,"Remote Item",,1,0
72978,https://www.iowaheritage.org/items/show/72978,"Agricultural education lecturer speaking to a class of adult men, 1966.","Iowa State University|Iowa Agriculture and Home Economics Experiment Station|Education","A man in a suit presents an agricultural education lecture for a class of adult men, 1966.  The class sits on folding chairs at folding tables, with bags of corn kernels or soybeans in front of them as examples.  The lecturer stands behind a lectern on a table, with a portable blackboard, a slide projector, and an overhead projector to his right.  A young man in a suit stands by him holding a bag of corn or soybeans.|The Agricultural Experiment Station began at the Iowa Agricultural College and Model Farm (now Iowa State University) as a result of the Hatch Act of 1887 and an act passed by the Iowa General Assembly in 1888. The purpose of the station is to conduct research relating to agriculture and associated disciplines and to disseminate that information.  The name of the station was changed in in 1957 to Agricultural and Home Economics Experiment Station and again in 1966 to Agriculture and Home Economics Experiment Station.","Elder, Iowa State University",09-02-E.IAHEES.531-07-02,"Iowa State University Library Special Collections: http://www.add.lib.iastate.edu/spcl/index.html",1966|2012-06,,"U.S. and international copyright laws protect this digital image. Commercial use or distribution of the image is not permitted without prior permission of the copyright holder. For permission to use the digital image, please contact Iowa State University Library, Special Collections archives@iastate.edu  For reproductions see:  http://www.add.lib.iastate.edu/spcl/services/photfees.html","University Photographs; http://www.add.lib.iastate.edu/spcl/collections/images.html","Photograph| 5.5 x 5.6 cm",,Image|Image,09-02-E.IAHEES.531-07-02|https://digitalcollections.lib.iastate.edu/,,,,,,,,,,,,,,,,,,,,,,,,,,,,,,,,,,,,,,,,,,,,,,,,"<a href=""https://digitalcollections.lib.iastate.edu/"" target=""_blank"">View this item in its source respository</a>",,,,,,,,,,,,,,,,,,,,,,,,,,,,,https://www.iowaheritage.org/files/original/206c38b9ec7496478fd09a772beff42f.jpg,"Remote Item",,1,0
67773,https://www.iowaheritage.org/items/show/67773,"Portrait, John Mahlstede, 1966","Iowa State University|Iowa Agriculture and Home Economics Experiment Station","John Mahlstede, Associate Director of the Iowa Agriculture and Home Economics Experiment Station, is shown in this portrait taken in 1966.|The Agricultural Experiment Station began at the Iowa Agricultural College and Model Farm (now Iowa State University) as a result of the Hatch Act of 1887 and an act passed by the Iowa General Assembly in 1888. The purpose of the station is to conduct research relating to agriculture and associated disciplines and to disseminate that information.  The name of the station was changed in in 1957 to Agricultural and Home Economics Experiment Station and again in 1966 to Agriculture and Home Economics Experiment Station.","Elder; Iowa State University",09-02-A.Mahlstede.529-03-04,"Iowa State University Library Special Collections: http://www.add.lib.iastate.edu/spcl/index.html",1966|2012-06,,"U.S. and international copyright laws protect this digital image. Commercial use or distribution of the image is not permitted without prior permission of the copyright holder. For permission to use the digital image, please contact Iowa State University Library, Special Collections archives@iastate.edu  For reproductions see:  http://www.add.lib.iastate.edu/spcl/services/photfees.html","University Photographs; http://www.add.lib.iastate.edu/spcl/collections/images.html","Photograph| 5.6 x 8.2 cm",,Image|Image,09-02-A.Mahlstede.529-03-04|https://digitalcollections.lib.iastate.edu/,,,,,,,,,,,,,,,,,,,,,,,,,,,,,,,,,,,,,,,,,,,,,,,,"<a href=""https://digitalcollections.lib.iastate.edu/"" target=""_blank"">View this item in its source respository</a>",,,,,,,,,,,,,,,,,,,,,,,,,,,,,https://www.iowaheritage.org/files/original/136f841894eb6386449f86368c5acf04.jpg,"Remote Item","Iowa State University Library Photograph Collection",1,0
72916,https://www.iowaheritage.org/items/show/72916,"Portrait, John Mahlstede, 1966","Iowa State University|Iowa Agriculture and Home Economics Experiment Station","John Mahlstede, Associate Director of the Iowa Agriculture and Home Economics Experiment Station, is shown in this portrait taken in 1966.|The Agricultural Experiment Station began at the Iowa Agricultural College and Model Farm (now Iowa State University) as a result of the Hatch Act of 1887 and an act passed by the Iowa General Assembly in 1888. The purpose of the station is to conduct research relating to agriculture and associated disciplines and to disseminate that information.  The name of the station was changed in in 1957 to Agricultural and Home Economics Experiment Station and again in 1966 to Agriculture and Home Economics Experiment Station.","Elder; Iowa State University",09-02-A.Mahlstede.529-03-04,"Iowa State University Library Special Collections: http://www.add.lib.iastate.edu/spcl/index.html",1966|2012-06,,"U.S. and international copyright laws protect this digital image. Commercial use or distribution of the image is not permitted without prior permission of the copyright holder. For permission to use the digital image, please contact Iowa State University Library, Special Collections archives@iastate.edu  For reproductions see:  http://www.add.lib.iastate.edu/spcl/services/photfees.html","University Photographs; http://www.add.lib.iastate.edu/spcl/collections/images.html","Photograph| 5.6 x 8.2 cm",,Image|Image,09-02-A.Mahlstede.529-03-04|https://digitalcollections.lib.iastate.edu/,,,,,,,,,,,,,,,,,,,,,,,,,,,,,,,,,,,,,,,,,,,,,,,,"<a href=""https://digitalcollections.lib.iastate.edu/"" target=""_blank"">View this item in its source respository</a>",,,,,,,,,,,,,,,,,,,,,,,,,,,,,https://www.iowaheritage.org/files/original/05e9afe75e6b58a4868ef8a8a56dece0.jpg,"Remote Item",,1,0
67842,https://www.iowaheritage.org/items/show/67842,"Woman researcher transferring colored fluids between beakers and petri dishes with pipette","Iowa State University|Iowa Agriculture and Home Economics Experiment Station","A woman researcher transfers colored fluids between beakers and petri dishes with pipette.|The Agricultural Experiment Station began at the Iowa Agricultural College and Model Farm (now Iowa State University) as a result of the Hatch Act of 1887 and an act passed by the Iowa General Assembly in 1888. The purpose of the station is to conduct research relating to agriculture and associated disciplines and to disseminate that information.  The name of the station was changed in in 1957 to Agricultural and Home Economics Experiment Station and again in 1966 to Agriculture and Home Economics Experiment Station.","Facto, Iowa State University",09-02-F.IAHEES.534-01-01,"Iowa State University Library Special Collections: http://www.add.lib.iastate.edu/spcl/index.html",1950s|2012-06,,"U.S. and international copyright laws protect this digital image. Commercial use or distribution of the image is not permitted without prior permission of the copyright holder. For permission to use the digital image, please contact Iowa State University Library, Special Collections archives@iastate.edu  For reproductions see:  http://www.add.lib.iastate.edu/spcl/services/photfees.html","University Photographs; http://www.add.lib.iastate.edu/spcl/collections/images.html","Photograph| 11.8 x 9.4 cm",,Image|Image,09-02-F.IAHEES.534-01-01|https://digitalcollections.lib.iastate.edu/,,,,,,,,,,,,,,,,,,,,,,,,,,,,,,,,,,,,,,,,,,,,,,,,"<a href=""https://digitalcollections.lib.iastate.edu/"" target=""_blank"">View this item in its source respository</a>",,,,,,,,,,,,,,,,,,,,,,,,,,,,,https://www.iowaheritage.org/files/original/ac964cecb2c52260cb4577b2907d3b5b.jpg,"Remote Item","Iowa State University Library Photograph Collection",1,0
72985,https://www.iowaheritage.org/items/show/72985,"Woman researcher transferring colored fluids between beakers and petri dishes with pipette","Iowa State University|Iowa Agriculture and Home Economics Experiment Station","A woman researcher transfers colored fluids between beakers and petri dishes with pipette.|The Agricultural Experiment Station began at the Iowa Agricultural College and Model Farm (now Iowa State University) as a result of the Hatch Act of 1887 and an act passed by the Iowa General Assembly in 1888. The purpose of the station is to conduct research relating to agriculture and associated disciplines and to disseminate that information.  The name of the station was changed in in 1957 to Agricultural and Home Economics Experiment Station and again in 1966 to Agriculture and Home Economics Experiment Station.","Facto, Iowa State University",09-02-F.IAHEES.534-01-01,"Iowa State University Library Special Collections: http://www.add.lib.iastate.edu/spcl/index.html",1950s|2012-06,,"U.S. and international copyright laws protect this digital image. Commercial use or distribution of the image is not permitted without prior permission of the copyright holder. For permission to use the digital image, please contact Iowa State University Library, Special Collections archives@iastate.edu  For reproductions see:  http://www.add.lib.iastate.edu/spcl/services/photfees.html","University Photographs; http://www.add.lib.iastate.edu/spcl/collections/images.html","Photograph| 11.8 x 9.4 cm",,Image|Image,09-02-F.IAHEES.534-01-01|https://digitalcollections.lib.iastate.edu/,,,,,,,,,,,,,,,,,,,,,,,,,,,,,,,,,,,,,,,,,,,,,,,,"<a href=""https://digitalcollections.lib.iastate.edu/"" target=""_blank"">View this item in its source respository</a>",,,,,,,,,,,,,,,,,,,,,,,,,,,,,https://www.iowaheritage.org/files/original/1625916fe2a83d791e5399a491eab799.jpg,"Remote Item",,1,0
67898,https://www.iowaheritage.org/items/show/67898,"Experiment 326, representative pig #9B, 1930","Iowa State University|Iowa Agriculture and Home Economics Experiment Station|Swine","The  right side of representative pig #9B  is shown for experiment 315 lot #3.|The Agricultural Experiment Station began at the Iowa Agricultural College and Model Farm (now Iowa State University) as a result of the Hatch Act of 1887 and an act passed by the Iowa General Assembly in 1888. The purpose of the station is to conduct research relating to agriculture and associated disciplines and to disseminate that information.  The name of the station was changed in in 1957 to Agricultural and Home Economics Experiment Station and again in 1966 to Agriculture and Home Economics Experiment Station.","Iowa  State University",09-02-N.IAHEES.533-01-01,"Iowa State University Library Special Collections: http://www.add.lib.iastate.edu/spcl/index.html",1930-03-22|2012-06,,"U.S. and international copyright laws protect this digital image. Commercial use or distribution of the image is not permitted without prior permission of the copyright holder. For permission to use the digital image, please contact Iowa State University Library, Special Collections archives@iastate.edu  For reproductions see:  http://www.add.lib.iastate.edu/spcl/services/photfees.html","University Photographs; http://www.add.lib.iastate.edu/spcl/collections/images.html","Photograph| 12.1 x 9.1 cm",,Image|Image,09-02-N.IAHEES.533-01-01|https://digitalcollections.lib.iastate.edu/,,,,,,,,,,,,,,,,,,,,,,,,,,,,,,,,,,,,,,,,,,,,,,,,"<a href=""https://digitalcollections.lib.iastate.edu/"" target=""_blank"">View this item in its source respository</a>",,,,,,,,,,,,,,,,,,,,,,,,,,,,,https://www.iowaheritage.org/files/original/867cf64f2be8241005a872a5f05ec9d7.jpg,"Remote Item","Iowa State University Library Photograph Collection",1,0
67899,https://www.iowaheritage.org/items/show/67899,"Experiment 315, representative pig #205, 1929","Iowa State University|Iowa Agriculture and Home Economics Experiment Station|Swine","The  left side of representative pig #205  is shown for experiment 315 lot #5.|The Agricultural Experiment Station began at the Iowa Agricultural College and Model Farm (now Iowa State University) as a result of the Hatch Act of 1887 and an act passed by the Iowa General Assembly in 1888. The purpose of the station is to conduct research relating to agriculture and associated disciplines and to disseminate that information.  The name of the station was changed in in 1957 to Agricultural and Home Economics Experiment Station and again in 1966 to Agriculture and Home Economics Experiment Station.","Iowa  State University",09-02-N.IAHEES.533-01-02,"Iowa State University Library Special Collections: http://www.add.lib.iastate.edu/spcl/index.html",1929-04-15|2012-06,,"U.S. and international copyright laws protect this digital image. Commercial use or distribution of the image is not permitted without prior permission of the copyright holder. For permission to use the digital image, please contact Iowa State University Library, Special Collections archives@iastate.edu  For reproductions see:  http://www.add.lib.iastate.edu/spcl/services/photfees.html","University Photographs; http://www.add.lib.iastate.edu/spcl/collections/images.html","Photograph| 23.9 x 8.8 cm",,Image|Image,09-02-N.IAHEES.533-01-02|https://digitalcollections.lib.iastate.edu/,,,,,,,,,,,,,,,,,,,,,,,,,,,,,,,,,,,,,,,,,,,,,,,,"<a href=""https://digitalcollections.lib.iastate.edu/"" target=""_blank"">View this item in its source respository</a>",,,,,,,,,,,,,,,,,,,,,,,,,,,,,https://www.iowaheritage.org/files/original/60aa71f2dd7a603713611da317d6155c.jpg,"Remote Item","Iowa State University Library Photograph Collection",1,0
