 




﻿"Item Id","Item URI","Dublin Core:Title","Dublin Core:Subject","Dublin Core:Description","Dublin Core:Creator","Dublin Core:Source","Dublin Core:Publisher","Dublin Core:Date","Dublin Core:Contributor","Dublin Core:Rights","Dublin Core:Relation","Dublin Core:Format","Dublin Core:Language","Dublin Core:Type","Dublin Core:Identifier","Dublin Core:Coverage","Item Type Metadata:Text","Item Type Metadata:Interviewer","Item Type Metadata:Interviewee","Item Type Metadata:Location","Item Type Metadata:Transcription","Item Type Metadata:Local URL","Item Type Metadata:Original Format","Item Type Metadata:Physical Dimensions","Item Type Metadata:Duration","Item Type Metadata:Compression","Item Type Metadata:Producer","Item Type Metadata:Director","Item Type Metadata:Bit Rate/Frequency","Item Type Metadata:Time Summary","Item Type Metadata:Email Body","Item Type Metadata:Subject Line","Item Type Metadata:From","Item Type Metadata:To","Item Type Metadata:CC","Item Type Metadata:BCC","Item Type Metadata:Number of Attachments","Item Type Metadata:Standards","Item Type Metadata:Objectives","Item Type Metadata:Materials","Item Type Metadata:Lesson Plan Text","Item Type Metadata:URL","Item Type Metadata:Event Type","Item Type Metadata:Participants","Item Type Metadata:Birth Date","Item Type Metadata:Birthplace","Item Type Metadata:Death Date","Item Type Metadata:Occupation","Item Type Metadata:Biographical Text","Item Type Metadata:Bibliography","Item Type Metadata:Digital Reproduction Information","Item Type Metadata:Repository","Item Type Metadata:Repository Collection","Item Type Metadata:Contact information.","Item Type Metadata:File Name","Item Type Metadata:Notes","Item Type Metadata:Digital item created","Item Type Metadata:Digital item modified","Item Type Metadata:Executive Orders","Item Type Metadata:Record Created","Item Type Metadata:Record Modified","Item Type Metadata:Transcription2","Item Type Metadata:Source URL","Omeka Legacy File:Additional Creator","Omeka Legacy File:Transcriber","Omeka Legacy File:Producer","Omeka Legacy File:Render Device","Omeka Legacy File:Render Details","Omeka Legacy File:Capture Date","Omeka Legacy File:Capture Device","Omeka Legacy File:Capture Details","Omeka Legacy File:Change History","Omeka Legacy File:Watermark","Omeka Legacy File:Encryption","Omeka Legacy File:Compression","Omeka Legacy File:Post Processing","Omeka Image File:Width","Omeka Image File:Height","Omeka Image File:Bit Depth","Omeka Image File:Channels","Omeka Image File:Exif String","Omeka Image File:Exif Array","Omeka Image File:IPTC String","Omeka Image File:IPTC Array","Omeka Video File:Bitrate","Omeka Video File:Duration","Omeka Video File:Sample Rate","Omeka Video File:Codec","Omeka Video File:Width","Omeka Video File:Height",tags,file,itemType,collection,public,featured
80650,https://www.iowaheritage.org/items/show/80650,"UP625 Camping party in boats",Burlington-Iowa,,"Ernest Hanson",,,c1900,,"contact <a href=""http://www.burlington.lib.ia.us"" target=""_blank"">Burlington Public Library</a>",,"glass plate negative 4 1/8 x 6 3/8 inches",,,,,,,,,,,,,,,,,,,,,,,,,,,,,,,,,,,,,,,,,,,,"BUR GPN-08",,,,,,,,,,,,,,,,,,,,,,,,,,,,,,,,,,,,https://www.iowaheritage.org/files/original/5ff67eaec0b0246688f512a7a95912ad.jpg,"Still Image","Ernest Wyman Hanson Glass Plate Negative Collection",1,0
80649,https://www.iowaheritage.org/items/show/80649,"UP623 Boy at camping shack",,,"Ernest Hanson",,,c1900,,"contact <a href=""http://www.burlington.lib.ia.us"" target=""_blank"">Burlington Public Library</a>",,"glass plate negative 4 1/8 x 6 3/8 inches",,,,,,,,,,,,,,,,,,,,,,,,,,,,,,,,,,,,,,,,,,,,"BUR GPN-08",,,,,,,,,,,,,,,,,,,,,,,,,,,,,,,,,,,,https://www.iowaheritage.org/files/original/b885b42299da6e01cd19ee637de2a7ae.jpg,"Still Image","Ernest Wyman Hanson Glass Plate Negative Collection",1,0
80648,https://www.iowaheritage.org/items/show/80648,"UP621 E.W. Hanson and sons with campfire by river",Burlington-Iowa,,"Ernest Hanson",,,c1910-1912,,"contact <a href=""http://www.burlington.lib.ia.us"" target=""_blank"">Burlington Public Library</a>",,"glass plate negative 4 1/8 x 6 3/8 inches",,,,,,,,,,,,,,,,,,,,,,,,,,,,,,,,,,,,,,,,,,,,"BUR GPN-08",,,,,,,,,,,,,,,,,,,,,,,,,,,,,,,,,,,,https://www.iowaheritage.org/files/original/19d72b3d22e2dfcb95a275214fe9d56c.jpg,"Still Image","Ernest Wyman Hanson Glass Plate Negative Collection",1,0
80647,https://www.iowaheritage.org/items/show/80647,"UP619 Portrait of sitting man",,,"Ernest Hanson",,,c1900,,"contact <a href=""http://www.burlington.lib.ia.us"" target=""_blank"">Burlington Public Library</a>",,"glass plate negative 4 1/8 x 6 3/8 inches",,,,,,,,,,,,,,,,,,,,,,,,,,,,,,,,,,,,,,,,,,,,"BUR GPN-08",,,,,,,,,,,,,,,,,,,,,,,,,,,,,,,,,,,,https://www.iowaheritage.org/files/original/15e6c9dbffc8970554d2b31a242101a0.jpg,"Still Image","Ernest Wyman Hanson Glass Plate Negative Collection",1,0
80646,https://www.iowaheritage.org/items/show/80646,"UP613 Girl on porch steps",,,"Ernest Hanson",,,c1900,,"contact <a href=""http://www.burlington.lib.ia.us"" target=""_blank"">Burlington Public Library</a>",,"glass plate negative 4 1/8 x 6 3/8 inches",,,,,,,,,,,,,,,,,,,,,,,,,,,,,,,,,,,,,,,,,,,,"BUR GPN-08",,,,,,,,,,,,,,,,,,,,,,,,,,,,,,,,,,,,https://www.iowaheritage.org/files/original/8275fd5459637b3589839a7e839f7a2f.jpg,"Still Image","Ernest Wyman Hanson Glass Plate Negative Collection",1,0
80645,https://www.iowaheritage.org/items/show/80645,"UP611 Child sitting on arm of chair",,,"Ernest Hanson",,,c1900,,,"contact <a href=""http://www.burlington.lib.ia.us"" target=""_blank"">Burlington Public Library</a>","glass plate negative 4 1/8 x 6 3/8 inches",,,,,,,,,,,,,,,,,,,,,,,,,,,,,,,,,,,,,,,,,,,,"BUR GPN-08",,,,,,,,,,,,,,,,,,,,,,,,,,,,,,,,,,,,https://www.iowaheritage.org/files/original/32a419f60400d70de808bbb89de0f6e2.jpg,"Still Image","Ernest Wyman Hanson Glass Plate Negative Collection",1,0
80644,https://www.iowaheritage.org/items/show/80644,"UP610 Ellen Hanson and woman on log by river",Burlington-Iowa,,"Ernest Hanson",,,c1900,,"contact <a href=""http://www.burlington.lib.ia.us"" target=""_blank"">Burlington Public Library</a>",,"glass plate negative 4 1/8 x 6 3/8 inches",,,,,,,,,,,,,,,,,,,,,,,,,,,,,,,,,,,,,,,,,,,,"BUR GPN-08",,,,,,,,,,,,,,,,,,,,,,,,,,,,,,,,,,,,https://www.iowaheritage.org/files/original/35928c2d5cb0f296b2cfee804c47f739.jpg,"Still Image","Ernest Wyman Hanson Glass Plate Negative Collection",1,0
80643,https://www.iowaheritage.org/items/show/80643,"UP609 Boy in chair",,"Richard Hanson c1910","Ernest Hanson",,,c1910,,"contact <a href=""http://www.burlington.lib.ia.us"" target=""_blank"">Burlington Public Library</a>",,"glass plate negative 4 1/8 x 6 3/8 inches",,,,,,,,,,,,,,,,,,,,,,,,,,,,,,,,,,,,,,,,,,,,"BUR GPN-08",,,,,,,,,,,,,,,,,,,,,,,,,,,,,,,,,,,,https://www.iowaheritage.org/files/original/e3d384f452b63f7cc990ede02f93e367.jpg,"Still Image","Ernest Wyman Hanson Glass Plate Negative Collection",1,0
80642,https://www.iowaheritage.org/items/show/80642,"UP608 Woman and infant in rocker",,,"Ernest Hanson",,,c1900,,"contact <a href=""http://www.burlington.lib.ia.us"" target=""_blank"">Burlington Public Library</a>",,"glass plate negative 5 x 7 inches",,,,,,,,,,,,,,,,,,,,,,,,,,,,,,,,,,,,,,,,,,,,"BUR GPN-08",,,,,,,,,,,,,,,,,,,,,,,,,,,,,,,,,,,,https://www.iowaheritage.org/files/original/ec770bc5e3363df0967c36447f2ce1ab.jpg,"Still Image","Ernest Wyman Hanson Glass Plate Negative Collection",1,0
80641,https://www.iowaheritage.org/items/show/80641,"UP603 Old woman with December 1904 Cosmopolitan magazine",,,"Ernest Hanson",,,"December 1904 or later",,"contact <a href=""http://www.burlington.lib.ia.us"" target=""_blank"">Burlington Public Library</a>",,"glass plate negative 5 x 7 inches",,,,,,,,,,,,,,,,,,,,,,,,,,,,,,,,,,,,,,,,,,,,"BUR GPN-08",,,,,,,,,,,,,,,,,,,,,,,,,,,,,,,,,,,,https://www.iowaheritage.org/files/original/7373cac306f860ed0df162865eb7c700.jpg,"Still Image","Ernest Wyman Hanson Glass Plate Negative Collection",1,0
