 




﻿"Item Id","Item URI","Dublin Core:Title","Dublin Core:Subject","Dublin Core:Description","Dublin Core:Creator","Dublin Core:Source","Dublin Core:Publisher","Dublin Core:Date","Dublin Core:Contributor","Dublin Core:Rights","Dublin Core:Relation","Dublin Core:Format","Dublin Core:Language","Dublin Core:Type","Dublin Core:Identifier","Dublin Core:Coverage","Item Type Metadata:Text","Item Type Metadata:Interviewer","Item Type Metadata:Interviewee","Item Type Metadata:Location","Item Type Metadata:Transcription","Item Type Metadata:Local URL","Item Type Metadata:Original Format","Item Type Metadata:Physical Dimensions","Item Type Metadata:Duration","Item Type Metadata:Compression","Item Type Metadata:Producer","Item Type Metadata:Director","Item Type Metadata:Bit Rate/Frequency","Item Type Metadata:Time Summary","Item Type Metadata:Email Body","Item Type Metadata:Subject Line","Item Type Metadata:From","Item Type Metadata:To","Item Type Metadata:CC","Item Type Metadata:BCC","Item Type Metadata:Number of Attachments","Item Type Metadata:Standards","Item Type Metadata:Objectives","Item Type Metadata:Materials","Item Type Metadata:Lesson Plan Text","Item Type Metadata:URL","Item Type Metadata:Event Type","Item Type Metadata:Participants","Item Type Metadata:Birth Date","Item Type Metadata:Birthplace","Item Type Metadata:Death Date","Item Type Metadata:Occupation","Item Type Metadata:Biographical Text","Item Type Metadata:Bibliography","Item Type Metadata:Digital Reproduction Information","Item Type Metadata:Repository","Item Type Metadata:Repository Collection","Item Type Metadata:Contact information.","Item Type Metadata:File Name","Item Type Metadata:Notes","Item Type Metadata:Digital item created","Item Type Metadata:Digital item modified","Item Type Metadata:Executive Orders","Item Type Metadata:Record Created","Item Type Metadata:Record Modified","Item Type Metadata:Transcription2","Item Type Metadata:Source URL","Omeka Legacy File:Additional Creator","Omeka Legacy File:Transcriber","Omeka Legacy File:Producer","Omeka Legacy File:Render Device","Omeka Legacy File:Render Details","Omeka Legacy File:Capture Date","Omeka Legacy File:Capture Device","Omeka Legacy File:Capture Details","Omeka Legacy File:Change History","Omeka Legacy File:Watermark","Omeka Legacy File:Encryption","Omeka Legacy File:Compression","Omeka Legacy File:Post Processing","Omeka Image File:Width","Omeka Image File:Height","Omeka Image File:Bit Depth","Omeka Image File:Channels","Omeka Image File:Exif String","Omeka Image File:Exif Array","Omeka Image File:IPTC String","Omeka Image File:IPTC Array","Omeka Video File:Bitrate","Omeka Video File:Duration","Omeka Video File:Sample Rate","Omeka Video File:Codec","Omeka Video File:Width","Omeka Video File:Height",tags,file,itemType,collection,public,featured
28057,https://www.iowaheritage.org/items/show/28057,"Women technicians needed by Army in medical department|Republican (Bloomfield, Iowa)|Women's military activity","United States. Army. Women's Army Corps|United States -- Iowa -- Davis County -- Bloomfield|World War II|World War, 1939-1945 -- Participation, Female|Women soldiers -- Iowa",,,,"State Historical Society of Iowa, Iowa City",1944-06-20,,"This digital image may be used for educational purposes, as long as it is not altered in any way.  No commercial reproduction or distribution of this file is permitted without written permission of the State Historical Society of Iowa","World War II Iowa Press Clippings","image/jpeg|1 clipping : b&w ; 10 x 5 cm",eng,"Text; Clippings",1944-06-20-02.jpg|https://digital.lib.uiowa.edu/,,,,,,,,,,,,,,,,,,,,,,,,,,,,,,,,,,,,,,,,,,,,,,,,"<a href=""https://digital.lib.uiowa.edu/"" target=""_blank"">View this item in its source respository</a>",,,,,,,,,,,,,,,,,,,,,,,,,,,,,https://www.iowaheritage.org/files/original/8ceabeca916e7be102a3f19d58543833.jpg,"Remote Item","World War II Iowa Press Clippings",1,0
22862,https://www.iowaheritage.org/items/show/22862,"Women to hear WAAC, WAVE discussion tonight|Miss Herr will speak instead of Ensign Davis|Iowa State Student (Ames, Iowa)|Women's military activity","United States. Army. Women's Army Auxiliary Corps|United States -- Iowa -- Polk County -- Fort Des Moines|World War II|United States. Naval Reserve. Women's Reserve|World War, 1939-1945 -- Participation, Female|Women soldiers -- Iowa -- Fort Des Moines|United States -- Iowa -- Story County -- Ames",,,,"State Historical Society of Iowa, Iowa City","1942-11-17|1941;  1942;  1943;  1944;  1945;  1946;  1947;  1948;  1949;  1950|2006-07-10",,"This digital image may be used for educational purposes, as long as it is not altered in any way. No commercial reproduction or distribution of this file is permitted without written permission of the State Historical Society of Iowa.","World War II Iowa Press Clippings","image/jpeg|1 clipping : b&w ; 16 x 5 cm.",eng,"Text; Clippings",1942-11-17-04.jpg|173848404|https://digital.lib.uiowa.edu/,,,,,,,,,,,,,,,,,,,,,,,,,,,,,,,,,,,,,,,,,,,,,,,,"<a href=""https://digital.lib.uiowa.edu/"" target=""_blank"">View this item in its source respository</a>",,,,,,,,,,,,,,,,,,,,,,,,,,,,,https://www.iowaheritage.org/files/original/de512f9da06b7092ec4b4c4389289d3a.jpg,"Remote Item","World War II Iowa Press Clippings",1,0
24925,https://www.iowaheritage.org/items/show/24925,"Women to replace service men sought by weather bureau|Tribune (Sioux City, Iowa)|Women's military activity","World War, 1939-1945 -- Participation, Female|United States -- Iowa|World War II|Women soldiers -- Iowa",,,,"State Historical Society of Iowa, Iowa City","1943-04-02|1941;  1942;  1943;  1944;  1945;  1946;  1947;  1948;  1949;  1950|2007-03-23",,"This digital image may be used for educational purposes, as long as it is not altered in any way. No commercial reproduction or distribution of this file is permitted without written permission of the State Historical Society of Iowa.","World War II Iowa Press Clippings","image/jpeg|1 clipping : b&w ; 9 x 5 cm.",eng,"Text; Clippings",1943-04-02-01.jpg|173848404|https://digital.lib.uiowa.edu/,,,,,,,,,,,,,,,,,,,,,,,,,,,,,,,,,,,,,,,,,,,,,,,,"<a href=""https://digital.lib.uiowa.edu/"" target=""_blank"">View this item in its source respository</a>",,,,,,,,,,,,,,,,,,,,,,,,,,,,,https://www.iowaheritage.org/files/original/d8b75a7cf6f115d259da88df8bf3e21d.jpg,"Remote Item","World War II Iowa Press Clippings",1,0
22932,https://www.iowaheritage.org/items/show/22932,"Women told how army builds morale|Morning Register (Des Moines, Iowa)|Women's military activity","United States. Army. Women's Army Auxiliary Corps|United States -- Iowa -- Polk County -- Fort Des Moines|World War II|World War, 1939-1945 -- Participation, Female|Women soldiers -- Iowa -- Fort Des Moines",,,,"State Historical Society of Iowa, Iowa City","1942-11-25|1941;  1942;  1943;  1944;  1945;  1946;  1947;  1948;  1949;  1950|2006-07-10",,"This digital image may be used for educational purposes, as long as it is not altered in any way. No commercial reproduction or distribution of this file is permitted without written permission of the State Historical Society of Iowa.","World War II Iowa Press Clippings","image/jpeg|1 clipping : b&w ; 21 x 10 cm.",eng,"Text; Clippings",1942-11-25-01.jpg|173848404|https://digital.lib.uiowa.edu/,,,,,,,,,,,,,,,,,,,,,,,,,,,,,,,,,,,,,,,,,,,,,,,,"<a href=""https://digital.lib.uiowa.edu/"" target=""_blank"">View this item in its source respository</a>",,,,,,,,,,,,,,,,,,,,,,,,,,,,,https://www.iowaheritage.org/files/original/a2e7ced4b6cfdcfeb0d84234e610a519.jpg,"Remote Item","World War II Iowa Press Clippings",1,0
23036,https://www.iowaheritage.org/items/show/23036,"Women told how they can aid in recruiting WAACs|Times (Cherokee, Iowa)|Women's military activity","United States. Army. Women's Army Auxiliary Corps|United States -- Iowa -- Polk County -- Fort Des Moines|World War II|World War, 1939-1945 -- Participation, Female|Women soldiers -- Iowa -- Fort Des Moines|United States -- Iowa -- Cherokee County -- Cherokee",,,,"State Historical Society of Iowa, Iowa City","1942-12-11|1941;  1942;  1943;  1944;  1945;  1946;  1947;  1948;  1949;  1950|2006-07-10",,"This digital image may be used for educational purposes, as long as it is not altered in any way. No commercial reproduction or distribution of this file is permitted without written permission of the State Historical Society of Iowa.","World War II Iowa Press Clippings","image/jpeg|1 clipping : b&w ; 18 x 5 cm.",eng,"Text; Clippings",1942-12-11-04.jpg|173848404|https://digital.lib.uiowa.edu/,,,,,,,,,,,,,,,,,,,,,,,,,,,,,,,,,,,,,,,,,,,,,,,,"<a href=""https://digital.lib.uiowa.edu/"" target=""_blank"">View this item in its source respository</a>",,,,,,,,,,,,,,,,,,,,,,,,,,,,,https://www.iowaheritage.org/files/original/4aecd51412dee394dd3be2a275d2547c.jpg,"Remote Item","World War II Iowa Press Clippings",1,0
22611,https://www.iowaheritage.org/items/show/22611,"Women urged as chaplains|To serve in WAACs and WAVES|Register (Des Moines, Iowa)|Women's military activity","United States. Army. Women's Army Auxiliary Corps|United States -- Iowa -- Polk County -- Fort Des Moines|World War II|United States. Naval Reserve. Women's Reserve|World War, 1939-1945 -- Participation, Female|Women soldiers -- Iowa",,,,"State Historical Society of Iowa, Iowa City","1942-10-16|1941;  1942;  1943;  1944;  1945;  1946;  1947;  1948;  1949;  1950|2006-07-10",,"This digital image may be used for educational purposes, as long as it is not altered in any way. No commercial reproduction or distribution of this file is permitted without written permission of the State Historical Society of Iowa.","World War II Iowa Press Clippings","image/jpeg|1 clipping : b&w ;  x  cm.",eng,"Text; Clippings",1942-10-16-01.jpg|173848404|https://digital.lib.uiowa.edu/,,,,,,,,,,,,,,,,,,,,,,,,,,,,,,,,,,,,,,,,,,,,,,,,"<a href=""https://digital.lib.uiowa.edu/"" target=""_blank"">View this item in its source respository</a>",,,,,,,,,,,,,,,,,,,,,,,,,,,,,https://www.iowaheritage.org/files/original/cbb6dec3a0eaab11ec54c93632dee446.jpg,"Remote Item","World War II Iowa Press Clippings",1,0
24933,https://www.iowaheritage.org/items/show/24933,"Women vets visit WAACs|Evening Tribune (Des Moines, Iowa)|Women's military activity","United States. Army. Women's Army Auxiliary Corps|United States -- Iowa -- Polk County -- Fort Des Moines|World War II|World War, 1939-1945 -- Participation, Female|Women soldiers -- Iowa -- Fort Des Moines",,,,"State Historical Society of Iowa, Iowa City","1943-03-31|1941;  1942;  1943;  1944;  1945;  1946;  1947;  1948;  1949;  1950|2007-03-23",,"This digital image may be used for educational purposes, as long as it is not altered in any way. No commercial reproduction or distribution of this file is permitted without written permission of the State Historical Society of Iowa.","World War II Iowa Press Clippings","image/jpeg|1 clipping : b&w ; 10 x 5 cm.",eng,"Text; Clippings",1943-03-31-01.jpg|173848404|https://digital.lib.uiowa.edu/,,,,,,,,,,,,,,,,,,,,,,,,,,,,,,,,,,,,,,,,,,,,,,,,"<a href=""https://digital.lib.uiowa.edu/"" target=""_blank"">View this item in its source respository</a>",,,,,,,,,,,,,,,,,,,,,,,,,,,,,https://www.iowaheritage.org/files/original/f49f99c904a7786ce269f164136be023.jpg,"Remote Item","World War II Iowa Press Clippings",1,0
28179,https://www.iowaheritage.org/items/show/28179,"Women visit WACs at fort|Morning Register (Des Moines, Iowa)|Women's military activity","United States. Army. Women's Army Corps|United States -- Iowa -- Polk County -- Fort Des Moines|World War II|World War, 1939-1945 -- Participation, Female|Women soldiers -- Iowa -- Fort Des Moines","Images of commanding general and advisory committee accompanies article.",,,"State Historical Society of Iowa, Iowa City",1944-07-01,,"This digital image may be used for educational purposes, as long as it is not altered in any way.  No commercial reproduction or distribution of this file is permitted without written permission of the State Historical Society of Iowa","World War II Iowa Press Clippings","image/jpeg|1 clipping : b&w ; 24 x 16 cm",eng,"Text; Clippings; Still Image",1944-07-01-01.jpg|https://digital.lib.uiowa.edu/,,,,,,,,,,,,,,,,,,,,,,,,,,,,,,,,,,,,,,,,,,,,,,,,"<a href=""https://digital.lib.uiowa.edu/"" target=""_blank"">View this item in its source respository</a>",,,,,,,,,,,,,,,,,,,,,,,,,,,,,https://www.iowaheritage.org/files/original/39beb3b8fd04ac80e24260102b08b6b9.jpg,"Remote Item","World War II Iowa Press Clippings",1,0
24539,https://www.iowaheritage.org/items/show/24539,"Women volunteer in navy branch|Conservative (Tipton, Iowa)|Women's military activity","United States. Naval Reserve. Women's Reserve|United States -- Iowa -- Cedar County -- Tipton|World War II|World War, 1939-1945 -- Participation, Female|Women soldiers -- Iowa",,,,"State Historical Society of Iowa, Iowa City","1943-03-04|1941;  1942;  1943;  1944;  1945;  1946;  1947;  1948;  1949;  1950|2006-11-27",,"This digital image may be used for educational purposes, as long as it is not altered in any way. No commercial reproduction or distribution of this file is permitted without written permission of the State Historical Society of Iowa.","World War II Iowa Press Clippings","image/jpeg|1 clipping : b&w ; 25 x 11 cm.",eng,"Text; Clippings",1943-03-04-19.jpg|173848404|https://digital.lib.uiowa.edu/,,,,,,,,,,,,,,,,,,,,,,,,,,,,,,,,,,,,,,,,,,,,,,,,"<a href=""https://digital.lib.uiowa.edu/"" target=""_blank"">View this item in its source respository</a>",,,,,,,,,,,,,,,,,,,,,,,,,,,,,https://www.iowaheritage.org/files/original/1d1d4bdd19545285ad0b971fdbce1755.jpg,"Remote Item","World War II Iowa Press Clippings",1,0
28404,https://www.iowaheritage.org/items/show/28404,"Women wanted for the WAVES|Special recruiter will be in Adel August 21 and 22 at the Fowler drug co. store.|News (Adel, Iowa)|Women's military activity","United States. Naval Reserve. Women's Reserve|United States -- Iowa -- Dallas County -- Adel|World War II|World War, 1939-1945 -- Participation, Female|Women soldiers -- Iowa","Image of Rita Marsden, SP. R. accompanies article.",,,"State Historical Society of Iowa, Iowa City",1944-08-09,,"This digital image may be used for educational purposes, as long as it is not altered in any way.  No commercial reproduction or distribution of this file is permitted without written permission of the State Historical Society of Iowa","World War II Iowa Press Clippings","image/jpeg|1 clipping : b&w ; 22 x 5 cm",eng,"Text; Clippings; Still Image",1944-08-09-06.jpg|https://digital.lib.uiowa.edu/,,,,,,,,,,,,,,,,,,,,,,,,,,,,,,,,,,,,,,,,,,,,,,,,"<a href=""https://digital.lib.uiowa.edu/"" target=""_blank"">View this item in its source respository</a>",,,,,,,,,,,,,,,,,,,,,,,,,,,,,https://www.iowaheritage.org/files/original/e1afbd834a53b81278b07f85f02bd3c4.jpg,"Remote Item","World War II Iowa Press Clippings",1,0
