 




﻿"Item Id","Item URI","Dublin Core:Title","Dublin Core:Subject","Dublin Core:Description","Dublin Core:Creator","Dublin Core:Source","Dublin Core:Publisher","Dublin Core:Date","Dublin Core:Contributor","Dublin Core:Rights","Dublin Core:Relation","Dublin Core:Format","Dublin Core:Language","Dublin Core:Type","Dublin Core:Identifier","Dublin Core:Coverage","Item Type Metadata:Text","Item Type Metadata:Interviewer","Item Type Metadata:Interviewee","Item Type Metadata:Location","Item Type Metadata:Transcription","Item Type Metadata:Local URL","Item Type Metadata:Original Format","Item Type Metadata:Physical Dimensions","Item Type Metadata:Duration","Item Type Metadata:Compression","Item Type Metadata:Producer","Item Type Metadata:Director","Item Type Metadata:Bit Rate/Frequency","Item Type Metadata:Time Summary","Item Type Metadata:Email Body","Item Type Metadata:Subject Line","Item Type Metadata:From","Item Type Metadata:To","Item Type Metadata:CC","Item Type Metadata:BCC","Item Type Metadata:Number of Attachments","Item Type Metadata:Standards","Item Type Metadata:Objectives","Item Type Metadata:Materials","Item Type Metadata:Lesson Plan Text","Item Type Metadata:URL","Item Type Metadata:Event Type","Item Type Metadata:Participants","Item Type Metadata:Birth Date","Item Type Metadata:Birthplace","Item Type Metadata:Death Date","Item Type Metadata:Occupation","Item Type Metadata:Biographical Text","Item Type Metadata:Bibliography","Item Type Metadata:Digital Reproduction Information","Item Type Metadata:Repository","Item Type Metadata:Repository Collection","Item Type Metadata:Contact information.","Item Type Metadata:File Name","Item Type Metadata:Notes","Item Type Metadata:Digital item created","Item Type Metadata:Digital item modified","Item Type Metadata:Executive Orders","Item Type Metadata:Record Created","Item Type Metadata:Record Modified","Item Type Metadata:Transcription2","Item Type Metadata:Source URL","Omeka Legacy File:Additional Creator","Omeka Legacy File:Transcriber","Omeka Legacy File:Producer","Omeka Legacy File:Render Device","Omeka Legacy File:Render Details","Omeka Legacy File:Capture Date","Omeka Legacy File:Capture Device","Omeka Legacy File:Capture Details","Omeka Legacy File:Change History","Omeka Legacy File:Watermark","Omeka Legacy File:Encryption","Omeka Legacy File:Compression","Omeka Legacy File:Post Processing","Omeka Image File:Width","Omeka Image File:Height","Omeka Image File:Bit Depth","Omeka Image File:Channels","Omeka Image File:Exif String","Omeka Image File:Exif Array","Omeka Image File:IPTC String","Omeka Image File:IPTC Array","Omeka Video File:Bitrate","Omeka Video File:Duration","Omeka Video File:Sample Rate","Omeka Video File:Codec","Omeka Video File:Width","Omeka Video File:Height",tags,file,itemType,collection,public,featured
31326,https://www.iowaheritage.org/items/show/31326,"Members of the Scottish Highlanders on football field with drum, The University of Iowa, October 26, 1948","Universities & colleges|Tartans|University of Iowa|United States -- Iowa -- Iowa City|1940-1950|Marching bands|Drum majors|Drums|Ceremonial maces|Kilts|Headgear|Stadiums|Sports spectators|Hides & skins|University of Iowa. Scottish Highlanders","Dating back to 1936, the Scottish Highlanders was a student group dedicated to practicing and performing the Scottish arts of piping, drumming and dancing.","Kent, Frederick W. (Frederick Wallace), 1894-1984",,"University of Iowa. Libraries. University Archives",1948-10-26|2010-09-12,,"Educational use only, no other permissions given. U.S. and international copyright laws may protect this digital object. Commercial use or distribution of the object is not permitted without prior permission of the copyright holder.","Iowa City Town and Campus Scenes|Frederick W. Kent Collection of Photographs, 1866-2000|http://www.lib.uiowa.edu/collguides/?RG30.0001.01|Prints|Organizations|Scottish Highlanders|Scottish Highlanders|Scanned with Ricoh Aficio 3228C @ 600 ppi. Master image saved in TIFF format",,,"Still image|Photographs|jpeg",RG30.0001.01|org14-0048.jpg|https://digital.lib.uiowa.edu/,,,,,,,,,,,,,,,,,,,,,,,,,,,,,,,,,,,,,,,,,,,,,,,,"<a href=""https://digital.lib.uiowa.edu/"" target=""_blank"">View this item in its source respository</a>",,,,,,,,,,,,,,,,,,,,,,,,,,,,,https://www.iowaheritage.org/files/original/badc8a703ee83fce67241739a2f614fe.jpg,"Remote Item","Iowa City Town and Campus Scenes",1,0
30969,https://www.iowaheritage.org/items/show/30969,"Members of Scottish Highlanders grouped around bass drum, The University of Iowa, 1948","Universities & colleges|Tartans|University of Iowa|United States -- Iowa -- Iowa City|1940-1950|Bands|Drums|Kilts|University of Iowa. Scottish Highlanders","Dating back to 1936, the Scottish Highlanders was a student group dedicated to practicing and performing the Scottish arts of piping, drumming and dancing.","Kent, Frederick W. (Frederick Wallace), 1894-1984",,"University of Iowa. Libraries. University Archives",1948|2010-09-12,,"Educational use only, no other permissions given. U.S. and international copyright laws may protect this digital object. Commercial use or distribution of the object is not permitted without prior permission of the copyright holder.","Iowa City Town and Campus Scenes|Frederick W. Kent Collection of Photographs, 1866-2000|http://www.lib.uiowa.edu/collguides/?RG30.0001.01|Prints|Organizations|Scottish Highlanders|Scottish Highlanders|Scanned with Ricoh Aficio 3228C @ 600 ppi. Master image saved in TIFF format",8|10,,"Still image|Photographs; Group portraits|jpeg",RG30.0001.01|index.cpd|https://digital.lib.uiowa.edu/,,,,,,,,,,,,,,,,,,,,,,,,,,,,,,,,,,,,,,,,,,,,,,,,"<a href=""https://digital.lib.uiowa.edu/"" target=""_blank"">View this item in its source respository</a>",,,,,,,,,,,,,,,,,,,,,,,,,,,,,https://www.iowaheritage.org/files/original/c057f5992b31270d9ebcd61f5e3a6317.jpg,"Remote Item","Iowa City Town and Campus Scenes",1,0
30878,https://www.iowaheritage.org/items/show/30878,"Members of Scottish Highlanders governing board with drum major Kathy Monahan front row center, The University of Iowa, 1969","Universities & colleges|Tartans|Monahan, Kathy|University of Iowa|United States -- Iowa -- Iowa City|1960-1970|Kilts|Drum majors|Bands|University of Iowa. Scottish Highlanders","Dating back to 1936, the Scottish Highlanders was a student group dedicated to practicing and performing the Scottish arts of piping, drumming and dancing.","Kent, Frederick W. (Frederick Wallace), 1894-1984",,"University of Iowa. Libraries. University Archives",1969|2010-09-12,,"Educational use only, no other permissions given. U.S. and international copyright laws may protect this digital object. Commercial use or distribution of the object is not permitted without prior permission of the copyright holder.","Iowa City Town and Campus Scenes|Frederick W. Kent Collection of Photographs, 1866-2000|http://www.lib.uiowa.edu/collguides/?RG30.0001.01|Prints|Organizations|Scottish Highlanders|Scottish Highlanders|Scanned with Ricoh Aficio 3228C @ 600 ppi. Master image saved in TIFF format",8|10,,"Still image|Photographs; Group portraits|jpeg",RG30.0001.01|index.cpd|https://digital.lib.uiowa.edu/,,,,,,,,,,,,,,,,,,,,,,,,,,,,,,,,,,,,,,,,,,,,,,,,"<a href=""https://digital.lib.uiowa.edu/"" target=""_blank"">View this item in its source respository</a>",,,,,,,,,,,,,,,,,,,,,,,,,,,,,https://www.iowaheritage.org/files/original/eb3d46438bc911c6f811e7b9b5e97d26.jpg,"Remote Item","Iowa City Town and Campus Scenes",1,0
30955,https://www.iowaheritage.org/items/show/30955,"Mary Beth Miller, Scottish Highlanders dance instructor, The University of Iowa, 1979","Universities & colleges|Miller, Mary Beth|University of Iowa|United States -- Iowa -- Iowa City|1970-1980|Teachers|Bagpipes|University of Iowa. Scottish Highlanders","Dating back to 1936, the Scottish Highlanders was a student group dedicated to practicing and performing the Scottish arts of piping, drumming and dancing.","Kent, Frederick W. (Frederick Wallace), 1894-1984",,"University of Iowa. Libraries. University Archives",1979|2010-09-12,,"Educational use only, no other permissions given. U.S. and international copyright laws may protect this digital object. Commercial use or distribution of the object is not permitted without prior permission of the copyright holder.","Iowa City Town and Campus Scenes|Frederick W. Kent Collection of Photographs, 1866-2000|http://www.lib.uiowa.edu/collguides/?RG30.0001.01|Prints|Organizations|Scottish Highlanders|Scottish Highlanders|Scanned with Ricoh Aficio 3228C @ 600 ppi. Master image saved in TIFF format",7|5,,"Still image|Photographs|jpeg",RG30.0001.01|index.cpd|https://digital.lib.uiowa.edu/,,,,,,,,,,,,,,,,,,,,,,,,,,,,,,,,,,,,,,,,,,,,,,,,"<a href=""https://digital.lib.uiowa.edu/"" target=""_blank"">View this item in its source respository</a>",,,,,,,,,,,,,,,,,,,,,,,,,,,,,https://www.iowaheritage.org/files/original/0e41ccaaf6f7a3873534c82e3ce9d87b.jpg,"Remote Item","Iowa City Town and Campus Scenes",1,0
26206,https://www.iowaheritage.org/items/show/26206,"Marching band performing at football game, The University of Iowa, October 7, 1939","Universities & colleges|University of Iowa|United States -- Iowa -- Iowa City|1930-1940|Marching bands|Stadiums|Spectators|Football|University of Iowa. Scottish Highlanders|Kinnick Stadium (Iowa City, Iowa)",,"Kent, Frederick W. (Frederick Wallace), 1894-1984",,"University of Iowa. Libraries. University Archives",1939-10-07|2009-07,,"Educational use only, no other permissions given. U.S. and international copyright laws may protect this digital object. Commercial use or distribution of the object is not permitted without prior permission of the copyright holder.","Iowa City Town and Campus Scenes|Frederick W. Kent Collection of Photographs, 1866-2000|http://www.lib.uiowa.edu/collguides/?RG30.0001.01|Prints|Athletics; Men's athletics|Bands|Bands|Scanned with Ricoh Aficio 3228C @ 300 ppi. Master image saved in TIFF format",12|18,,"Still image|Photographs|jpeg",RG30.0001.01|ath0080.jpg|https://digital.lib.uiowa.edu/,,,,,,,,,,,,,,,,,,,,,,,,,,,,,,,,,,,,,,,,,,,,,,,,"<a href=""https://digital.lib.uiowa.edu/"" target=""_blank"">View this item in its source respository</a>",,,,,,,,,,,,,,,,,,,,,,,,,,,,,https://www.iowaheritage.org/files/original/77c426ccba1635a413b8bc47c59cc399.jpg,"Remote Item","Iowa City Town and Campus Scenes",1,0
25304,https://www.iowaheritage.org/items/show/25304,"Marching band performing at football game, The University of Iowa, November 11, 1939?","Universities & colleges|University of Iowa. Scottish Highlanders|United States -- Iowa -- Iowa City|1930-1940|Marching bands|Football|Stadiums|Spectators",,"Kent, Frederick W. (Frederick Wallace), 1894-1984",,"University of Iowa. Libraries. University Archives",1939-11-11|2009-07,,"Educational use only, no other permissions given. U.S. and international copyright laws may protect this digital object. Commercial use or distribution of the object is not permitted without prior permission of the copyright holder.","Iowa City Town and Campus Scenes|Frederick W. Kent Collection of Photographs, 1866-2000|http://www.lib.uiowa.edu/collguides/?RG30.0001.01|Prints|Athletics; Men's athletics|Bands|Bands|Scanned with Ricoh Aficio 3228C @ 300 ppi. Master image saved in TIFF format",9|12,,"Still image|Photographs|jpeg",RG30.0001.01|https://digital.lib.uiowa.edu/,,,,,,,,,,,,,,,,,,,,,,,,,,,,,,,,,,,,,,,,,,,,,,,,"<a href=""https://digital.lib.uiowa.edu/"" target=""_blank"">View this item in its source respository</a>",,,,,,,,,,,,,,,,,,,,,,,,,,,,,https://www.iowaheritage.org/files/original/c88d7733adace26e1ba9396770ed03d6.jpg,"Remote Item","Iowa City Town and Campus Scenes",1,0
30912,https://www.iowaheritage.org/items/show/30912,"Marching band and Scottish Highlanders performance at football game, The University of Iowa, October 1938","Universities & colleges|University of Iowa|United States -- Iowa -- Iowa City|1930-1940|Marching bands|Football|Stadiums|Sports spectators|Drum majors|University of Iowa. Scottish Highlanders|University of Iowa. Hawkeye Marching Band","Dating back to 1936, the Scottish Highlanders was a student group dedicated to practicing and performing the Scottish arts of piping, drumming and dancing.","Kent, Frederick W. (Frederick Wallace), 1894-1984",,"University of Iowa. Libraries. University Archives",1938-10|2010-09-12,,"Educational use only, no other permissions given. U.S. and international copyright laws may protect this digital object. Commercial use or distribution of the object is not permitted without prior permission of the copyright holder.","Iowa City Town and Campus Scenes|Frederick W. Kent Collection of Photographs, 1866-2000|http://www.lib.uiowa.edu/collguides/?RG30.0001.01|Prints|Organizations|Scottish Highlanders|Scottish Highlanders|Scanned with Ricoh Aficio 3228C @ 600 ppi. Master image saved in TIFF format",,,"Still image|Photographs|jpeg",RG30.0001.01|index.cpd|https://digital.lib.uiowa.edu/,,,,,,,,,,,,,,,,,,,,,,,,,,,,,,,,,,,,,,,,,,,,,,,,"<a href=""https://digital.lib.uiowa.edu/"" target=""_blank"">View this item in its source respository</a>",,,,,,,,,,,,,,,,,,,,,,,,,,,,,https://www.iowaheritage.org/files/original/f376b5f5b3df16f911768e6e3351c115.jpg,"Remote Item","Iowa City Town and Campus Scenes",1,0
30911,https://www.iowaheritage.org/items/show/30911,"Marching band and Scottish Highlanders performance at football game, The University of Iowa, October 1938","Universities & colleges|University of Iowa|United States -- Iowa -- Iowa City|1930-1940|Marching bands|Football|Stadiums|Sports spectators|Drum majors|University of Iowa. Scottish Highlanders|University of Iowa. Hawkeye Marching Band","Dating back to 1936, the Scottish Highlanders was a student group dedicated to practicing and performing the Scottish arts of piping, drumming and dancing.","Kent, Frederick W. (Frederick Wallace), 1894-1984",,"University of Iowa. Libraries. University Archives",1938-10|2010-09-12,,"Educational use only, no other permissions given. U.S. and international copyright laws may protect this digital object. Commercial use or distribution of the object is not permitted without prior permission of the copyright holder.","Iowa City Town and Campus Scenes|Frederick W. Kent Collection of Photographs, 1866-2000|http://www.lib.uiowa.edu/collguides/?RG30.0001.01|Prints|Organizations|Scottish Highlanders|Scottish Highlanders|Scanned with Ricoh Aficio 3228C @ 600 ppi. Master image saved in TIFF format",,,"Still image|Photographs|jpeg",RG30.0001.01|index.cpd|https://digital.lib.uiowa.edu/,,,,,,,,,,,,,,,,,,,,,,,,,,,,,,,,,,,,,,,,,,,,,,,,"<a href=""https://digital.lib.uiowa.edu/"" target=""_blank"">View this item in its source respository</a>",,,,,,,,,,,,,,,,,,,,,,,,,,,,,https://www.iowaheritage.org/files/original/176b22b3cc59ff38f2a3b9a5041f5160.jpg,"Remote Item","Iowa City Town and Campus Scenes",1,0
30917,https://www.iowaheritage.org/items/show/30917,"Marching band and Scottish Highlanders performance at Chicago-Iowa football game, The University of Iowa, October 15, 1938","Universities & colleges|University of Iowa|United States -- Iowa -- Iowa City|1930-1940|Marching bands|Football|Stadiums|Sports spectators|Drum majors|University of Iowa. Scottish Highlanders|University of Iowa. Hawkeye Marching Band","Dating back to 1936, the Scottish Highlanders was a student group dedicated to practicing and performing the Scottish arts of piping, drumming and dancing.","Kent, Frederick W. (Frederick Wallace), 1894-1984",,"University of Iowa. Libraries. University Archives",1938-10-15|2010-09-12,,"Educational use only, no other permissions given. U.S. and international copyright laws may protect this digital object. Commercial use or distribution of the object is not permitted without prior permission of the copyright holder.","Iowa City Town and Campus Scenes|Frederick W. Kent Collection of Photographs, 1866-2000|http://www.lib.uiowa.edu/collguides/?RG30.0001.01|Prints|Organizations|Scottish Highlanders|Scottish Highlanders|Scanned with Ricoh Aficio 3228C @ 600 ppi. Master image saved in TIFF format",,,"Still image|Photographs|jpeg",RG30.0001.01|index.cpd|https://digital.lib.uiowa.edu/,,,,,,,,,,,,,,,,,,,,,,,,,,,,,,,,,,,,,,,,,,,,,,,,"<a href=""https://digital.lib.uiowa.edu/"" target=""_blank"">View this item in its source respository</a>",,,,,,,,,,,,,,,,,,,,,,,,,,,,,https://www.iowaheritage.org/files/original/61ab3b97f7876a21cb00aa237eca8d2c.jpg,"Remote Item","Iowa City Town and Campus Scenes",1,0
31651,https://www.iowaheritage.org/items/show/31651,"Man speaking at Scottish Highlander banquet, The University of Iowa, May 1978","Universities & colleges|University of Iowa|United States -- Iowa -- Iowa City|1970-1980|Banquets|Public speaking|University of Iowa. Scottish Highlanders","Dating back to 1936, the Scottish Highlanders was a student group dedicated to practicing and performing the Scottish arts of piping, drumming and dancing.","Kent, Frederick W. (Frederick Wallace), 1894-1984",,"University of Iowa. Libraries. University Archives",1978-05|2010-09-12,,"Educational use only, no other permissions given. U.S. and international copyright laws may protect this digital object. Commercial use or distribution of the object is not permitted without prior permission of the copyright holder.","Iowa City Town and Campus Scenes|Frederick W. Kent Collection of Photographs, 1866-2000|http://www.lib.uiowa.edu/collguides/?RG30.0001.01|Prints|Organizations|Scottish Highlanders|Scottish Highlanders|Scanned with Ricoh Aficio 3228C @ 600 ppi. Master image saved in TIFF format",,,"Still image|Photographs|jpeg",RG30.0001.01|org14-0132.jpg|https://digital.lib.uiowa.edu/,,,,,,,,,,,,,,,,,,,,,,,,,,,,,,,,,,,,,,,,,,,,,,,,"<a href=""https://digital.lib.uiowa.edu/"" target=""_blank"">View this item in its source respository</a>",,,,,,,,,,,,,,,,,,,,,,,,,,,,,https://www.iowaheritage.org/files/original/5fee6c1edad6c773444a2657c08466ad.jpg,"Remote Item","Iowa City Town and Campus Scenes",1,0
