 




﻿"Item Id","Item URI","Dublin Core:Title","Dublin Core:Subject","Dublin Core:Description","Dublin Core:Creator","Dublin Core:Source","Dublin Core:Publisher","Dublin Core:Date","Dublin Core:Contributor","Dublin Core:Rights","Dublin Core:Relation","Dublin Core:Format","Dublin Core:Language","Dublin Core:Type","Dublin Core:Identifier","Dublin Core:Coverage","Item Type Metadata:Text","Item Type Metadata:Interviewer","Item Type Metadata:Interviewee","Item Type Metadata:Location","Item Type Metadata:Transcription","Item Type Metadata:Local URL","Item Type Metadata:Original Format","Item Type Metadata:Physical Dimensions","Item Type Metadata:Duration","Item Type Metadata:Compression","Item Type Metadata:Producer","Item Type Metadata:Director","Item Type Metadata:Bit Rate/Frequency","Item Type Metadata:Time Summary","Item Type Metadata:Email Body","Item Type Metadata:Subject Line","Item Type Metadata:From","Item Type Metadata:To","Item Type Metadata:CC","Item Type Metadata:BCC","Item Type Metadata:Number of Attachments","Item Type Metadata:Standards","Item Type Metadata:Objectives","Item Type Metadata:Materials","Item Type Metadata:Lesson Plan Text","Item Type Metadata:URL","Item Type Metadata:Event Type","Item Type Metadata:Participants","Item Type Metadata:Birth Date","Item Type Metadata:Birthplace","Item Type Metadata:Death Date","Item Type Metadata:Occupation","Item Type Metadata:Biographical Text","Item Type Metadata:Bibliography","Item Type Metadata:Digital Reproduction Information","Item Type Metadata:Repository","Item Type Metadata:Repository Collection","Item Type Metadata:Contact information.","Item Type Metadata:File Name","Item Type Metadata:Notes","Item Type Metadata:Digital item created","Item Type Metadata:Digital item modified","Item Type Metadata:Executive Orders","Item Type Metadata:Record Created","Item Type Metadata:Record Modified","Item Type Metadata:Transcription2","Item Type Metadata:Source URL","Omeka Legacy File:Additional Creator","Omeka Legacy File:Transcriber","Omeka Legacy File:Producer","Omeka Legacy File:Render Device","Omeka Legacy File:Render Details","Omeka Legacy File:Capture Date","Omeka Legacy File:Capture Device","Omeka Legacy File:Capture Details","Omeka Legacy File:Change History","Omeka Legacy File:Watermark","Omeka Legacy File:Encryption","Omeka Legacy File:Compression","Omeka Legacy File:Post Processing","Omeka Image File:Width","Omeka Image File:Height","Omeka Image File:Bit Depth","Omeka Image File:Channels","Omeka Image File:Exif String","Omeka Image File:Exif Array","Omeka Image File:IPTC String","Omeka Image File:IPTC Array","Omeka Video File:Bitrate","Omeka Video File:Duration","Omeka Video File:Sample Rate","Omeka Video File:Codec","Omeka Video File:Width","Omeka Video File:Height",tags,file,itemType,collection,public,featured
26372,https://www.iowaheritage.org/items/show/26372,"Iowa football right end Frank Gilliam, The University of Iowa, 1953-1956","Universities & colleges|Gilliam, Frank|University of Iowa|United States -- Iowa -- Iowa City|1950-1960|Football players","On football team from 1953-1956.","Kent, Frederick W. (Frederick Wallace), 1894-1984",,"University of Iowa. Libraries. University Archives",1953/1956|2009-07,,"Educational use only, no other permissions given. U.S. and international copyright laws may protect this digital object. Commercial use or distribution of the object is not permitted without prior permission of the copyright holder.","Iowa City Town and Campus Scenes|Frederick W. Kent Collection of Photographs, 1866-2000|http://www.lib.uiowa.edu/collguides/?RG30.0001.01|Prints|Athletics; Men's athletics|Individuals|Individuals|Scanned with Ricoh Aficio 3228C @ 300 ppi. Master image saved in TIFF format.",28|22,,"Still image|Photographs|jpeg",RG30.0001.01|https://digital.lib.uiowa.edu/,,,,,,,,,,,,,,,,,,,,,,,,,,,,,,,,,,,,,,,,,,,,,,,,"<a href=""https://digital.lib.uiowa.edu/"" target=""_blank"">View this item in its source respository</a>",,,,,,,,,,,,,,,,,,,,,,,,,,,,,https://www.iowaheritage.org/files/original/7ed9e4270fe085b786894ccf790f9bda.jpg,"Remote Item","Iowa City Town and Campus Scenes",1,0
26374,https://www.iowaheritage.org/items/show/26374,"Iowa football end Jim Gibbons, The University of Iowa, 1955-1957","Universities & colleges|Gibbons, Jim|University of Iowa|United States -- Iowa -- Iowa City|1950-1960|Football players","On football team from 1955-1957.","Kent, Frederick W. (Frederick Wallace), 1894-1984",,"University of Iowa. Libraries. University Archives",1955/1957|2009-07,,"Educational use only, no other permissions given. U.S. and international copyright laws may protect this digital object. Commercial use or distribution of the object is not permitted without prior permission of the copyright holder.","Iowa City Town and Campus Scenes|Frederick W. Kent Collection of Photographs, 1866-2000|http://www.lib.uiowa.edu/collguides/?RG30.0001.01|Prints|Athletics; Men's athletics|Individuals|Individuals|Scanned with Ricoh Aficio 3228C @ 300 ppi. Master image saved in TIFF format",28|22,,"Still image|Photographs|jpeg",RG30.0001.01|https://digital.lib.uiowa.edu/,,,,,,,,,,,,,,,,,,,,,,,,,,,,,,,,,,,,,,,,,,,,,,,,"<a href=""https://digital.lib.uiowa.edu/"" target=""_blank"">View this item in its source respository</a>",,,,,,,,,,,,,,,,,,,,,,,,,,,,,https://www.iowaheritage.org/files/original/cb833ccbe4630554fb9c24e924c8c49a.jpg,"Remote Item","Iowa City Town and Campus Scenes",1,0
26376,https://www.iowaheritage.org/items/show/26376,"Iowa football running back Bob Jeter, The University of Iowa, 1957-1958","Universities & colleges|Jeter, Bob|University of Iowa|United States -- Iowa -- Iowa City|1950-1960|Football players","On football team from 1957-1959.","Kent, Frederick W. (Frederick Wallace), 1894-1984",,"University of Iowa. Libraries. University Archives",1957/1958|2009-07,,"Educational use only, no other permissions given. U.S. and international copyright laws may protect this digital object. Commercial use or distribution of the object is not permitted without prior permission of the copyright holder.","Iowa City Town and Campus Scenes|Frederick W. Kent Collection of Photographs, 1866-2000|http://www.lib.uiowa.edu/collguides/?RG30.0001.01|Prints|Athletics; Men's athletics|Individuals|Individuals|Scanned with Ricoh Aficio 3228C @ 300 ppi. Master image saved in TIFF format.",28|22,,"Still image|Photographs|jpeg",RG30.0001.01|https://digital.lib.uiowa.edu/,,,,,,,,,,,,,,,,,,,,,,,,,,,,,,,,,,,,,,,,,,,,,,,,"<a href=""https://digital.lib.uiowa.edu/"" target=""_blank"">View this item in its source respository</a>",,,,,,,,,,,,,,,,,,,,,,,,,,,,,https://www.iowaheritage.org/files/original/d97185e1f59d1c5c531049561898705a.jpg,"Remote Item","Iowa City Town and Campus Scenes",1,0
26378,https://www.iowaheritage.org/items/show/26378,"Iowa football tackle Alex Karras, The University of Iowa, 1956-1957","Universities & colleges|Karras, Alex|University of Iowa|United States -- Iowa -- Iowa City|1950-1960|Football players","On football team from 1956-1957.","Kent, Frederick W. (Frederick Wallace), 1894-1984",,"University of Iowa. Libraries. University Archives",1956/1957|2009-07,,"Educational use only, no other permissions given. U.S. and international copyright laws may protect this digital object. Commercial use or distribution of the object is not permitted without prior permission of the copyright holder.","Iowa City Town and Campus Scenes|Frederick W. Kent Collection of Photographs, 1866-2000;|http://www.lib.uiowa.edu/collguides/?RG30.0001.01|Prints|Athletics; Men's athletics|Individuals|Individuals|Scanned with Ricoh Aficio 3228C @ 300 ppi. Master image saved in TIFF format.",28|22,,"Still image|Photographs|jpeg",RG30.0001.01|https://digital.lib.uiowa.edu/,,,,,,,,,,,,,,,,,,,,,,,,,,,,,,,,,,,,,,,,,,,,,,,,"<a href=""https://digital.lib.uiowa.edu/"" target=""_blank"">View this item in its source respository</a>",,,,,,,,,,,,,,,,,,,,,,,,,,,,,https://www.iowaheritage.org/files/original/b0f1903be571d60c944cea3cf5d4e05a.jpg,"Remote Item","Iowa City Town and Campus Scenes",1,0
26380,https://www.iowaheritage.org/items/show/26380,"Iowa football offensive guard Calvin Jones and coach Forest Evashevski, The University of Iowa, 1955","Universities & colleges|Jones, Calvin|University of Iowa|United States -- Iowa -- Iowa City|1950-1960|Football players|Evashevski, Forest|Reichow, Garet Neal, 1934-|Vincent, Eddie|Hagler, Collins","On football team from 1953-1955.","Kent, Frederick W. (Frederick Wallace), 1894-1984",,"University of Iowa. Libraries. University Archives",1955|2009-07,,"Educational use only, no other permissions given. U.S. and international copyright laws may protect this digital object. Commercial use or distribution of the object is not permitted without prior permission of the copyright holder.","Iowa City Town and Campus Scenes|Frederick W. Kent Collection of Photographs, 1866-2000|http://www.lib.uiowa.edu/collguides/?RG30.0001.01|Prints|Athletics; Men's athletics|Individuals|Individuals|Scanned with Ricoh Aficio 3228C @ 300 ppi. Master image saved in TIFF format.",28|22,,"Still image|Photographs|jpeg",RG30.0001.01|https://digital.lib.uiowa.edu/,,,,,,,,,,,,,,,,,,,,,,,,,,,,,,,,,,,,,,,,,,,,,,,,"<a href=""https://digital.lib.uiowa.edu/"" target=""_blank"">View this item in its source respository</a>",,,,,,,,,,,,,,,,,,,,,,,,,,,,,https://www.iowaheritage.org/files/original/a9247421fb69f0857808ace79b089e3a.jpg,"Remote Item","Iowa City Town and Campus Scenes",1,0
26382,https://www.iowaheritage.org/items/show/26382,"Iowa football halfback Bill Happel, The University of Iowa, 1956","Universities & colleges|Happel, Bill|University of Iowa|United States -- Iowa -- Iowa City|1950-1960|Football players|Ploen, Ken|Nocera, John|Dobrino, Don","On football team from 1955-1957.","Kent, Frederick W. (Frederick Wallace), 1894-1984",,"University of Iowa. Libraries. University Archives",1956|2009-07,,"Educational use only, no other permissions given. U.S. and international copyright laws may protect this digital object. Commercial use or distribution of the object is not permitted without prior permission of the copyright holder.","Iowa City Town and Campus Scenes|Frederick W. Kent Collection of Photographs, 1866-2000|http://www.lib.uiowa.edu/collguides/?RG30.0001.01|Prints|Athletics; Men's athletics|Individuals|Individuals|Scanned with Ricoh Aficio 3228C @ 300 ppi. Master image saved in TIFF format.",28|22,,"Still image|Photographs|jpeg",RG30.0001.01|https://digital.lib.uiowa.edu/,,,,,,,,,,,,,,,,,,,,,,,,,,,,,,,,,,,,,,,,,,,,,,,,"<a href=""https://digital.lib.uiowa.edu/"" target=""_blank"">View this item in its source respository</a>",,,,,,,,,,,,,,,,,,,,,,,,,,,,,https://www.iowaheritage.org/files/original/8ad10400046378f3651e0ff53777ebec.jpg,"Remote Item","Iowa City Town and Campus Scenes",1,0
26387,https://www.iowaheritage.org/items/show/26387,"Iowa football quarterback Jerry Reichow, The University of Iowa, 1953-1955","Universities & colleges|Reichow, Garet Neal, 1934-|University of Iowa|United States -- Iowa -- Iowa City|1950-1960|Football players|Rigney, Frank","On football team from 1953-1955.","Kent, Frederick W. (Frederick Wallace), 1894-1984",,"University of Iowa. Libraries. University Archives",1953/1955|2009-07,,"Educational use only, no other permissions given. U.S. and international copyright laws may protect this digital object. Commercial use or distribution of the object is not permitted without prior permission of the copyright holder.","Iowa City Town and Campus Scenes|Frederick W. Kent Collection of Photographs, 1866-2000|http://www.lib.uiowa.edu/collguides/?RG30.0001.01|Prints|Athletics; Men's athletics|Individuals|Individuals|Scanned with Ricoh Aficio 3228C @ 300 ppi. Master image saved in TIFF format.",28|22,,"Still image|Photographs|jpeg",RG30.0001.01|https://digital.lib.uiowa.edu/,,,,,,,,,,,,,,,,,,,,,,,,,,,,,,,,,,,,,,,,,,,,,,,,"<a href=""https://digital.lib.uiowa.edu/"" target=""_blank"">View this item in its source respository</a>",,,,,,,,,,,,,,,,,,,,,,,,,,,,,https://www.iowaheritage.org/files/original/c5c3c012e1b8e9a44f8bf956994bc660.jpg,"Remote Item","Iowa City Town and Campus Scenes",1,0
26389,https://www.iowaheritage.org/items/show/26389,"Iowa football quarterback Ken Ploen, The University of Iowa, 1954-1956","Universities & colleges|Ploen, Ken|University of Iowa|United States -- Iowa -- Iowa City|1950-1960|Football players|Happel, Bill|Nocera, John|Dobrino, Don","Ploen was on football team between 1954-1956. He led the Hawkeyes in a 1957 Rose Bowl win and was voted the Rose Bowl's most valuable player.","Kent, Frederick W. (Frederick Wallace), 1894-1984",,"University of Iowa. Libraries. University Archives",1954/1965|2009-07,,"Educational use only, no other permissions given. U.S. and international copyright laws may protect this digital object. Commercial use or distribution of the object is not permitted without prior permission of the copyright holder.","Iowa City Town and Campus Scenes|Frederick W. Kent Collection of Photographs, 1866-2000|http://www.lib.uiowa.edu/collguides/?RG30.0001.01|Prints|Athletics; Men's athletics|Individuals|Individuals|Scanned with Ricoh Aficio 3228C @ 300 ppi. Master image saved in TIFF format.",28|22,,"Still image;|Photographs|jpeg",RG30.0001.01|https://digital.lib.uiowa.edu/,,,,,,,,,,,,,,,,,,,,,,,,,,,,,,,,,,,,,,,,,,,,,,,,"<a href=""https://digital.lib.uiowa.edu/"" target=""_blank"">View this item in its source respository</a>",,,,,,,,,,,,,,,,,,,,,,,,,,,,,https://www.iowaheritage.org/files/original/e35e52eefba9a03c28871e878ae99a69.jpg,"Remote Item","Iowa City Town and Campus Scenes",1,0
26391,https://www.iowaheritage.org/items/show/26391,"Iowa football punter, linebacker and fullback John Nocera, The University of Iowa, 1956-1957","Universities & colleges|Nocera, John|University of Iowa|United States -- Iowa -- Iowa City|1950-1960|Football players","On football team from 1956-1958.","Kent, Frederick W. (Frederick Wallace), 1894-1984",,,1956/1957|2009-07,,"Educational use only, no other permissions given. U.S. and international copyright laws may protect this digital object. Commercial use or distribution of the object is not permitted without prior permission of the copyright holder.","Iowa City Town and Campus Scenes|Frederick W. Kent Collection of Photographs, 1866-2000|http://www.lib.uiowa.edu/collguides/?RG30.0001.01|Prints|Athletics; Men's athletics|Individuals|Individuals|Scanned with Ricoh Aficio 3228C @ 300 ppi. Master image saved in TIFF format.",28|22,,"Still image|Photographs|jpeg",RG30.0001.01|https://digital.lib.uiowa.edu/,,,,,,,,,,,,,,,,,,,,,,,,,,,,,,,,,,,,,,,,,,,,,,,,"<a href=""https://digital.lib.uiowa.edu/"" target=""_blank"">View this item in its source respository</a>",,,,,,,,,,,,,,,,,,,,,,,,,,,,,https://www.iowaheritage.org/files/original/7a8eb52ad877ac0b26c55335c21d19da.jpg,"Remote Item","Iowa City Town and Campus Scenes",1,0
26393,https://www.iowaheritage.org/items/show/26393,"Iowa football center Warren ""Bud"" Lawson, The University of Iowa, 1950s","Universities & colleges|Lawson, Warren ""Bud""|University of Iowa|United States -- Iowa -- Iowa City|1950-1960|Football players","On football team from 1952-1954.","Kent, Frederick W. (Frederick Wallace), 1894-1984",,"University of Iowa. Libraries. University Archives",1950/1959|2009-07,,"Educational use only, no other permissions given. U.S. and international copyright laws may protect this digital object. Commercial use or distribution of the object is not permitted without prior permission of the copyright holder.","Iowa City Town and Campus Scenes|Frederick W. Kent Collection of Photographs, 1866-2000|http://www.lib.uiowa.edu/collguides/?RG30.0001.01|Prints|Athletics; Men's athletics|Individuals|Individuals|Scanned with Ricoh Aficio 3228C @ 300 ppi. Master image saved in TIFF format.",25|21,,"Still image|Photographs|jpeg",RG30.0001.01|https://digital.lib.uiowa.edu/,,,,,,,,,,,,,,,,,,,,,,,,,,,,,,,,,,,,,,,,,,,,,,,,"<a href=""https://digital.lib.uiowa.edu/"" target=""_blank"">View this item in its source respository</a>",,,,,,,,,,,,,,,,,,,,,,,,,,,,,https://www.iowaheritage.org/files/original/30af612830e01b64d206e17bf60882db.jpg,"Remote Item","Iowa City Town and Campus Scenes",1,0
