 




﻿"Item Id","Item URI","Dublin Core:Title","Dublin Core:Subject","Dublin Core:Description","Dublin Core:Creator","Dublin Core:Source","Dublin Core:Publisher","Dublin Core:Date","Dublin Core:Contributor","Dublin Core:Rights","Dublin Core:Relation","Dublin Core:Format","Dublin Core:Language","Dublin Core:Type","Dublin Core:Identifier","Dublin Core:Coverage","Item Type Metadata:Text","Item Type Metadata:Interviewer","Item Type Metadata:Interviewee","Item Type Metadata:Location","Item Type Metadata:Transcription","Item Type Metadata:Local URL","Item Type Metadata:Original Format","Item Type Metadata:Physical Dimensions","Item Type Metadata:Duration","Item Type Metadata:Compression","Item Type Metadata:Producer","Item Type Metadata:Director","Item Type Metadata:Bit Rate/Frequency","Item Type Metadata:Time Summary","Item Type Metadata:Email Body","Item Type Metadata:Subject Line","Item Type Metadata:From","Item Type Metadata:To","Item Type Metadata:CC","Item Type Metadata:BCC","Item Type Metadata:Number of Attachments","Item Type Metadata:Standards","Item Type Metadata:Objectives","Item Type Metadata:Materials","Item Type Metadata:Lesson Plan Text","Item Type Metadata:URL","Item Type Metadata:Event Type","Item Type Metadata:Participants","Item Type Metadata:Birth Date","Item Type Metadata:Birthplace","Item Type Metadata:Death Date","Item Type Metadata:Occupation","Item Type Metadata:Biographical Text","Item Type Metadata:Bibliography","Item Type Metadata:Digital Reproduction Information","Item Type Metadata:Repository","Item Type Metadata:Repository Collection","Item Type Metadata:Contact information.","Item Type Metadata:File Name","Item Type Metadata:Notes","Item Type Metadata:Digital item created","Item Type Metadata:Digital item modified","Item Type Metadata:Executive Orders","Item Type Metadata:Record Created","Item Type Metadata:Record Modified","Item Type Metadata:Transcription2","Item Type Metadata:Source URL","Omeka Legacy File:Additional Creator","Omeka Legacy File:Transcriber","Omeka Legacy File:Producer","Omeka Legacy File:Render Device","Omeka Legacy File:Render Details","Omeka Legacy File:Capture Date","Omeka Legacy File:Capture Device","Omeka Legacy File:Capture Details","Omeka Legacy File:Change History","Omeka Legacy File:Watermark","Omeka Legacy File:Encryption","Omeka Legacy File:Compression","Omeka Legacy File:Post Processing","Omeka Image File:Width","Omeka Image File:Height","Omeka Image File:Bit Depth","Omeka Image File:Channels","Omeka Image File:Exif String","Omeka Image File:Exif Array","Omeka Image File:IPTC String","Omeka Image File:IPTC Array","Omeka Video File:Bitrate","Omeka Video File:Duration","Omeka Video File:Sample Rate","Omeka Video File:Codec","Omeka Video File:Width","Omeka Video File:Height",tags,file,itemType,collection,public,featured
16626,https://www.iowaheritage.org/items/show/16626,Esse|Existence,1960-1970,,"Drewelowe, Eve, 1899-1988",,"University of Iowa. School of Art and Art History",1966|2009-09,,"Educational use only, no other permissions given. U.S. and international copyright laws may protect this item. Commercial use or distribution of this digital object is not permitted without written permission of the School of Art and Art History, University of Iowa; please contact the Iowa Women's Archives for more information.","Eve Drewelowe Digital Collection","78|46|jpeg|Mixed media",,"Still image|Paintings (Visual works)",25.60C.jpg|https://digital.lib.uiowa.edu/,,,,,,,,,,,,,,,,,,,,,,,,,,,,,,,,,,,,,,,,,,,,,,,,"<a href=""https://digital.lib.uiowa.edu/"" target=""_blank"">View this item in its source respository</a>",,,,,,,,,,,,,,,,,,,,,,,,,,,,,https://www.iowaheritage.org/files/original/944bbb4068b5b9673e09876787df7715.jpg,"Remote Item","Eve Drewelowe Digital Collection",1,0
14813,https://www.iowaheritage.org/items/show/14813,"Essex, Iowa. CBQ","Railroad stations|Chicago, Burlington & Quincy Railroad Company|United States -- Iowa -- Page County -- Essex|1960-1970|Buildings|Automobiles","Single story wooden depot with automobile and sign for Essex.",unknown,,"University of Iowa. Libraries. Special Collections Dept.",1966-09-22|2006-05-12,,"Educational use only, no other permissions given. U.S. and international copyright laws may protect this digital image. Commercial use or distribution of the image is not permitted without prior permission of the copyright holder. For information see:  http://www.lib.uiowa.edu/spec-coll/help/copyright.html","John P. Vander Maas Railroadiana|John P. Vander Maas Railroadiana Collection|MSC0468|http://lib.uiowa.edu/collguides/?MSC0468|Vol. 45, Depots by county",8|12,,"Still image|Photographs|jpeg",45essex01.jpg|169946290|https://digital.lib.uiowa.edu/,,,,,,,,,,,,,,,,,,,,,,,,,,,,,,,,,,,,,,,,,,,,,,,,"<a href=""https://digital.lib.uiowa.edu/"" target=""_blank"">View this item in its source respository</a>",,,,,,,,,,,,,,,,,,,,,,,,,,,,,https://www.iowaheritage.org/files/original/4c9e32767efc247a6d17ea5135c49828.jpg,"Remote Item","John P. Vander Maas Railroadiana",1,0
9965,https://www.iowaheritage.org/items/show/9965,"Esther Walls second letter to Alden Clark of Franklin Book, April 25, 1967","Publishers|African Americans|Walls, Esther J., 1926-|Franklin Book Programs, inc.|Uganda -- Kampala|1960-1970|Publishing industry|Business enterprises|Travel|Clark, Alden|United States -- New York -- New York",,"Walls, Esther J., 1926-",,"University of Iowa. Libraries. Iowa Women's Archives",1967-04-25|2007-09-12,,"Educational use only, no other permissions given. U.S. and international copyright laws may protect this item. Commercial use or distribution of this digital object is not permitted without written permission of the Iowa Women's Archives.","African American Women in Iowa Digital Collection|Esther J. Walls papers, 1860s-1996|http://www.lib.uiowa.edu/collguides/?IWA0288|Correspondence: Franklin Book Programs, Trip 3, April-May 1967|http://www.lib.uiowa.edu/iwa/Topical_holdings_lists/AAhold.html",jpeg,,Text|Correspondence,IWA0288|walls00277|166295411|https://digital.lib.uiowa.edu/,,,,,,,,,,,,,,,,,,,,,,,,,,,,,,,,,,,,,,,,,,,,,,,,"<a href=""https://digital.lib.uiowa.edu/"" target=""_blank"">View this item in its source respository</a>",,,,,,,,,,,,,,,,,,,,,,,,,,,,,https://www.iowaheritage.org/files/original/86171b4a6606e0b97fe6c06e70417bca.jpg,"Remote Item","African American Women in Iowa Collection",1,0
9958,https://www.iowaheritage.org/items/show/9958,"Esther Walls' correspondence on trips on behalf of Franklin Books, 1968","Books|African Americans|Walls, Esther J., 1926-|Franklin Book Programs, inc.|Nigeria|1960-1970|Travel|Publishers|Publishing industry|Libraries|Librarians|Education|Iroaganachi, John|Bowen, Carroll G.|Poinsett, Norman|United States -- New York -- New York","Contents: Dear Franklinites, May 25,1968; From Curly regarding E. Walls' school library project for Country X, Jun. 12,1970; Letter to Norman from John Iroaganachi, Oct. 9, 1970; Reading file (routing slip); Harold's draft and telegram to E. Walls, May 17, 1968","Walls, Esther J., 1926-",,"University of Iowa. Iowa Women's Archives","1968; 1970|2007-09-12",,"Educational use only, no other permissions given. U.S. and international copyright laws may protect this item. Commercial use or distribution of this digital object is not permitted without written permission of the Iowa Women's Archives.","African American Women in Iowa Digital Collection|http://digital.lib.uiowa.edu/aaws/|Esther J. Walls papers, 1860s-1996|http://www.lib.uiowa.edu/collguides/?IWA0288|Correspondence: Franklin Book Programs, Trips 4, 6, and 8, May 1968-1970|http://www.lib.uiowa.edu/iwa/Topical_holdings_lists/AAhold.html",jpeg,,"Text|Correspondence; Telegrams","IWA0288|Correspondence - Franklin Trip 4,6,8|166295411|https://digital.lib.uiowa.edu/",,,,,,,,,,,,,,,,,,,,,,,,,,,,,,,,,,,,,,,,,,,,,,,,"<a href=""https://digital.lib.uiowa.edu/"" target=""_blank"">View this item in its source respository</a>",,,,,,,,,,,,,,,,,,,,,,,,,,,,,https://www.iowaheritage.org/files/original/50fd27c822f323aeebb4aa51cd845d58.jpg,"Remote Item","African American Women in Iowa Collection",1,0
9953,https://www.iowaheritage.org/items/show/9953,"Esther Walls' correspondence on trips to West Africa on behalf of Franklin Books, 1965-1966","Travel|African Americans|Walls, Esther J., 1926-|Franklin Book Programs, inc.|Senegal|1960-1970|Publishing industry|Publishers|Books|Activists|Women|Clark, Alden|Committee of Correspondence (New York, N.Y. : 1952-1969)|Guinea|Mali|Cote d'Ivoire","Contents: E. Walls' report of trip to West Africa, Jun.-Jul. 1965; Jan. 16, 1966 letter 1 to Franklin Book; Trip 1 itinerary, Jan.-Feb. 1966","Walls, Esther J., 1926-",,"University of Iowa. Iowa Women's Archives",1965/1966|2007-09-12,,"Educational use only, no other permissions given. U.S. and international copyright laws may protect this item. Commercial use or distribution of this digital object is not permitted without written permission of the Iowa Women's Archives.","African American Women in Iowa Digital Collection|http://digital.lib.uiowa.edu/aaws/|Esther J. Walls papers, 1860s-1996|http://www.lib.uiowa.edu/collguides/?IWA0288|Correspondence: Franklin Book Programs, Trip 1, December 1965-August 1966|http://www.lib.uiowa.edu/iwa/Topical_holdings_lists/AAhold.html",jpeg,,"Text|Itineraries; Correspondence","IWA0288|Correspondence - Franklin Trip 1|166295411|https://digital.lib.uiowa.edu/",,,,,,,,,,,,,,,,,,,,,,,,,,,,,,,,,,,,,,,,,,,,,,,,"<a href=""https://digital.lib.uiowa.edu/"" target=""_blank"">View this item in its source respository</a>",,,,,,,,,,,,,,,,,,,,,,,,,,,,,https://www.iowaheritage.org/files/original/fb2109e16179244300b779f053bfe2e1.jpg,"Remote Item","African American Women in Iowa Collection",1,0
9954,https://www.iowaheritage.org/items/show/9954,"Esther Walls' correspondence on trips to West Africa on behalf of Franklin Books, 1966","Books|African Americans|Walls, Esther J., 1926-|Franklin Book Programs, inc.|Nigeria -- Lagos|1960-1970|Publishers|Publishing industry|Travel|Apaloo, M. K.|Clark, Alden|Ghana -- Accra|Kenya -- Nairobi|Egypt -- Cairo|Tanzania -- Dar es Salaam|Nigeria|Iran -- Tehran","Contents: Aug. 29, 1966 telegram to Franklin Book; Aug. 30, 1966 telegram to Franklin Book; Thank you letter to M.K. Apaloo, Aug .27, 1966; Trip 2 itinerary, Aug.-Sept. 1966; Daily appointments schedules trip 2","Walls, Esther J., 1926-",,"University of Iowa. Iowa Women's Archives",1966|2007-09-12,,"Educational use only, no other permissions given. U.S. and international copyright laws may protect this item. Commercial use or distribution of this digital object is not permitted without written permission of the Iowa Women's Archives.","African American Women in Iowa Digital Collection|http://digital.lib.uiowa.edu/aaws/|Esther J. Walls papers, 1860s-1996|http://www.lib.uiowa.edu/collguides/?IWA0288|Correspondence: Franklin Book Programs, Trip 2, August 1966|http://www.lib.uiowa.edu/iwa/Topical_holdings_lists/AAhold.html",jpeg,,"Text|Correspondence; Itineraries; Telegrams","IWA0288|Correspondence - Franklin Trip 2|166295411|https://digital.lib.uiowa.edu/",,,,,,,,,,,,,,,,,,,,,,,,,,,,,,,,,,,,,,,,,,,,,,,,"<a href=""https://digital.lib.uiowa.edu/"" target=""_blank"">View this item in its source respository</a>",,,,,,,,,,,,,,,,,,,,,,,,,,,,,https://www.iowaheritage.org/files/original/b74d42ee1fc903f79c7e1e584d829beb.jpg,"Remote Item","African American Women in Iowa Collection",1,0
9962,https://www.iowaheritage.org/items/show/9962,"Esther Walls' correspondence with  prominent figures, 1955-1991","Activists|African Americans|Walls, Esther J., 1926-|Library Journal (Firm)|United States -- New York -- New York|1960-1970|Autographs|Celebrities|Actors|Authors|Books|Travel|Women|Welk, Lawrence, 1903-1992|Miller, Mike|Ives, Burl, 1909-1995|Erlich, Lillian|Hamilton, Antonia|Downs, Hugh|Jeffries, Susan|Lawrence Welk show (Television program)|ABC News|North Dakota State University|University of Iowa Foundation|United States -- Iowa -- Iowa City|United States -- North Dakota -- Fargo|United States -- California -- Santa Monica|1970-1980|1980-1990|1990-2000",,"Walls, Esther J., 1926-",,"University of Iowa. Iowa Women's Archives",1955/1991|2007-09-12,,"Educational use only, no other permissions given. U.S. and international copyright laws may protect this item. Commercial use or distribution of this digital object is not permitted without written permission of the Iowa Women's Archives.","African American Women in Iowa Digital Collection|http://digital.lib.uiowa.edu/aaws/|Esther J. Walls papers, 1860s-1996|http://www.lib.uiowa.edu/collguides/?IWA0288|Correspondence: Prominent figures, 1955-1991|http://www.lib.uiowa.edu/iwa/Topical_holdings_lists/AAhold.html",jpeg,,"Text|Correspondence; Greeting cards; Collages (Visual works)","IWA0288|Correspondence - Prominent Figures 1955-1991|166295411|https://digital.lib.uiowa.edu/",,,,,,,,,,,,,,,,,,,,,,,,,,,,,,,,,,,,,,,,,,,,,,,,"<a href=""https://digital.lib.uiowa.edu/"" target=""_blank"">View this item in its source respository</a>",,,,,,,,,,,,,,,,,,,,,,,,,,,,,https://www.iowaheritage.org/files/original/e33141cb916300044a66644f2a62b9a2.jpg,"Remote Item","African American Women in Iowa Collection",1,0
9952,https://www.iowaheritage.org/items/show/9952,"Esther Walls' correspondence with National Book Committee and report on trip to Africa, 1965-1972","Travel|African Americans|Walls, Esther J., 1926-|Columbia University. School of Library Service|United States -- New York -- New York|1960-1970|Women|Librarians|Libraries|Graduate students|Braverman, Miriam|National Book Committee|Committee of Correspondence (New York, N.Y. : 1952-1969)|Senegal|Guinea|Mali|Cote d'Ivoire|1970-1980","Contents: Cover letter to Esther Walls from Miriam Braverman Sept. 12, 1972; Letter to Miriam Braverman Sept. 19, 1972; Report of West Africa trip, June-July 1965","Walls, Esther J., 1926-",,"University of Iowa. Iowa Women's Archives",1965/1972|2007-09-12,,"Educational use only, no other permissions given. U.S. and international copyright laws may protect this item. Commercial use or distribution of this digital object is not permitted without written permission of the Iowa Women's Archives.","African American Women in Iowa Digital Collection|http://digital.lib.uiowa.edu/aaws/|Esther J. Walls papers, 1860s-1996|http://www.lib.uiowa.edu/collguides/?IWA0288|Biographical material: Interviews, Transcript of dissertation research interview with Esther J. Walls conducted by Miriam Braverman|http://www.lib.uiowa.edu/iwa/Topical_holdings_lists/AAhold.html",jpeg,,Text|Correspondence,"IWA0288|Biography - Interviews and Transcripts|166295411|https://digital.lib.uiowa.edu/",,,,,,,,,,,,,,,,,,,,,,,,,,,,,,,,,,,,,,,,,,,,,,,,"<a href=""https://digital.lib.uiowa.edu/"" target=""_blank"">View this item in its source respository</a>",,,,,,,,,,,,,,,,,,,,,,,,,,,,,https://www.iowaheritage.org/files/original/c555bb06d9ab6354800bc88c139099e3.jpg,"Remote Item","African American Women in Iowa Collection",1,0
9964,https://www.iowaheritage.org/items/show/9964,"Esther Walls' general correspondence, 1960-1969","Librarians|African Americans|Eaton, C. P.|New York Public Library|United States -- Iowa -- Mason City|1960-1970|Libraries|Publishers|Forums (Discussion & debate)|Women|Walls, Esther J., 1926-|Peterson, Carl H.|Williams, G. Mennen, 1911-|Morrow, Charles E.|Hatch, Lucile|Studer, Norman|Martin, Edward F.|Freehafer, Edward Geier, 1909-1985|Smith, Datus Clifford, 1907-|Thomas, Evan|Godfrey, Jean|Nugent, Grace|Losinski, Julia|White, E. Leonore|Bazzle, Lillie May|Henry, Marie C.|Dittman, Marion|Geller, Evelyn|Spiegel, Robert H.|United States. Dept. of State. Bureau of African Affairs|University of Denver. Graduate School of Librarianship|Franklin Book Programs, inc.|New York Public Library. Countee Cullen Branch|Harper & Row, Publishers|YMCA of Greater New York|Schenectady County Public Library (Schenectady, N.Y.)|African-American Institute|American Library Association|Library Journal (Firm)|United States -- New York -- New York","Contents: C.P. Eaton's congratulations, May 2, 1963; Carl H. Peterson (Dept. of State) letter to Esther Walls, Dec. 4, 1963; Charles E. Morrow's request for information, Nov. 8, 1962; Congratulations on pamphlet from Lucile Hatch (University of Denver), Feb. 10, 1964; Congratulations! You're really in the spotlight now; Downtown Community School thank you, Feb. 20, 1961; Edward F. Martin (Dept. of State) letter to Esther Walls, Aug. 3, 1962; Edward Freehafer to Datus Smith praising Esther Walls, Oct. 28, 1965; Evan Thomas query letter for article for Harper's Magazine, May 18, 1965; Goodbye and thank you letter from Jean Godfrey (NYPL), Oct. 14, 1965; Grace Nugent's thank you letter, Nov. 2, 1960; Julia Losinski's thank you letter, Apr. 24, 1961; Leonard White's thank you letter, Oct. 26, 1960; Lillie May Bazzle's thank you letter, Feb. 23, 1960; Marie C. Henry (Books for Africa) thank you, Dec. 31, 1963; Marion Dittman's thank you letter, Nov. 6, 1963; NY distances for Charles E. Morr","Walls, Esther J., 1926-",,"University of Iowa. Iowa Women's Archives","1960; 1961; 1962; 1963; 1964; 1965; 1969|2007-09-12",,"Educational use only, no other permissions given. U.S. and international copyright laws may protect this item. Commercial use or distribution of this digital object is not permitted without written permission of the Iowa Women's Archives.","African American Women in Iowa Digital Collection|http://digital.lib.uiowa.edu/aaws/|Esther J. Walls papers, 1860s-1996|http://www.lib.uiowa.edu/collguides/?IWA0288|Correspondence: General, 1960-1969|http://www.lib.uiowa.edu/iwa/Topical_holdings_lists/AAhold.html",jpeg,,"Text; Still image|Correspondence; Collages (Visual works); Poems; Greeting cards","IWA0288|Correspondence - General 1960-1969|166295411|https://digital.lib.uiowa.edu/",,,,,,,,,,,,,,,,,,,,,,,,,,,,,,,,,,,,,,,,,,,,,,,,"<a href=""https://digital.lib.uiowa.edu/"" target=""_blank"">View this item in its source respository</a>",,,,,,,,,,,,,,,,,,,,,,,,,,,,,https://www.iowaheritage.org/files/original/87f91cf0dc1cfb3a0de3f811a923a933.jpg,"Remote Item","African American Women in Iowa Collection",1,0
9966,https://www.iowaheritage.org/items/show/9966,"Esther Walls' letter to Alden Clark of Franklin Book, April 25, 1967","Publishers|African Americans|Walls, Esther J., 1926-|Franklin Book Programs, inc.|Uganda -- Kampala|1960-1970|Publishing industry|Business enterprises|Travel|Clark, Alden|United States -- New York -- New York",,"Walls, Esther J., 1926-",,"University of Iowa. Libraries. Iowa Women's Archives",1967-04-25|2007-09-12,,"Educational use only, no other permissions given. U.S. and international copyright laws may protect this item. Commercial use or distribution of this digital object is not permitted without written permission of the Iowa Women's Archives.","African American Women in Iowa Digital Collection|Esther J. Walls papers, 1860s-1996|http://www.lib.uiowa.edu/collguides/?IWA0288|Correspondence: Franklin Book Programs, Trip 3, April-May 1967|http://www.lib.uiowa.edu/iwa/Topical_holdings_lists/AAhold.html",jpeg,,Text|Correspondence,IWA0288|walls00274|166295411|https://digital.lib.uiowa.edu/,,,,,,,,,,,,,,,,,,,,,,,,,,,,,,,,,,,,,,,,,,,,,,,,"<a href=""https://digital.lib.uiowa.edu/"" target=""_blank"">View this item in its source respository</a>",,,,,,,,,,,,,,,,,,,,,,,,,,,,,https://www.iowaheritage.org/files/original/0fffec664028f79afad7362ee7f30d4c.jpg,"Remote Item","African American Women in Iowa Collection",1,0
