 




﻿"Item Id","Item URI","Dublin Core:Title","Dublin Core:Subject","Dublin Core:Description","Dublin Core:Creator","Dublin Core:Source","Dublin Core:Publisher","Dublin Core:Date","Dublin Core:Contributor","Dublin Core:Rights","Dublin Core:Relation","Dublin Core:Format","Dublin Core:Language","Dublin Core:Type","Dublin Core:Identifier","Dublin Core:Coverage","Item Type Metadata:Text","Item Type Metadata:Interviewer","Item Type Metadata:Interviewee","Item Type Metadata:Location","Item Type Metadata:Transcription","Item Type Metadata:Local URL","Item Type Metadata:Original Format","Item Type Metadata:Physical Dimensions","Item Type Metadata:Duration","Item Type Metadata:Compression","Item Type Metadata:Producer","Item Type Metadata:Director","Item Type Metadata:Bit Rate/Frequency","Item Type Metadata:Time Summary","Item Type Metadata:Email Body","Item Type Metadata:Subject Line","Item Type Metadata:From","Item Type Metadata:To","Item Type Metadata:CC","Item Type Metadata:BCC","Item Type Metadata:Number of Attachments","Item Type Metadata:Standards","Item Type Metadata:Objectives","Item Type Metadata:Materials","Item Type Metadata:Lesson Plan Text","Item Type Metadata:URL","Item Type Metadata:Event Type","Item Type Metadata:Participants","Item Type Metadata:Birth Date","Item Type Metadata:Birthplace","Item Type Metadata:Death Date","Item Type Metadata:Occupation","Item Type Metadata:Biographical Text","Item Type Metadata:Bibliography","Item Type Metadata:Digital Reproduction Information","Item Type Metadata:Repository","Item Type Metadata:Repository Collection","Item Type Metadata:Contact information.","Item Type Metadata:File Name","Item Type Metadata:Notes","Item Type Metadata:Digital item created","Item Type Metadata:Digital item modified","Item Type Metadata:Executive Orders","Item Type Metadata:Record Created","Item Type Metadata:Record Modified","Item Type Metadata:Transcription2","Item Type Metadata:Source URL","Omeka Legacy File:Additional Creator","Omeka Legacy File:Transcriber","Omeka Legacy File:Producer","Omeka Legacy File:Render Device","Omeka Legacy File:Render Details","Omeka Legacy File:Capture Date","Omeka Legacy File:Capture Device","Omeka Legacy File:Capture Details","Omeka Legacy File:Change History","Omeka Legacy File:Watermark","Omeka Legacy File:Encryption","Omeka Legacy File:Compression","Omeka Legacy File:Post Processing","Omeka Image File:Width","Omeka Image File:Height","Omeka Image File:Bit Depth","Omeka Image File:Channels","Omeka Image File:Exif String","Omeka Image File:Exif Array","Omeka Image File:IPTC String","Omeka Image File:IPTC Array","Omeka Video File:Bitrate","Omeka Video File:Duration","Omeka Video File:Sample Rate","Omeka Video File:Codec","Omeka Video File:Width","Omeka Video File:Height",tags,file,itemType,collection,public,featured
64204,https://www.iowaheritage.org/items/show/64204,"One nation, indivisible","Nationalism|United States|Flags|2000-2010|Ethnic origins|Racism|Racial discrimination|Race relations|Racial prejudice|Unity|Flagpoles","Native Americans; Europeans; Middle Easterners; Asian Americans; African Americans; Latin Americans; Eurasian; South Asians","Duffy, Brian, 1955-",,"University of Iowa. Libraries. Special Collections Dept.",2001-09-23|2011-04,,"Educational use only, no other permissions given. Copyright to this digital object is owned by The Des Moines Register; it may not be downloaded, reproduced, or distributed without written permission. For more information, contact the Special Collections Department.","Editorial Cartoons of Brian Duffy; Des Moines Register Cartoonists|Papers of Brian Duffy|Des Moines Register",,English,"Still image|Editorial cartoons",MSC916|duffy-010923|http://digital.lib.uiowa.edu/cdm/ref/collection/duffy/id/42,,,,,,,,,,,,,,,,,,,,,,,,,,,,,,,,,,,,,,,,,,,,,,,,"<a href=""http://digital.lib.uiowa.edu/cdm/ref/collection/duffy/id/42"" target=""_blank"">View this item in its source respository</a>",,,,,,,,,,,,,,,,,,,,,,,,,,,,,https://www.iowaheritage.org/files/original/c95e12942253e2f711e8b436dd70b66b.jpg,"Remote Item","Editorial Cartoons of Brian Duffy",1,0
64325,https://www.iowaheritage.org/items/show/64325,"One of the ""happy"" Agriprocessor employees that now makes $10.00 an hour*","Food industry and trade|Postville (Iowa)|Men|2000-2010|Employment|Immigrants|Immigration|Meat industry and trade|Emigration & immigration|Law enforcement|Food industry|Workers|Goggles|Hats|Smiley faces|Safety equipment","*minus the cost of the safety clothing; The ""loan"" he doesn't remember getting; The rent for the company-owned apartment that he shares with 30 other people; The $4.00 for the smiley face button","Duffy, Brian, 1955-",,"University of Iowa. Libraries. Special Collections Dept.",2008-08-26|2011-04,,"Educational use only, no other permissions given. Copyright to this digital object is owned by The Des Moines Register; it may not be downloaded, reproduced, or distributed without written permission. For more information, contact the Special Collections Department.","Editorial Cartoons of Brian Duffy; Des Moines Register Cartoonists|Papers of Brian Duffy|Des Moines Register",,English,"Still image|Editorial cartoons",MSC916|duffy-080826|http://digital.lib.uiowa.edu/cdm/ref/collection/duffy/id/163,,,,,,,,,,,,,,,,,,,,,,,,,,,,,,,,,,,,,,,,,,,,,,,,"<a href=""http://digital.lib.uiowa.edu/cdm/ref/collection/duffy/id/163"" target=""_blank"">View this item in its source respository</a>",,,,,,,,,,,,,,,,,,,,,,,,,,,,,https://www.iowaheritage.org/files/original/7a85604e226da633fb6f68eeabdc6c61.jpg,"Remote Item","Editorial Cartoons of Brian Duffy",1,0
64370,https://www.iowaheritage.org/items/show/64370,OPEC,"Oil|Middle East|Men|1980-1990|Oil -- Prices|Oil industry|Demand|Supply|Supply and demand|Arabs|Oil storage tanks|Balls|Targets|Ladders","Demand; Prices;","Duffy, Brian, 1955-",,"University of Iowa. Libraries. Special Collections Dept.",1986-01|2011-04,,"Educational use only, no other permissions given. Copyright to this digital object is owned by The Des Moines Register; it may not be downloaded, reproduced, or distributed without written permission. For more information, contact the Special Collections Department.","Editorial Cartoons of Brian Duffy; Des Moines Register Cartoonists|Papers of Brian Duffy|Des Moines Register",,English,"Still image|Editorial cartoons","MSC916|duffy-8601xx-undated 2|http://digital.lib.uiowa.edu/cdm/ref/collection/duffy/id/208",,,,,,,,,,,,,,,,,,,,,,,,,,,,,,,,,,,,,,,,,,,,,,,,"<a href=""http://digital.lib.uiowa.edu/cdm/ref/collection/duffy/id/208"" target=""_blank"">View this item in its source respository</a>",,,,,,,,,,,,,,,,,,,,,,,,,,,,,https://www.iowaheritage.org/files/original/890a05c96e93f6c6e48c5ff7bb83b4ce.jpg,"Remote Item","Editorial Cartoons of Brian Duffy",1,0
64372,https://www.iowaheritage.org/items/show/64372,Orioles,"Baseball|Brown, Charlie (Fictitious character)|United States|Baseball gloves|1980-1990|Losers|Losses|Baltimore (Md.)|Baseball players|Baseballs|Boys|Hats|Birds",,"Duffy, Brian, 1955-",,"University of Iowa. Libraries. Special Collections Dept.",1988-05-01|2011-04,,"Educational use only, no other permissions given. Copyright to this digital object is owned by The Des Moines Register; it may not be downloaded, reproduced, or distributed without written permission. For more information, contact the Special Collections Department.","Editorial Cartoons of Brian Duffy; Des Moines Register Cartoonists|Papers of Brian Duffy|Des Moines Register",,English,"Still image|Editorial cartoons",MSC916|duffy-880501|http://digital.lib.uiowa.edu/cdm/ref/collection/duffy/id/210,,,,,,,,,,,,,,,,,,,,,,,,,,,,,,,,,,,,,,,,,,,,,,,,"<a href=""http://digital.lib.uiowa.edu/cdm/ref/collection/duffy/id/210"" target=""_blank"">View this item in its source respository</a>",,,,,,,,,,,,,,,,,,,,,,,,,,,,,https://www.iowaheritage.org/files/original/760e8bfe1586629c3534d4cf5ae63c6e.jpg,"Remote Item","Editorial Cartoons of Brian Duffy",1,0
64394,https://www.iowaheritage.org/items/show/64394,Orioles,"Presidents|Bush, George, 1924-|United States|Presidents|1980-1990|Baseball|Losers|Losses|Baseball gloves|Baseball players|Baseballs|Pitchers|Hats",,"Duffy, Brian, 1955-",,"University of Iowa. Libraries. Special Collections Dept.",1988-05|2011-04,,"Educational use only, no other permissions given. Copyright to this digital object is owned by The Des Moines Register; it may not be downloaded, reproduced, or distributed without written permission. For more information, contact the Special Collections Department.","Editorial Cartoons of Brian Duffy; Des Moines Register Cartoonists|Papers of Brian Duffy|Des Moines Register",,English,"Still image|Editorial cartoons","MSC916|duffy-8805xx-undated 6|http://digital.lib.uiowa.edu/cdm/ref/collection/duffy/id/232",,,,,,,,,,,,,,,,,,,,,,,,,,,,,,,,,,,,,,,,,,,,,,,,"<a href=""http://digital.lib.uiowa.edu/cdm/ref/collection/duffy/id/232"" target=""_blank"">View this item in its source respository</a>",,,,,,,,,,,,,,,,,,,,,,,,,,,,,https://www.iowaheritage.org/files/original/b6a8d1e6163869cd1a1a4ef715807cb7.jpg,"Remote Item","Editorial Cartoons of Brian Duffy",1,0
64228,https://www.iowaheritage.org/items/show/64228,"Osama bin Laden ridng bomb out of cave","Terrorism|Bin Laden, Osama, 1957-2011|Afghanistan|Caves|2000-2010|War|Assassinations|Bombs|Terrorists|Mountains",,"Duffy, Brian, 1955-",,"University of Iowa. Libraries. Special Collections Dept.",2001-10-12|2011-04,,"Educational use only, no other permissions given. Copyright to this digital object is owned by The Des Moines Register; it may not be downloaded, reproduced, or distributed without written permission. For more information, contact the Special Collections Department.","Editorial Cartoons of Brian Duffy; Des Moines Register Cartoonists|Papers of Brian Duffy|Des Moines Register",,English,"Still image|Editorial cartoons","MSC916|duffy-011012 (2)|http://digital.lib.uiowa.edu/cdm/ref/collection/duffy/id/66",,,,,,,,,,,,,,,,,,,,,,,,,,,,,,,,,,,,,,,,,,,,,,,,"<a href=""http://digital.lib.uiowa.edu/cdm/ref/collection/duffy/id/66"" target=""_blank"">View this item in its source respository</a>",,,,,,,,,,,,,,,,,,,,,,,,,,,,,https://www.iowaheritage.org/files/original/495fbd660257b348335d4ae966e003e9.jpg,"Remote Item","Editorial Cartoons of Brian Duffy",1,0
64243,https://www.iowaheritage.org/items/show/64243,"Ouch! That looks painful","Budgets|United States|Uncle Sam--overweight|2000-2010|Budgets -- United States|Government|Government spending|Government spending policy|Men|Belts|Fat people",Budget,"Duffy, Brian, 1955-",,"University of Iowa. Libraries. Special Collections Dept.",2003-03-06|2011-04,,"Educational use only, no other permissions given. Copyright to this digital object is owned by The Des Moines Register; it may not be downloaded, reproduced, or distributed without written permission. For more information, contact the Special Collections Department.","Editorial Cartoons of Brian Duffy; Des Moines Register Cartoonists|Papers of Brian Duffy|Des Moines Register",,English,"Still image|Editorial cartoons","MSC916|duffy-030306 (2)|http://digital.lib.uiowa.edu/cdm/ref/collection/duffy/id/81",,,,,,,,,,,,,,,,,,,,,,,,,,,,,,,,,,,,,,,,,,,,,,,,"<a href=""http://digital.lib.uiowa.edu/cdm/ref/collection/duffy/id/81"" target=""_blank"">View this item in its source respository</a>",,,,,,,,,,,,,,,,,,,,,,,,,,,,,https://www.iowaheritage.org/files/original/0db274bc79e6c915ef94c522b09bc450.jpg,"Remote Item","Editorial Cartoons of Brian Duffy",1,0
64556,https://www.iowaheritage.org/items/show/64556,"Our motto: as solid as the ground it's built on","Farms|United States|Buildings|1980-1990|Farmland|Farm support|Farm aid|Banks|Banking|Eyes|Hands|Gargoyles|Ruins|Doors","Federal Land Bank; Farmland values","Duffy, Brian, 1955-",,"University of Iowa. Libraries. Special Collections Dept.",1985-07-31|2011-04,,"Educational use only, no other permissions given. Copyright to this digital object is owned by The Des Moines Register; it may not be downloaded, reproduced, or distributed without written permission. For more information, contact the Special Collections Department.","Editorial Cartoons of Brian Duffy; Des Moines Register Cartoonists|Papers of Brian Duffy|Des Moines Register",,English,"Still image|Editorial cartoons",MSC916|duffy-850731|http://digital.lib.uiowa.edu/cdm/ref/collection/duffy/id/394,,,,,,,,,,,,,,,,,,,,,,,,,,,,,,,,,,,,,,,,,,,,,,,,"<a href=""http://digital.lib.uiowa.edu/cdm/ref/collection/duffy/id/394"" target=""_blank"">View this item in its source respository</a>",,,,,,,,,,,,,,,,,,,,,,,,,,,,,https://www.iowaheritage.org/files/original/013eaedb6721e9cfbcb977015660b39a.jpg,"Remote Item","Editorial Cartoons of Brian Duffy",1,0
64446,https://www.iowaheritage.org/items/show/64446,"Our role in the world is undiminished","State|Christopher, Warren|United States|Men|1990-2000|United States. Dept. of State|United States -- Foreign relations|Leadership|Presidential appointees|Cabinets|Shoes","Sec. of State; Leadership 16EEEE","Duffy, Brian, 1955-",,"University of Iowa. Libraries. Special Collections Dept.",1993-06-01|2011-04,,"Educational use only, no other permissions given. Copyright to this digital object is owned by The Des Moines Register; it may not be downloaded, reproduced, or distributed without written permission. For more information, contact the Special Collections Department.","Editorial Cartoons of Brian Duffy; Des Moines Register Cartoonists|Papers of Brian Duffy|Des Moines Register",,English,"Still image|Editorial cartoons",MSC916|duffy-930601|http://digital.lib.uiowa.edu/cdm/ref/collection/duffy/id/284,,,,,,,,,,,,,,,,,,,,,,,,,,,,,,,,,,,,,,,,,,,,,,,,"<a href=""http://digital.lib.uiowa.edu/cdm/ref/collection/duffy/id/284"" target=""_blank"">View this item in its source respository</a>",,,,,,,,,,,,,,,,,,,,,,,,,,,,,https://www.iowaheritage.org/files/original/d6132077c84b3cf531eb9c00a7b23cab.jpg,"Remote Item","Editorial Cartoons of Brian Duffy",1,0
64482,https://www.iowaheritage.org/items/show/64482,Overruled!,"Judges|Ito, Lance Allan|Los Angeles (Calif.)|Judges|1990-2000|Judicial system|Lawyers|Courts|Fame|Murder|Celebrities|Athletes|Simpson, O. J., 1947-|Gavels|Men|Lawyers|Chairs|Desks","Lawyers; Judge Ito","Duffy, Brian, 1955-",,"University of Iowa. Libraries. Special Collections Dept.",1995-04-28|2011-04,,"Educational use only, no other permissions given. Copyright to this digital object is owned by The Des Moines Register; it may not be downloaded, reproduced, or distributed without written permission. For more information, contact the Special Collections Department.","Editorial Cartoons of Brian Duffy; Des Moines Register Cartoonists|Papers of Brian Duffy|Des Moines Register",,English,"Still image|Editorial cartoons",MSC916|duffy-950428|http://digital.lib.uiowa.edu/cdm/ref/collection/duffy/id/320,,,,,,,,,,,,,,,,,,,,,,,,,,,,,,,,,,,,,,,,,,,,,,,,"<a href=""http://digital.lib.uiowa.edu/cdm/ref/collection/duffy/id/320"" target=""_blank"">View this item in its source respository</a>",,,,,,,,,,,,,,,,,,,,,,,,,,,,,https://www.iowaheritage.org/files/original/c993012586ec9a7563bb65fc4421e857.jpg,"Remote Item","Editorial Cartoons of Brian Duffy",1,0
