 




﻿"Item Id","Item URI","Dublin Core:Title","Dublin Core:Subject","Dublin Core:Description","Dublin Core:Creator","Dublin Core:Source","Dublin Core:Publisher","Dublin Core:Date","Dublin Core:Contributor","Dublin Core:Rights","Dublin Core:Relation","Dublin Core:Format","Dublin Core:Language","Dublin Core:Type","Dublin Core:Identifier","Dublin Core:Coverage","Item Type Metadata:Text","Item Type Metadata:Interviewer","Item Type Metadata:Interviewee","Item Type Metadata:Location","Item Type Metadata:Transcription","Item Type Metadata:Local URL","Item Type Metadata:Original Format","Item Type Metadata:Physical Dimensions","Item Type Metadata:Duration","Item Type Metadata:Compression","Item Type Metadata:Producer","Item Type Metadata:Director","Item Type Metadata:Bit Rate/Frequency","Item Type Metadata:Time Summary","Item Type Metadata:Email Body","Item Type Metadata:Subject Line","Item Type Metadata:From","Item Type Metadata:To","Item Type Metadata:CC","Item Type Metadata:BCC","Item Type Metadata:Number of Attachments","Item Type Metadata:Standards","Item Type Metadata:Objectives","Item Type Metadata:Materials","Item Type Metadata:Lesson Plan Text","Item Type Metadata:URL","Item Type Metadata:Event Type","Item Type Metadata:Participants","Item Type Metadata:Birth Date","Item Type Metadata:Birthplace","Item Type Metadata:Death Date","Item Type Metadata:Occupation","Item Type Metadata:Biographical Text","Item Type Metadata:Bibliography","Item Type Metadata:Digital Reproduction Information","Item Type Metadata:Repository","Item Type Metadata:Repository Collection","Item Type Metadata:Contact information.","Item Type Metadata:File Name","Item Type Metadata:Notes","Item Type Metadata:Digital item created","Item Type Metadata:Digital item modified","Item Type Metadata:Executive Orders","Item Type Metadata:Record Created","Item Type Metadata:Record Modified","Item Type Metadata:Transcription2","Item Type Metadata:Source URL","Omeka Legacy File:Additional Creator","Omeka Legacy File:Transcriber","Omeka Legacy File:Producer","Omeka Legacy File:Render Device","Omeka Legacy File:Render Details","Omeka Legacy File:Capture Date","Omeka Legacy File:Capture Device","Omeka Legacy File:Capture Details","Omeka Legacy File:Change History","Omeka Legacy File:Watermark","Omeka Legacy File:Encryption","Omeka Legacy File:Compression","Omeka Legacy File:Post Processing","Omeka Image File:Width","Omeka Image File:Height","Omeka Image File:Bit Depth","Omeka Image File:Channels","Omeka Image File:Exif String","Omeka Image File:Exif Array","Omeka Image File:IPTC String","Omeka Image File:IPTC Array","Omeka Video File:Bitrate","Omeka Video File:Duration","Omeka Video File:Sample Rate","Omeka Video File:Codec","Omeka Video File:Width","Omeka Video File:Height",tags,file,itemType,collection,public,featured
64327,https://www.iowaheritage.org/items/show/64327,"News: 100 college presidents take a ""stand"" on lowering the legal drinking age","Universities & colleges|United States|Adults|2000-2010|Alcohol|Drinking|Law|Leadership|People|Beer|Kegs|Drinkers|Alcohol|Drunks|Parties",,"Duffy, Brian, 1955-",,"University of Iowa. Libraries. Special Collections Dept.",2008-08-20|2011-04,,"Educational use only, no other permissions given. Copyright to this digital object is owned by The Des Moines Register; it may not be downloaded, reproduced, or distributed without written permission. For more information, contact the Special Collections Department.","Editorial Cartoons of Brian Duffy; Des Moines Register Cartoonists|Papers of Brian Duffy|Des Moines Register",,English,"Still image|Editorial cartoons",MSC916|duffy-080820|http://digital.lib.uiowa.edu/cdm/ref/collection/duffy/id/165,,,,,,,,,,,,,,,,,,,,,,,,,,,,,,,,,,,,,,,,,,,,,,,,"<a href=""http://digital.lib.uiowa.edu/cdm/ref/collection/duffy/id/165"" target=""_blank"">View this item in its source respository</a>",,,,,,,,,,,,,,,,,,,,,,,,,,,,,https://www.iowaheritage.org/files/original/272d5676e5c331a8bc0c59681095d9db.jpg,"Remote Item","Editorial Cartoons of Brian Duffy",1,0
64510,https://www.iowaheritage.org/items/show/64510,"Nixon with hands holding tape above his head","Presidents|Nixon, Richard M. (Richard Milhous), 1913-1994|United States|Presidents|1980-1990|Political corruption|Political corruption -- United States|Political crimes and offenses|Politicians|Politics|Sound equipment & supplies|Hands|Fingers",,"Duffy, Brian, 1955-",,"University of Iowa. Libraries. Special Collections Dept.",1984-08-05|2011-04,,"Educational use only, no other permissions given. Copyright to this digital object is owned by The Des Moines Register; it may not be downloaded, reproduced, or distributed without written permission. For more information, contact the Special Collections Department.","Editorial Cartoons of Brian Duffy; Des Moines Register Cartoonists|Papers of Brian Duffy|Des Moines Register",,English,"Still image|Editorial cartoons",MSC916|duffy-840805|http://digital.lib.uiowa.edu/cdm/ref/collection/duffy/id/348,,,,,,,,,,,,,,,,,,,,,,,,,,,,,,,,,,,,,,,,,,,,,,,,"<a href=""http://digital.lib.uiowa.edu/cdm/ref/collection/duffy/id/348"" target=""_blank"">View this item in its source respository</a>",,,,,,,,,,,,,,,,,,,,,,,,,,,,,https://www.iowaheritage.org/files/original/abed4b89fd7c690acadb2df45ede1f56.jpg,"Remote Item","Editorial Cartoons of Brian Duffy",1,0
64256,https://www.iowaheritage.org/items/show/64256,"No hard feelings?","Steel industry and trade|Bush, George W. (George Walker), 1946-|Steel|2000-2010|Steel|Foreign trade|Domestic policy|Industry|Workers|Factories|Presidents","Steel states; Foreign tariffs lifted","Duffy, Brian, 1955-",,"University of Iowa. Libraries. Special Collections Dept.",2003-12-05|2011-04,,"Educational use only, no other permissions given. Copyright to this digital object is owned by The Des Moines Register; it may not be downloaded, reproduced, or distributed without written permission. For more information, contact the Special Collections Department.","Editorial Cartoons of Brian Duffy; Des Moines Register Cartoonists|Papers of Brian Duffy|Des Moines Register",,English,"Still image|Editorial cartoons",MSC916|duffy-031205|http://digital.lib.uiowa.edu/cdm/ref/collection/duffy/id/94,,,,,,,,,,,,,,,,,,,,,,,,,,,,,,,,,,,,,,,,,,,,,,,,"<a href=""http://digital.lib.uiowa.edu/cdm/ref/collection/duffy/id/94"" target=""_blank"">View this item in its source respository</a>",,,,,,,,,,,,,,,,,,,,,,,,,,,,,https://www.iowaheritage.org/files/original/1a00f06b49f35568451f7d317bd77ffd.jpg,"Remote Item","Editorial Cartoons of Brian Duffy",1,0
64561,https://www.iowaheritage.org/items/show/64561,"No more Ms. Nice Guy","Women|United States|Opera singers|1980-1990|Women's rights|Women's liberation|Equality|Microphones|Press|Press conferences|Spears|Shields|Warriors","National Organization for Women","Duffy, Brian, 1955-",,"University of Iowa. Libraries. Special Collections Dept.",1985-07-23|2011-04,,"Educational use only, no other permissions given. Copyright to this digital object is owned by The Des Moines Register; it may not be downloaded, reproduced, or distributed without written permission. For more information, contact the Special Collections Department.","Editorial Cartoons of Brian Duffy; Des Moines Register Cartoonists|Papers of Brian Duffy|Des Moines Register",,English,"Still image|Editorial cartoons",MSC916|duffy-850723|http://digital.lib.uiowa.edu/cdm/ref/collection/duffy/id/399,,,,,,,,,,,,,,,,,,,,,,,,,,,,,,,,,,,,,,,,,,,,,,,,"<a href=""http://digital.lib.uiowa.edu/cdm/ref/collection/duffy/id/399"" target=""_blank"">View this item in its source respository</a>",,,,,,,,,,,,,,,,,,,,,,,,,,,,,https://www.iowaheritage.org/files/original/dc1a7848660bdb265fc3e3aab17ee3ac.jpg,"Remote Item","Editorial Cartoons of Brian Duffy",1,0
64653,https://www.iowaheritage.org/items/show/64653,"No more stays of execution, and that's final ... now ... where was I","Death|Noonan, John Thomas, 1926-|California|Judges|1990-2000|Executions|Judges|Judicial system|Abortions|Issues|Hypocrisy|Harris, Robert Alton, d. 1992|Desks|Chairs|Reading|Telephones|Waste baskets","Pennsylvania abortion case; Harris case","Duffy, Brian, 1955-",,"University of Iowa. Libraries. Special Collections Dept.",1992-04-22|2011-04,,"Educational use only, no other permissions given. Copyright to this digital object is owned by The Des Moines Register; it may not be downloaded, reproduced, or distributed without written permission. For more information, contact the Special Collections Department.","Editorial Cartoons of Brian Duffy; Des Moines Register Cartoonists|Papers of Brian Duffy|Des Moines Register",,English,"Still image|Editorial cartoons",MSC916|duffy-920422|http://digital.lib.uiowa.edu/cdm/ref/collection/duffy/id/491,,,,,,,,,,,,,,,,,,,,,,,,,,,,,,,,,,,,,,,,,,,,,,,,"<a href=""http://digital.lib.uiowa.edu/cdm/ref/collection/duffy/id/491"" target=""_blank"">View this item in its source respository</a>",,,,,,,,,,,,,,,,,,,,,,,,,,,,,https://www.iowaheritage.org/files/original/c481a0b6e9a8dac9bfba548ad42dbc18.jpg,"Remote Item","Editorial Cartoons of Brian Duffy",1,0
64438,https://www.iowaheritage.org/items/show/64438,"No reefs in sight!","Governors|Branstad, Terry E.|Iowa|Ships|1990-2000|Legislators|Legislature|State governments|States|Budgets|Governors|Men|Sailors|Oceans|Rocks|Captains|Masts and rigging|Telescopes","Legislature; They have a problem with the vision thing; Iowa; Budget","Duffy, Brian, 1955-",,"University of Iowa. Libraries. Special Collections Dept.",1991-02-19|2011-04,,"Educational use only, no other permissions given. Copyright to this digital object is owned by The Des Moines Register; it may not be downloaded, reproduced, or distributed without written permission. For more information, contact the Special Collections Department.","Editorial Cartoons of Brian Duffy; Des Moines Register Cartoonists|Papers of Brian Duffy|Des Moines Register",,English,"Still image|Editorial cartoons",MSC916|duffy-910219|http://digital.lib.uiowa.edu/cdm/ref/collection/duffy/id/276,,,,,,,,,,,,,,,,,,,,,,,,,,,,,,,,,,,,,,,,,,,,,,,,"<a href=""http://digital.lib.uiowa.edu/cdm/ref/collection/duffy/id/276"" target=""_blank"">View this item in its source respository</a>",,,,,,,,,,,,,,,,,,,,,,,,,,,,,https://www.iowaheritage.org/files/original/baa34768c5d6b168c306f98938ea1fd9.jpg,"Remote Item","Editorial Cartoons of Brian Duffy",1,0
64231,https://www.iowaheritage.org/items/show/64231,"No thank you, just stamp ""return to sender"", please","Bioterrorism|United States|Mail|2000-2010|Fear|Mail|Postal service|Postal service -- United States|Mailmen|Men|Dogs|Protective clothing|Fishing rods","U.S. Mail","Duffy, Brian, 1955-",,"University of Iowa. Libraries. Special Collections Dept.",2001-10-16|2011-04,,"Educational use only, no other permissions given. Copyright to this digital object is owned by The Des Moines Register; it may not be downloaded, reproduced, or distributed without written permission. For more information, contact the Special Collections Department.","Editorial Cartoons of Brian Duffy; Des Moines Register Cartoonists|Papers of Brian Duffy|Des Moines Register",,English,"Still image|Editorial cartoons",MSC916|duffy-011016|http://digital.lib.uiowa.edu/cdm/ref/collection/duffy/id/69,,,,,,,,,,,,,,,,,,,,,,,,,,,,,,,,,,,,,,,,,,,,,,,,"<a href=""http://digital.lib.uiowa.edu/cdm/ref/collection/duffy/id/69"" target=""_blank"">View this item in its source respository</a>",,,,,,,,,,,,,,,,,,,,,,,,,,,,,https://www.iowaheritage.org/files/original/9e126a4581a6d8aa6e78abb313a2d0b2.jpg,"Remote Item","Editorial Cartoons of Brian Duffy",1,0
64294,https://www.iowaheritage.org/items/show/64294,"Not only did I receive a pardon, the increased my feed!","Turkeys|United States|Turkeys|2000-2010|Thanksgiving|Presidents|Tradition|Holidays",,"Duffy, Brian, 1955-",,"University of Iowa. Libraries. Special Collections Dept.",2004-11-25|2011-04,,"Educational use only, no other permissions given. Copyright to this digital object is owned by The Des Moines Register; it may not be downloaded, reproduced, or distributed without written permission. For more information, contact the Special Collections Department.","Editorial Cartoons of Brian Duffy; Des Moines Register Cartoonists|Papers of Brian Duffy|Des Moines Register",,English,"Still image|Editorial cartoons",MSC916|duffy-041125|http://digital.lib.uiowa.edu/cdm/ref/collection/duffy/id/132,,,,,,,,,,,,,,,,,,,,,,,,,,,,,,,,,,,,,,,,,,,,,,,,"<a href=""http://digital.lib.uiowa.edu/cdm/ref/collection/duffy/id/132"" target=""_blank"">View this item in its source respository</a>",,,,,,,,,,,,,,,,,,,,,,,,,,,,,https://www.iowaheritage.org/files/original/4a7e8120a55163e00dc478a8936d6e50.jpg,"Remote Item","Editorial Cartoons of Brian Duffy",1,0
64398,https://www.iowaheritage.org/items/show/64398,"Now I know how the San Francisco Giants must have felt","Presidents|Bush, George, 1924-|Washington (D.C.)|Presidents|1980-1990|Presidents -- United States|Elections|Elections -- United States|Political parties|Democrats|Republicans|Flags|Desks|Offices|Telephones|Papers|Newspapers|Newspaper headlines|Windows","News; Democrats sweep elections N.V., New Jersey, Virginia; Wait; In","Duffy, Brian, 1955-",,"University of Iowa. Libraries. Special Collections Dept.",1989-11-09|2011-04,,"Educational use only, no other permissions given. Copyright to this digital object is owned by The Des Moines Register; it may not be downloaded, reproduced, or distributed without written permission. For more information, contact the Special Collections Department.","Editorial Cartoons of Brian Duffy; Des Moines Register Cartoonists|Papers of Brian Duffy|Des Moines Register",,English,"Still image|Editorial cartoons",MSC916|duffy-891109|http://digital.lib.uiowa.edu/cdm/ref/collection/duffy/id/236,,,,,,,,,,,,,,,,,,,,,,,,,,,,,,,,,,,,,,,,,,,,,,,,"<a href=""http://digital.lib.uiowa.edu/cdm/ref/collection/duffy/id/236"" target=""_blank"">View this item in its source respository</a>",,,,,,,,,,,,,,,,,,,,,,,,,,,,,https://www.iowaheritage.org/files/original/a5b24e4e5fe8e3975a6ce27f6e4e4b4a.jpg,"Remote Item","Editorial Cartoons of Brian Duffy",1,0
64488,https://www.iowaheritage.org/items/show/64488,"Now that we have a deal, we can move forward, right?","Horse racing|Iowa|Horses|1990-2000|Government|Government regulation|Commissions|Gambling|States|State game commissions|Horseshoes|Shoes|Costumes|Saddles","Right; Not so fast!; Raci; Polk County; Iowa Racing and Gaming Commission","Duffy, Brian, 1955-",,"University of Iowa. Libraries. Special Collections Dept.",1997-09-14|2011-04,,"Educational use only, no other permissions given. Copyright to this digital object is owned by The Des Moines Register; it may not be downloaded, reproduced, or distributed without written permission. For more information, contact the Special Collections Department.","Editorial Cartoons of Brian Duffy; Des Moines Register Cartoonists|Papers of Brian Duffy|Des Moines Register",,English,"Still image|Editorial cartoons",MSC916|duffy-970914|http://digital.lib.uiowa.edu/cdm/ref/collection/duffy/id/326,,,,,,,,,,,,,,,,,,,,,,,,,,,,,,,,,,,,,,,,,,,,,,,,"<a href=""http://digital.lib.uiowa.edu/cdm/ref/collection/duffy/id/326"" target=""_blank"">View this item in its source respository</a>",,,,,,,,,,,,,,,,,,,,,,,,,,,,,https://www.iowaheritage.org/files/original/780444d616a696a3af890cce4b880b41.jpg,"Remote Item","Editorial Cartoons of Brian Duffy",1,0
