 




﻿"Item Id","Item URI","Dublin Core:Title","Dublin Core:Subject","Dublin Core:Description","Dublin Core:Creator","Dublin Core:Source","Dublin Core:Publisher","Dublin Core:Date","Dublin Core:Contributor","Dublin Core:Rights","Dublin Core:Relation","Dublin Core:Format","Dublin Core:Language","Dublin Core:Type","Dublin Core:Identifier","Dublin Core:Coverage","Item Type Metadata:Text","Item Type Metadata:Interviewer","Item Type Metadata:Interviewee","Item Type Metadata:Location","Item Type Metadata:Transcription","Item Type Metadata:Local URL","Item Type Metadata:Original Format","Item Type Metadata:Physical Dimensions","Item Type Metadata:Duration","Item Type Metadata:Compression","Item Type Metadata:Producer","Item Type Metadata:Director","Item Type Metadata:Bit Rate/Frequency","Item Type Metadata:Time Summary","Item Type Metadata:Email Body","Item Type Metadata:Subject Line","Item Type Metadata:From","Item Type Metadata:To","Item Type Metadata:CC","Item Type Metadata:BCC","Item Type Metadata:Number of Attachments","Item Type Metadata:Standards","Item Type Metadata:Objectives","Item Type Metadata:Materials","Item Type Metadata:Lesson Plan Text","Item Type Metadata:URL","Item Type Metadata:Event Type","Item Type Metadata:Participants","Item Type Metadata:Birth Date","Item Type Metadata:Birthplace","Item Type Metadata:Death Date","Item Type Metadata:Occupation","Item Type Metadata:Biographical Text","Item Type Metadata:Bibliography","Item Type Metadata:Digital Reproduction Information","Item Type Metadata:Repository","Item Type Metadata:Repository Collection","Item Type Metadata:Contact information.","Item Type Metadata:File Name","Item Type Metadata:Notes","Item Type Metadata:Digital item created","Item Type Metadata:Digital item modified","Item Type Metadata:Executive Orders","Item Type Metadata:Record Created","Item Type Metadata:Record Modified","Item Type Metadata:Transcription2","Item Type Metadata:Source URL","Omeka Legacy File:Additional Creator","Omeka Legacy File:Transcriber","Omeka Legacy File:Producer","Omeka Legacy File:Render Device","Omeka Legacy File:Render Details","Omeka Legacy File:Capture Date","Omeka Legacy File:Capture Device","Omeka Legacy File:Capture Details","Omeka Legacy File:Change History","Omeka Legacy File:Watermark","Omeka Legacy File:Encryption","Omeka Legacy File:Compression","Omeka Legacy File:Post Processing","Omeka Image File:Width","Omeka Image File:Height","Omeka Image File:Bit Depth","Omeka Image File:Channels","Omeka Image File:Exif String","Omeka Image File:Exif Array","Omeka Image File:IPTC String","Omeka Image File:IPTC Array","Omeka Video File:Bitrate","Omeka Video File:Duration","Omeka Video File:Sample Rate","Omeka Video File:Codec","Omeka Video File:Width","Omeka Video File:Height",tags,file,itemType,collection,public,featured
13512,https://www.iowaheritage.org/items/show/13512,"Plat book of Humboldt County, Iowa","United States|Iowa|Humboldt County|Agriculture and Rural Life","W.W. Hixson & Co.'s 1930 plat book of Humboldt County, Iowa, containing a map of the county and township maps showing land ownership",,,"W.W. Hixson & Co.|University of Iowa. Libraries. Map Collection",2007-06-05|2007-06-05,,"Educational use only, no other permissions given. U.S. and international copyright laws may protect this digital object. Commercial use or distribution of the object is not permitted without prior permission of the copyright holder.","Hixson Plat Map Atlases of Iowa","1 atlas : 14 l. ; 21 X 28 cm.",,"Still image; Text|Atlases; Plat books|jpg",173845076|https://digital.lib.uiowa.edu/,,,,,,,,,,,,,,,,,,,,,,,,,,,,,,,,,,,,,,,,,,,,,,,,"<a href=""https://digital.lib.uiowa.edu/"" target=""_blank"">View this item in its source respository</a>",,,,,,,,,,,,,,,,,,,,,,,,,,,,,https://www.iowaheritage.org/files/original/7cc5db32a6116b1b3de59516094ee714.jpg,"Remote Item","Hixson Plat Map Atlases of Iowa",1,0
13510,https://www.iowaheritage.org/items/show/13510,"Plat book of Howard County, Iowa","United States|Iowa|Howard County|Agriculture and Rural Life","W.W. Hixson & Co.'s 1930 plat book of Howard County, Iowa, containing a map of the county and township maps showing land ownership",,,"W.W. Hixson & Co.|University of Iowa. Libraries. Map Collection",1930|2007-06-05|2007-06-05,,"Educational use only, no other permissions given. U.S. and international copyright laws may protect this digital object. Commercial use or distribution of the object is not permitted without prior permission of the copyright holder.","Hixson Plat Map Atlases of Iowa","1 atlas : 18 l. ; 21 X 28 cm.",English,"Still image; Text|Atlases; Plat books|jpg","Master image scanned with Ricoh Aficio 3228C as a JPEG. Township maps and covers scanned at 600 ppi. County maps are composites of 300 ppi scans merged with Adobe Photoshop.|173845076|https://digital.lib.uiowa.edu/",,,,,,,,,,,,,,,,,,,,,,,,,,,,,,,,,,,,,,,,,,,,,,,,"<a href=""https://digital.lib.uiowa.edu/"" target=""_blank"">View this item in its source respository</a>",,,,,,,,,,,,,,,,,,,,,,,,,,,,,https://www.iowaheritage.org/files/original/9459cd516f23986380e62282d08c568c.jpg,"Remote Item","Hixson Plat Map Atlases of Iowa",1,0
13508,https://www.iowaheritage.org/items/show/13508,"Plat book of Henry County, Iowa","United States|Iowa|Henry County|Agriculture and Rural Life","W.W. Hixson & Co.'s 1930 plat book of Henry County, Iowa, containing a map of the county and township maps showing land ownership",,,"W.W. Hixson & Co.|University of Iowa. Libraries. Map Collection",1930|2007-06-04|2007-06-04,,"Educational use only, no other permissions given. U.S. and international copyright laws may protect this digital object. Commercial use or distribution of the object is not permitted without prior permission of the copyright holder.","Hixson Plat Map Atlases of Iowa","1 atlas : 14 l. ; 21 X 28 cm.",English,"Still image; Text|Atlases; Plat books|jpg","Master image scanned with Ricoh Aficio 3228C as a JPEG. Township maps and covers scanned at 600 ppi. County maps are composites of 300 ppi scans merged with Adobe Photoshop.|173845076|https://digital.lib.uiowa.edu/",t073n,,,,,,,,,,,,,,,,,,,,,,,,,,,,,,,,,,,,,,,,,,,,,,,"<a href=""https://digital.lib.uiowa.edu/"" target=""_blank"">View this item in its source respository</a>",,,,,,,,,,,,,,,,,,,,,,,,,,,,,https://www.iowaheritage.org/files/original/3915e37fcea8c21da0a4d8515f76190c.jpg,"Remote Item","Hixson Plat Map Atlases of Iowa",1,0
13506,https://www.iowaheritage.org/items/show/13506,"Plat book of Harrison County, Iowa","United States|Iowa|Harrison County|Agriculture and Rural Life","W.W. Hixson & Co.'s 1930 plat book of Harrison County, Iowa, containing a map of the county and township maps showing land ownership",,,"W.W. Hixson & Co.|University of Iowa. Libraries. Map Collection",1930|2007-06-04|2007-06-04,,"Educational use only, no other permissions given. U.S. and international copyright laws may protect this digital object. Commercial use or distribution of the object is not permitted without prior permission of the copyright holder.","Hixson Plat Map Atlases of Iowa","1 atlas : 22 l. ; 21 X 28 cm.",English,"Still image; Text|Atlases; Plat books|jpg","Master image scanned with Ricoh Aficio 3228C as a JPEG. Township maps and covers scanned at 600 ppi. County maps are composites of 300 ppi scans merged with Adobe Photoshop.|173845076|https://digital.lib.uiowa.edu/",,,,,,,,,,,,,,,,,,,,,,,,,,,,,,,,,,,,,,,,,,,,,,,,"<a href=""https://digital.lib.uiowa.edu/"" target=""_blank"">View this item in its source respository</a>",,,,,,,,,,,,,,,,,,,,,,,,,,,,,https://www.iowaheritage.org/files/original/9f2658361ab71d40839b4ff50725077e.jpg,"Remote Item","Hixson Plat Map Atlases of Iowa",1,0
13504,https://www.iowaheritage.org/items/show/13504,"Plat book of Hardin County, Iowa","United States|Iowa|Hardin County|Agriculture and Rural Life","W.W. Hixson & Co.'s 1930 plat book of Hardin County, Iowa, containing a map of the county and township maps showing land ownership",,,"W.W. Hixson & Co.|University of Iowa. Libraries. Map Collection",1930|2007-06-01|2007-06-01,,"Educational use only, no other permissions given. U.S. and international copyright laws may protect this digital object. Commercial use or distribution of the object is not permitted without prior permission of the copyright holder.","Hixson Plat Map Atlases of Iowa","1 atlas : 19 l. ; 21 X 28 cm.",English,"Still image; Text|Atlases; Plat books|jpg","Master image scanned with Ricoh Aficio 3228C as a JPEG. Township maps and covers scanned at 600 ppi. County maps are composites of 300 ppi scans merged with Adobe Photoshop.|173845076|https://digital.lib.uiowa.edu/",,,,,,,,,,,,,,,,,,,,,,,,,,,,,,,,,,,,,,,,,,,,,,,,"<a href=""https://digital.lib.uiowa.edu/"" target=""_blank"">View this item in its source respository</a>",,,,,,,,,,,,,,,,,,,,,,,,,,,,,https://www.iowaheritage.org/files/original/7260ae3ddff98ae99ea6517576b5dbff.jpg,"Remote Item","Hixson Plat Map Atlases of Iowa",1,0
13502,https://www.iowaheritage.org/items/show/13502,"Plat book of Hancock County, Iowa","United States|Iowa|Hancock County|Agriculture and Rural Life","W.W. Hixson & Co.'s 1930 plat book of Hancock County, Iowa, containing a map of the county and township maps showing land ownership",,,"W.W. Hixson & Co.|University of Iowa. Libraries. Map Collection",1930|2007-06-01|2007-06-01,,"Educational use only, no other permissions given. U.S. and international copyright laws may protect this digital object. Commercial use or distribution of the object is not permitted without prior permission of the copyright holder.","Hixson Plat Map Atlases of Iowa","1 atlas : 18 l. ; 21 X 28 cm.",English,"Still image; Text|Atlases; Plat books|jpg","Master image scanned with Ricoh Aficio 3228C as a JPEG. Township maps and covers scanned at 600 ppi. County maps are composites of 300 ppi scans merged with Adobe Photoshop.|173845076|https://digital.lib.uiowa.edu/",,,,,,,,,,,,,,,,,,,,,,,,,,,,,,,,,,,,,,,,,,,,,,,,"<a href=""https://digital.lib.uiowa.edu/"" target=""_blank"">View this item in its source respository</a>",,,,,,,,,,,,,,,,,,,,,,,,,,,,,https://www.iowaheritage.org/files/original/918e7daae230e727a8bf99323d0623dd.jpg,"Remote Item","Hixson Plat Map Atlases of Iowa",1,0
13500,https://www.iowaheritage.org/items/show/13500,"Plat book of Hamilton County, Iowa","United States|Iowa|Hamilton County|Agriculture and Rural Life","W.W. Hixson & Co.'s 1930 plat book of Hamilton County, Iowa, containing a map of the county and township maps showing land ownership",,,"W.W. Hixson & Co.|University of Iowa. Libraries. Map Collection",1930|2007-05-30|2007-05-30,,"Educational use only, no other permissions given. U.S. and international copyright laws may protect this digital object. Commercial use or distribution of the object is not permitted without prior permission of the copyright holder.","Hixson Plat Map Atlases of Iowa","1 atlas : 18 l. ; 21 X 28 cm.",English,"Still image; Text|Atlases; Plat books","Master image scanned with Ricoh Aficio 3228C as a JPEG. Township maps and covers scanned at 600 ppi. County maps are composites of 300 ppi scans merged with Adobe Photoshop.|173845076|https://digital.lib.uiowa.edu/",,,,,,,,,,,,,,,,,,,,,,,,,,,,,,,,,,,,,,,,,,,,,,,,"<a href=""https://digital.lib.uiowa.edu/"" target=""_blank"">View this item in its source respository</a>",,,,,,,,,,,,,,,,,,,,,,,,,,,,,https://www.iowaheritage.org/files/original/6fa85470fae412e92c6f7d9c09631e77.jpg,"Remote Item","Hixson Plat Map Atlases of Iowa",1,0
13498,https://www.iowaheritage.org/items/show/13498,"Plat book of Guthrie County, Iowa","United States|Iowa|Guthrie County|Agriculture and Rural Life","W.W. Hixson & Co.'s 1930 plat book of Guthrie County, Iowa, containing a map of the county and township maps showing land ownership",,,"W.W. Hixson & Co.|University of Iowa. Libraries. Map Collection",1930|2007-05-29|2007-05-29,,"Educational use only, no other permissions given. U.S. and international copyright laws may protect this digital object. Commercial use or distribution of the object is not permitted without prior permission of the copyright holder.","Hixson Plat Map Atlases of Iowa","1 atlas : 19 l. ; 21 X 28 cm.",English,"Still image; Text|Atlases; Plat books|jpg","Master image scanned with Ricoh Aficio 3228C as a JPEG. Township maps and covers scanned at 600 ppi. County maps are composites of 300 ppi scans merged with Adobe Photoshop.|173845076|https://digital.lib.uiowa.edu/",,,,,,,,,,,,,,,,,,,,,,,,,,,,,,,,,,,,,,,,,,,,,,,,"<a href=""https://digital.lib.uiowa.edu/"" target=""_blank"">View this item in its source respository</a>",,,,,,,,,,,,,,,,,,,,,,,,,,,,,https://www.iowaheritage.org/files/original/1f4cad8c3dd7e6dd4e8bda91792506e1.jpg,"Remote Item","Hixson Plat Map Atlases of Iowa",1,0
13496,https://www.iowaheritage.org/items/show/13496,"Plat book of Grundy County, Iowa","United States|Iowa|Grundy County|Agriculture and Rural Life","W.W. Hixson & Co.'s 1930 plat book of Grundy County, Iowa, containing a map of the county and township maps showing land ownership",,,"W.W. Hixson & Co.|University of Iowa. Libraries. Map Collection",1930|2007-05-29|2007-05-29,,"Educational use only, no other permissions given. U.S. and international copyright laws may protect this digital object. Commercial use or distribution of the object is not permitted without prior permission of the copyright holder.","Hixson Plat Map Atlases of Iowa","1 atlas : 16 l. ; 21 X 28 cm.",English,"Still image; Text|Atlases; Plat books|jpg","Master image scanned with Ricoh Aficio 3228C as a JPEG. Township maps and covers scanned at 600 ppi. County maps are composites of 300 ppi scans merged with Adobe Photoshop.|173845076|https://digital.lib.uiowa.edu/",,,,,,,,,,,,,,,,,,,,,,,,,,,,,,,,,,,,,,,,,,,,,,,,"<a href=""https://digital.lib.uiowa.edu/"" target=""_blank"">View this item in its source respository</a>",,,,,,,,,,,,,,,,,,,,,,,,,,,,,https://www.iowaheritage.org/files/original/63deba9f5c8b49996d7bc4fd0582cce0.jpg,"Remote Item","Hixson Plat Map Atlases of Iowa",1,0
13494,https://www.iowaheritage.org/items/show/13494,"Plat book of Greene County, Iowa","United States|Iowa|Greene County|Agriculture and Rural Life","W.W. Hixson & Co.'s 1930 plat book of Greene County, Iowa, containing a map of the county and township maps showing land ownership",,,"W.W. Hixson & Co.|University of Iowa. Libraries. Map Collection",1930|2007-05-24|2007-05-24,,"Educational use only, no other permissions given. U.S. and international copyright laws may protect this digital object. Commercial use or distribution of the object is not permitted without prior permission of the copyright holder.","Hixson Plat Map Atlases of Iowa","1 atlas : 18 l. ; 21 X 28 cm.",English,"Still image; Text|Atlases; Plat books|jpg","Master image scanned with Ricoh Aficio 3228C as a JPEG. Township maps and covers scanned at 600 ppi. County maps are composites of 300 ppi scans merged with Adobe Photoshop.|173845076|https://digital.lib.uiowa.edu/",,,,,,,,,,,,,,,,,,,,,,,,,,,,,,,,,,,,,,,,,,,,,,,,"<a href=""https://digital.lib.uiowa.edu/"" target=""_blank"">View this item in its source respository</a>",,,,,,,,,,,,,,,,,,,,,,,,,,,,,https://www.iowaheritage.org/files/original/80b56d1f7a4560689bc0b454e2cd1540.jpg,"Remote Item","Hixson Plat Map Atlases of Iowa",1,0
