 




﻿"Item Id","Item URI","Dublin Core:Title","Dublin Core:Subject","Dublin Core:Description","Dublin Core:Creator","Dublin Core:Source","Dublin Core:Publisher","Dublin Core:Date","Dublin Core:Contributor","Dublin Core:Rights","Dublin Core:Relation","Dublin Core:Format","Dublin Core:Language","Dublin Core:Type","Dublin Core:Identifier","Dublin Core:Coverage","Item Type Metadata:Text","Item Type Metadata:Interviewer","Item Type Metadata:Interviewee","Item Type Metadata:Location","Item Type Metadata:Transcription","Item Type Metadata:Local URL","Item Type Metadata:Original Format","Item Type Metadata:Physical Dimensions","Item Type Metadata:Duration","Item Type Metadata:Compression","Item Type Metadata:Producer","Item Type Metadata:Director","Item Type Metadata:Bit Rate/Frequency","Item Type Metadata:Time Summary","Item Type Metadata:Email Body","Item Type Metadata:Subject Line","Item Type Metadata:From","Item Type Metadata:To","Item Type Metadata:CC","Item Type Metadata:BCC","Item Type Metadata:Number of Attachments","Item Type Metadata:Standards","Item Type Metadata:Objectives","Item Type Metadata:Materials","Item Type Metadata:Lesson Plan Text","Item Type Metadata:URL","Item Type Metadata:Event Type","Item Type Metadata:Participants","Item Type Metadata:Birth Date","Item Type Metadata:Birthplace","Item Type Metadata:Death Date","Item Type Metadata:Occupation","Item Type Metadata:Biographical Text","Item Type Metadata:Bibliography","Item Type Metadata:Digital Reproduction Information","Item Type Metadata:Repository","Item Type Metadata:Repository Collection","Item Type Metadata:Contact information.","Item Type Metadata:File Name","Item Type Metadata:Notes","Item Type Metadata:Digital item created","Item Type Metadata:Digital item modified","Item Type Metadata:Executive Orders","Item Type Metadata:Record Created","Item Type Metadata:Record Modified","Item Type Metadata:Transcription2","Item Type Metadata:Source URL","Omeka Legacy File:Additional Creator","Omeka Legacy File:Transcriber","Omeka Legacy File:Producer","Omeka Legacy File:Render Device","Omeka Legacy File:Render Details","Omeka Legacy File:Capture Date","Omeka Legacy File:Capture Device","Omeka Legacy File:Capture Details","Omeka Legacy File:Change History","Omeka Legacy File:Watermark","Omeka Legacy File:Encryption","Omeka Legacy File:Compression","Omeka Legacy File:Post Processing","Omeka Image File:Width","Omeka Image File:Height","Omeka Image File:Bit Depth","Omeka Image File:Channels","Omeka Image File:Exif String","Omeka Image File:Exif Array","Omeka Image File:IPTC String","Omeka Image File:IPTC Array","Omeka Video File:Bitrate","Omeka Video File:Duration","Omeka Video File:Sample Rate","Omeka Video File:Codec","Omeka Video File:Width","Omeka Video File:Height",tags,file,itemType,collection,public,featured
9823,https://www.iowaheritage.org/items/show/9823,"""Queen and two attendants chosen at the Kappa Alpha Psi dance,"" May 9, 1948","Students|African Americans|Morris, Arlene Roberts|1940-1950|Parties|Bailey, Roberta Jean|Smith, Yvonne",,unknown,,"Daily Iowan (Iowa City, Iowa)|University of Iowa. Libraries. University Archives",1948-05-09|2007-10-03,,"Educational use only, no other permissions given. U.S. and international copyright laws may protect this digital object. Commercial use or distribution of the object is not permitted without prior permission of the copyright holder.","African American Women in Iowa Digital Collection; African American Women Students at the University of Iowa, 1910-1960|http://digital.lib.uiowa.edu/aaws/|Organizations and Clubs Vertical Files|http://lib.uiowa.edu/collguides/?RG01.0015.04|Kappa Alpha Psi",jpeg,,"Still image; Text|Clippings (Information artifacts)",RG01.15.04|RobertsMorris001.jpg|166295411|https://digital.lib.uiowa.edu/,,,,,,,,,,,,,,,,,,,,,,,,,,,,,,,,,,,,,,,,,,,,,,,,"<a href=""https://digital.lib.uiowa.edu/"" target=""_blank"">View this item in its source respository</a>",,,,,,,,,,,,,,,,,,,,,,,,,,,,,https://www.iowaheritage.org/files/original/df52dd6fcc6dbde924f5f90b3710de6f.jpg,"Remote Item","African American Women in Iowa Collection",1,0
9808,https://www.iowaheritage.org/items/show/9808,"""Queen of the campus,"" December 12, 1955","Beauty contests|African Americans|Berry, Dora Martin|1950-1960|Students",,unknown,,"Star (London, England)|University of Iowa. Libraries. University Archives",1955-12-12|2007-10-02,,"Educational use only, no other permissions given. U.S. and international copyright laws may protect this digital object. Commercial use or distribution of the object is not permitted without prior permission of the copyright holder.","African American Women in Iowa Digital Collection; African American Women Students at the University of Iowa, 1910-1960|http://digital.lib.uiowa.edu/aaws/|Alumni and Former Students Vertical Files|http://lib.uiowa.edu/collguides/?RG01.0015.01|Martin, Dora",jpeg,,"Text; Still image|Clippings (Information artifacts)",RG01.15.01|MartinBerry011.jpg|166295411|https://digital.lib.uiowa.edu/,,,,,,,,,,,,,,,,,,,,,,,,,,,,,,,,,,,,,,,,,,,,,,,,"<a href=""https://digital.lib.uiowa.edu/"" target=""_blank"">View this item in its source respository</a>",,,,,,,,,,,,,,,,,,,,,,,,,,,,,https://www.iowaheritage.org/files/original/a8509e2ab811cb58a1930d907d1b25a8.jpg,"Remote Item","African American Women in Iowa Collection",1,0
9824,https://www.iowaheritage.org/items/show/9824,"""Queen of the campus,"" February 4, 1956","Beauty contests|African Americans|Berry, Dora Martin|1950-1960|Students",,"Dmitri, Ivan",,"Saturday evening post|University of Iowa. Libraries. University Archives",1956-02-04|2007-10-04,,"Educational use only, no other permissions given. U.S. and international copyright laws may protect this digital object. Commercial use or distribution of the object is not permitted without prior permission of the copyright holder.","African American Women in Iowa Digital Collection; African American Women Students at the University of Iowa, 1910-1960|http://digital.lib.uiowa.edu/aaws/|Alumni and Former Students Vertical Files|http://lib.uiowa.edu/collguides/?RG01.0015.01|Martin, Dora",jpeg,,"Still image; Text|Clippings (Information artifacts)",RG01.15.01|166295411|https://digital.lib.uiowa.edu/,,,,,,,,,,,,,,,,,,,,,,,,,,,,,,,,,,,,,,,,,,,,,,,,"<a href=""https://digital.lib.uiowa.edu/"" target=""_blank"">View this item in its source respository</a>",,,,,,,,,,,,,,,,,,,,,,,,,,,,,https://www.iowaheritage.org/files/original/aec57d17c9479288adfec2f54a2d7024.jpg,"Remote Item","African American Women in Iowa Collection",1,0
16284,https://www.iowaheritage.org/items/show/16284,"""Realistic representation"" written by Drewelowe, 1924",Art|1920-1930|Artists|Exhibitions,,"Drewelowe, Eve, 1899-1988",,"University of Iowa. Libraries. Iowa Women's Archives",1924|2009-08-11,,"Educational use only, no other permissions given. U.S. and international copyright laws may protect this item. Commercial use or distribution of this digital object is not permitted without written permission of the Iowa Women's Archives and the School of Art and Art History, University of Iowa.","Eve Drewelowe Digital Collection|Eve Drewelowe papers, 1924-1995|http://lib.uiowa.edu/collguides/?IWA0135|Manuscripts|Writing -- ""Realistic Representation""",jpeg,,Text|Essays,IWA035|04|drewe04-08|https://digital.lib.uiowa.edu/,,,,,,,,,,,,,,,,,,,,,,,,,,,,,,,,,,,,,,,,,,,,,,,,"<a href=""https://digital.lib.uiowa.edu/"" target=""_blank"">View this item in its source respository</a>",,,,,,,,,,,,,,,,,,,,,,,,,,,,,https://www.iowaheritage.org/files/original/268ca6fd8e4b5565b40cea70711875e8.jpg,"Remote Item","Eve Drewelowe Digital Collection",1,0
28639,https://www.iowaheritage.org/items/show/28639,"""Report to Judy,"" Movie tells what WAVES are doing|Messenger (Fort Dodge, Iowa)|Women's military activity","Women|United States. Naval Reserve. Women's Reserve|United States. Naval Reserve. Women's Reserve|United States -- Iowa -- Webster County -- Fort Dodge|1940-1950|World War II|World War, 1939-1945 -- Participation, Female|Women soldiers -- Iowa",,,,"State Historical Society of Iowa, Iowa City",1944-09-27,,"This digital image may be used for educational purposes, as long as it is not altered in any way.  No commercial reproduction or distribution of this file is permitted without written permission of the State Historical Society of Iowa","World War II Iowa press clippings","Jpeg|image/jpeg|1 clipping : b&w ; 13 x 5 cm",eng,"Clippings; Text|Text|Clippings (Information Artifacts)",1944-09-27-01.jpg|https://digital.lib.uiowa.edu/,,,,,,,,,,,,,,,,,,,,,,,,,,,,,,,,,,,,,,,,,,,,,,,,"<a href=""https://digital.lib.uiowa.edu/"" target=""_blank"">View this item in its source respository</a>",,,,,,,,,,,,,,,,,,,,,,,,,,,,,https://www.iowaheritage.org/files/original/73ce6e83d087fd161ec258ab969fff10.jpg,"Remote Item","World War II Iowa Press Clippings",1,0
28588,https://www.iowaheritage.org/items/show/28588,"""Report to Judy"" is special at King|News (Albia, Iowa)|Women's military activity","United States. Naval Reserve. Women's Reserve|United States -- Iowa -- Monroe County -- Albia|1940-1950|World War II|World War, 1939-1945 -- Participation, Female|Women soldiers -- Iowa",,,,"State Historical Society of Iowa, Iowa City",1944-09-18,,"This digital image may be used for educational purposes, as long as it is not altered in any way.  No commercial reproduction or distribution of this file is permitted without written permission of the State Historical Society of Iowa","World War II Iowa press clippings","Jpeg|image/jpeg|1 clipping : b&w ; 7 x 5 cm",eng,"Clippings; Text|Text|Clippings (Information Artifacts)",1944-09-18-02.jpg|https://digital.lib.uiowa.edu/,,,,,,,,,,,,,,,,,,,,,,,,,,,,,,,,,,,,,,,,,,,,,,,,"<a href=""https://digital.lib.uiowa.edu/"" target=""_blank"">View this item in its source respository</a>",,,,,,,,,,,,,,,,,,,,,,,,,,,,,https://www.iowaheritage.org/files/original/eccdd12b47724911564a7312120d2b27.jpg,"Remote Item","World War II Iowa Press Clippings",1,0
9791,https://www.iowaheritage.org/items/show/9791,"""Retired librarian could write book about life, career,"" December 23, 1996","Librarians|African Americans|Walls, Esther J., 1926-|United States -- Iowa -- Mason City|1990-2000|Activists|Travel",,"Buehner, Kristin",,"Globe-gazette (Mason City, Iowa)|University of Iowa. Iowa Women's Archives",1996-12-23|2007-09-12,,"Educational use only, no other permissions given. U.S. and international copyright laws may protect this item. Commercial use or distribution of this digital object is not permitted without written permission of the Iowa Women's Archives.","African American Women in Iowa Digital Collection|Esther J. Walls papers, 1860s-1996|http://www.lib.uiowa.edu/collguides/?IWA0288|http://www.lib.uiowa.edu/iwa/Topical_holdings_lists/AAhold.html",jpeg,,"Still image; Text|Clippings (Information artifacts); Photocopies; Photographs",IWA0288|walls00364|166295411|https://digital.lib.uiowa.edu/,,,,,,,,,,,,,,,,,,,,,,,,,,,,,,,,,,,,,,,,,,,,,,,,"<a href=""https://digital.lib.uiowa.edu/"" target=""_blank"">View this item in its source respository</a>",,,,,,,,,,,,,,,,,,,,,,,,,,,,,https://www.iowaheritage.org/files/original/97d2f47374284b4d92c486fc511fe42a.jpg,"Remote Item","African American Women in Iowa Collection",1,0
68583,https://www.iowaheritage.org/items/show/68583,"""Reward of merit,"" 1910s","Flowers|Pansies|Schlopp, Beulah|Mason, Flora|United States -- Iowa -- Sioux Rapids|1910-1920",,unknown,,"University of Iowa. Libraries. Iowa Women's Archives",1910/1919|2007-07-10,,"Material in the public domain. No restrictions on use.","Noble Photographs|Noble Photograph collection|http://www.lib.uiowa.edu/collguides/?IWA0031",14|9,,"Still image; Text|Picture postcards|jpeg",IWA0031|160192410|http://digital.lib.uiowa.edu/cdm/ref/collection/noble/id/1344,,,,,,,,,,,,,,,,,,,,,,,,,,,,,,,,,,,,,,,,,,,,,,,,"<a href=""http://digital.lib.uiowa.edu/cdm/ref/collection/noble/id/1344"" target=""_blank"">View this item in its source respository</a>",,,,,,,,,,,,,,,,,,,,,,,,,,,,,https://www.iowaheritage.org/files/original/33c87e72b925dad55603b1cf7e7ab5d7.jpg,"Remote Item","Mary Noble Historical Photograph Collection",1,0
9812,https://www.iowaheritage.org/items/show/9812,"""S.U.I. queen vote accents tolerance,"" December 14, 1955","Beauty contests|African Americans|Berry, Dora Martin|1950-1960|Race relations|Students",,unknown,,"Tribune-journal (Sioux City, Iowa)|University of Iowa. Libraries. University Archives",1955-12-14|2007-10-03,,"Educational use only, no other permissions given. U.S. and international copyright laws may protect this digital object. Commercial use or distribution of the object is not permitted without prior permission of the copyright holder.","African American Women in Iowa Digital Collection; African American Women Students at the University of Iowa, 1910-1960|http://digital.lib.uiowa.edu/aaws/|Alumni and Former Students Vertical Files|http://lib.uiowa.edu/collguides/?RG01.0015.01|Martin, Dora",jpeg,,"Text|Clippings (Information artifacts)",RG01.15.01|MartinBerry016.jpg|166295411|https://digital.lib.uiowa.edu/,,,,,,,,,,,,,,,,,,,,,,,,,,,,,,,,,,,,,,,,,,,,,,,,"<a href=""https://digital.lib.uiowa.edu/"" target=""_blank"">View this item in its source respository</a>",,,,,,,,,,,,,,,,,,,,,,,,,,,,,https://www.iowaheritage.org/files/original/9b3d056c60acabb46405b34c12e03321.jpg,"Remote Item","African American Women in Iowa Collection",1,0
68507,https://www.iowaheritage.org/items/show/68507,"""Simple (office) life,"" September 9, 1907","Women|Men|Office workers|Jacobs, Hattie|Creighton, M. C.|United States -- Iowa -- Madrid|1900-1910",,unknown,,"Souvenir Post Card Co.|University of Iowa. Libraries. Iowa Women's Archives",1907-09-09|2007-07-10,,"Material in the public domain. No restrictions on use.","Noble Photographs|Noble Photograph collection|http://www.lib.uiowa.edu/collguides/?IWA0031",9|14,,"Still image; Text|Picture postcards; Correspondence|jpeg",IWA0031|160192410|http://digital.lib.uiowa.edu/cdm/ref/collection/noble/id/1185,,,,,,,,,,,,,,,,,,,,,,,,,,,,,,,,,,,,,,,,,,,,,,,,"<a href=""http://digital.lib.uiowa.edu/cdm/ref/collection/noble/id/1185"" target=""_blank"">View this item in its source respository</a>",,,,,,,,,,,,,,,,,,,,,,,,,,,,,https://www.iowaheritage.org/files/original/d7fb3af24fa27f657ce3a6315435b125.jpg,"Remote Item","Mary Noble Historical Photograph Collection",1,0
