 




﻿"Item Id","Item URI","Dublin Core:Title","Dublin Core:Subject","Dublin Core:Description","Dublin Core:Creator","Dublin Core:Source","Dublin Core:Publisher","Dublin Core:Date","Dublin Core:Contributor","Dublin Core:Rights","Dublin Core:Relation","Dublin Core:Format","Dublin Core:Language","Dublin Core:Type","Dublin Core:Identifier","Dublin Core:Coverage","Item Type Metadata:Text","Item Type Metadata:Interviewer","Item Type Metadata:Interviewee","Item Type Metadata:Location","Item Type Metadata:Transcription","Item Type Metadata:Local URL","Item Type Metadata:Original Format","Item Type Metadata:Physical Dimensions","Item Type Metadata:Duration","Item Type Metadata:Compression","Item Type Metadata:Producer","Item Type Metadata:Director","Item Type Metadata:Bit Rate/Frequency","Item Type Metadata:Time Summary","Item Type Metadata:Email Body","Item Type Metadata:Subject Line","Item Type Metadata:From","Item Type Metadata:To","Item Type Metadata:CC","Item Type Metadata:BCC","Item Type Metadata:Number of Attachments","Item Type Metadata:Standards","Item Type Metadata:Objectives","Item Type Metadata:Materials","Item Type Metadata:Lesson Plan Text","Item Type Metadata:URL","Item Type Metadata:Event Type","Item Type Metadata:Participants","Item Type Metadata:Birth Date","Item Type Metadata:Birthplace","Item Type Metadata:Death Date","Item Type Metadata:Occupation","Item Type Metadata:Biographical Text","Item Type Metadata:Bibliography","Item Type Metadata:Digital Reproduction Information","Item Type Metadata:Repository","Item Type Metadata:Repository Collection","Item Type Metadata:Contact information.","Item Type Metadata:File Name","Item Type Metadata:Notes","Item Type Metadata:Digital item created","Item Type Metadata:Digital item modified","Item Type Metadata:Executive Orders","Item Type Metadata:Record Created","Item Type Metadata:Record Modified","Item Type Metadata:Transcription2","Item Type Metadata:Source URL","Omeka Legacy File:Additional Creator","Omeka Legacy File:Transcriber","Omeka Legacy File:Producer","Omeka Legacy File:Render Device","Omeka Legacy File:Render Details","Omeka Legacy File:Capture Date","Omeka Legacy File:Capture Device","Omeka Legacy File:Capture Details","Omeka Legacy File:Change History","Omeka Legacy File:Watermark","Omeka Legacy File:Encryption","Omeka Legacy File:Compression","Omeka Legacy File:Post Processing","Omeka Image File:Width","Omeka Image File:Height","Omeka Image File:Bit Depth","Omeka Image File:Channels","Omeka Image File:Exif String","Omeka Image File:Exif Array","Omeka Image File:IPTC String","Omeka Image File:IPTC Array","Omeka Video File:Bitrate","Omeka Video File:Duration","Omeka Video File:Sample Rate","Omeka Video File:Codec","Omeka Video File:Width","Omeka Video File:Height",tags,file,itemType,collection,public,featured
16944,https://www.iowaheritage.org/items/show/16944,"Henry Wallace and other officials crossing bridge, China, 1944","Bridges|Chinese|Wallace, Henry A. (Henry Agard), 1888-1965|China|1940-1950|Vice presidents|Rivers|Government officials|Americans",,unidentified,,"University of Iowa. Libraries. Special Collections Dept.",1944|2004-08-27,,"Educational use only, no other permissions given. U.S. and international copyright laws may protect this item. Commercial use or distribution of this digital object is not permitted without written permission of the University of Iowa Special Collections Dept.","Henry A. Wallace Collection|Henry Agard Wallace papers|http://lib.uiowa.edu/collguides/?MSC0177|Photographs & images|Scanned with Ricoh 3228C scanner at 600 ppi. Archival tiff available.",jpeg,,"Still image|Photographs",MSC0177|1|wal73cd-38.jpg|https://digital.lib.uiowa.edu/,,,,,,,,,,,,,,,,,,,,,,,,,,,,,,,,,,,,,,,,,,,,,,,,"<a href=""https://digital.lib.uiowa.edu/"" target=""_blank"">View this item in its source respository</a>",,,,,,,,,,,,,,,,,,,,,,,,,,,,,https://www.iowaheritage.org/files/original/e7ddbe98d80f292940c6483966d32609.jpg,"Remote Item","Henry A. Wallace Collection",1,0
16926,https://www.iowaheritage.org/items/show/16926,"Waterwheel, China, 1944",Waterwheels|China|1940-1950|Rivers,,unidentified,,"University of Iowa. Libraries. Special Collections Dept.",1944|2004-08-27,,"Educational use only, no other permissions given. U.S. and international copyright laws may protect this item. Commercial use or distribution of this digital object is not permitted without written permission of the University of Iowa Special Collections Dept.","Henry A. Wallace Collection|Henry Agard Wallace papers|http://lib.uiowa.edu/collguides/?MSC0177|Photographs & images|Scanned with Ricoh 3228C scanner at 600 ppi. Archival tiff available.",jpeg,,"Still image|Photographs",MSC0177|1|wal73cd-29.jpg|https://digital.lib.uiowa.edu/,,,,,,,,,,,,,,,,,,,,,,,,,,,,,,,,,,,,,,,,,,,,,,,,"<a href=""https://digital.lib.uiowa.edu/"" target=""_blank"">View this item in its source respository</a>",,,,,,,,,,,,,,,,,,,,,,,,,,,,,https://www.iowaheritage.org/files/original/ee474428579addf711eece78125a5800.jpg,"Remote Item","Henry A. Wallace Collection",1,0
16922,https://www.iowaheritage.org/items/show/16922,"River, China, 1944",Rivers|China|1940-1950|Hills|Trees,,unidentified,,"University of Iowa. Libraries. Special Collections Dept.",1944|2004-08-27,,"Educational use only, no other permissions given. U.S. and international copyright laws may protect this item. Commercial use or distribution of this digital object is not permitted without written permission of the University of Iowa Special Collections Dept.","Henry A. Wallace Collection|Henry Agard Wallace papers|http://lib.uiowa.edu/collguides/?MSC0177|Photographs & images|Scanned with Ricoh 3228C scanner at 600 ppi. Archival tiff available.",jpeg,,"Still image|Photographs",MSC0177|1|wal73cd-27.jpg|https://digital.lib.uiowa.edu/,,,,,,,,,,,,,,,,,,,,,,,,,,,,,,,,,,,,,,,,,,,,,,,,"<a href=""https://digital.lib.uiowa.edu/"" target=""_blank"">View this item in its source respository</a>",,,,,,,,,,,,,,,,,,,,,,,,,,,,,https://www.iowaheritage.org/files/original/5a229947feca747c0f150f081f24f64b.jpg,"Remote Item","Henry A. Wallace Collection",1,0
16891,https://www.iowaheritage.org/items/show/16891,"Bridge, China, 1944",Bridges|China|1940-1950|Rivers,,unidentified,,"University of Iowa. Libraries. Special Collections Dept.",1944|2004-08-27,,"Educational use only, no other permissions given. U.S. and international copyright laws may protect this item. Commercial use or distribution of this digital object is not permitted without written permission of the University of Iowa Special Collections Dept.","Henry A. Wallace Collection|Henry Agard Wallace papers|http://lib.uiowa.edu/collguides/?MSC0177|Photographs & images|Scanned with Ricoh 3228C scanner at 600 ppi. Archival tiff available.",jpeg,,"Still image|Photographs",MSC0177|1|wal73cd-12.jpg|https://digital.lib.uiowa.edu/,,,,,,,,,,,,,,,,,,,,,,,,,,,,,,,,,,,,,,,,,,,,,,,,"<a href=""https://digital.lib.uiowa.edu/"" target=""_blank"">View this item in its source respository</a>",,,,,,,,,,,,,,,,,,,,,,,,,,,,,https://www.iowaheritage.org/files/original/05744298597fe20ff2316654a7c02180.jpg,"Remote Item","Henry A. Wallace Collection",1,0
16825,https://www.iowaheritage.org/items/show/16825,"Covered bridge, China, 1944",Bridges|China|1940-1950|Rivers,,unidentified,,"University of Iowa. Libraries. Special Collections Dept.",1944|2009-02-20,,"Educational use only, no other permissions given. U.S. and international copyright laws may protect this item. Commercial use or distribution of this digital object is not permitted without written permission of the University of Iowa Special Collections Dept.","Henry A. Wallace Collection|Henry Agard Wallace papers|http://lib.uiowa.edu/collguides/?MSC0177|Photographs & images|China-Siberia Trip, 1944|Scanned with Ricoh 3228C scanner at 600 ppi. Archival tiff available.",jpeg,,"Still image|Photographs",MSC0177|7|131|wal73-131.jpg|https://digital.lib.uiowa.edu/,,,,,,,,,,,,,,,,,,,,,,,,,,,,,,,,,,,,,,,,,,,,,,,,"<a href=""https://digital.lib.uiowa.edu/"" target=""_blank"">View this item in its source respository</a>",,,,,,,,,,,,,,,,,,,,,,,,,,,,,https://www.iowaheritage.org/files/original/92a8fb4c62d34fde184c676f7b7b9f1e.jpg,"Remote Item","Henry A. Wallace Collection",1,0
16633,https://www.iowaheritage.org/items/show/16633,"Water wheel, China, 1944",Rivers|China|1940-1950|Waterwheels,"For irrigation.",unidentified,,"University of Iowa. Libraries. Special Collections Dept.",1944|2009-02-18,,"Educational use only, no other permissions given. U.S. and international copyright laws may protect this item. Commercial use or distribution of this digital object is not permitted without written permission of the University of Iowa Special Collections Dept.","Henry A. Wallace Collection|Henry Agard Wallace papers|http://lib.uiowa.edu/collguides/?MSC0177|Photographs & images|China-Siberia Trip, 1944|Scanned with Ricoh 3228C scanner at 600 ppi. Archival tiff available.",jpeg,,"Still image|Photographs",MSC0177|7|32|wal73-032.jpg|https://digital.lib.uiowa.edu/,,,,,,,,,,,,,,,,,,,,,,,,,,,,,,,,,,,,,,,,,,,,,,,,"<a href=""https://digital.lib.uiowa.edu/"" target=""_blank"">View this item in its source respository</a>",,,,,,,,,,,,,,,,,,,,,,,,,,,,,https://www.iowaheritage.org/files/original/3720e5e120f4bb0f848653110908cade.jpg,"Remote Item","Henry A. Wallace Collection",1,0
16623,https://www.iowaheritage.org/items/show/16623,"River, China, 1944",Rivers|China|1940-1950,"River from airplane.",unidentified,,"University of Iowa. Libraries. Special Collections Dept.",1944|2009-02-18,,"Educational use only, no other permissions given. U.S. and international copyright laws may protect this item. Commercial use or distribution of this digital object is not permitted without written permission of the University of Iowa Special Collections Dept.","Henry A. Wallace Collection|Henry Agard Wallace papers|http://lib.uiowa.edu/collguides/?MSC0177|Photographs & images|China-Siberia Trip, 1944|Scanned with Ricoh 3228C scanner at 600 ppi. Archival tiff available.",jpeg,,"Still image|Photographs",MSC0177|7|27|wal73-027.jpg|https://digital.lib.uiowa.edu/,,,,,,,,,,,,,,,,,,,,,,,,,,,,,,,,,,,,,,,,,,,,,,,,"<a href=""https://digital.lib.uiowa.edu/"" target=""_blank"">View this item in its source respository</a>",,,,,,,,,,,,,,,,,,,,,,,,,,,,,https://www.iowaheritage.org/files/original/2adc8ba0ef059aec6abf44f918b2a7df.jpg,"Remote Item","Henry A. Wallace Collection",1,0
16621,https://www.iowaheritage.org/items/show/16621,"River, China, 1944",Rivers|China|1940-1950|Hills,,unidentified,,"University of Iowa. Libraries. Special Collections Dept.",1944|2009-02-18,,"Educational use only, no other permissions given. U.S. and international copyright laws may protect this item. Commercial use or distribution of this digital object is not permitted without written permission of the University of Iowa Special Collections Dept.","Henry A. Wallace Collection|Henry Agard Wallace papers|http://lib.uiowa.edu/collguides/?MSC0177|Photographs & images|China-Siberia Trip, 1944|Scanned with Ricoh 3228C scanner at 600 ppi. Archival tiff available.",jpeg,,"Still image|Photographs",MSC0177|7|25|wal73-025.jpg|https://digital.lib.uiowa.edu/,,,,,,,,,,,,,,,,,,,,,,,,,,,,,,,,,,,,,,,,,,,,,,,,"<a href=""https://digital.lib.uiowa.edu/"" target=""_blank"">View this item in its source respository</a>",,,,,,,,,,,,,,,,,,,,,,,,,,,,,https://www.iowaheritage.org/files/original/f3a7ddc25c1fbbc3fe7001bb480c6a48.jpg,"Remote Item","Henry A. Wallace Collection",1,0
16609,https://www.iowaheritage.org/items/show/16609,"Temple bridge near Xinglong Mountain, 1944","Bridges|China|1940-1950|Temples|Rivers|China -- Xinglong Shan",,unidentified,,"University of Iowa. Libraries. Special Collections Dept.",1944|2009-02-18,,"Educational use only, no other permissions given. U.S. and international copyright laws may protect this item. Commercial use or distribution of this digital object is not permitted without written permission of the University of Iowa Special Collections Dept.","Henry A. Wallace Collection|Henry Agard Wallace papers|http://lib.uiowa.edu/collguides/?MSC0177|Photographs & images|China-Siberia Trip, 1944|Scanned with Ricoh 3228C scanner at 600 ppi. Archival tiff available.",jpeg,,"Still image|Photographs",MSC0177|7|18|wal73-018.jpg|https://digital.lib.uiowa.edu/,,,,,,,,,,,,,,,,,,,,,,,,,,,,,,,,,,,,,,,,,,,,,,,,"<a href=""https://digital.lib.uiowa.edu/"" target=""_blank"">View this item in its source respository</a>",,,,,,,,,,,,,,,,,,,,,,,,,,,,,https://www.iowaheritage.org/files/original/5a722a68a58337aa76b6698e249074bd.jpg,"Remote Item","Henry A. Wallace Collection",1,0
16357,https://www.iowaheritage.org/items/show/16357,"Travel writings by Drewelowe, 1920s","Religion & politics|Cunard White Star, ltd.|Japan|1920-1930|Travel|Boats|History|Rivers|Singapore|France -- Boulogne-sur-Mer|Netherlands -- Amsterdam|India|Italy|China|Italy -- Venice|Germany|Russia|Mexico|France -- Paris|England -- London|Burma",,"Drewelowe, Eve, 1899-1988",,"University of Iowa. Libraries. Iowa Women's Archives",192-|2009-08-11,,"Educational use only, no other permissions given. U.S. and international copyright laws may protect this item. Commercial use or distribution of this digital object is not permitted without written permission of the Iowa Women's Archives and the School of Art and Art History, University of Iowa.","Eve Drewelowe Digital Collection|Eve Drewelowe papers, 1924-1995|http://lib.uiowa.edu/collguides/?IWA0135|Travel journals and writings|Travel writings",jpeg,,"Text|Histories; Travel literature; Diaries",IWA035|07|drewe07-05|https://digital.lib.uiowa.edu/,,,,,,,,,,,,,,,,,,,,,,,,,,,,,,,,,,,,,,,,,,,,,,,,"<a href=""https://digital.lib.uiowa.edu/"" target=""_blank"">View this item in its source respository</a>",,,,,,,,,,,,,,,,,,,,,,,,,,,,,https://www.iowaheritage.org/files/original/8f2b52010f59548276bab3ca05169aca.jpg,"Remote Item","Eve Drewelowe Digital Collection",1,0
