 




﻿"Item Id","Item URI","Dublin Core:Title","Dublin Core:Subject","Dublin Core:Description","Dublin Core:Creator","Dublin Core:Source","Dublin Core:Publisher","Dublin Core:Date","Dublin Core:Contributor","Dublin Core:Rights","Dublin Core:Relation","Dublin Core:Format","Dublin Core:Language","Dublin Core:Type","Dublin Core:Identifier","Dublin Core:Coverage","Item Type Metadata:Text","Item Type Metadata:Interviewer","Item Type Metadata:Interviewee","Item Type Metadata:Location","Item Type Metadata:Transcription","Item Type Metadata:Local URL","Item Type Metadata:Original Format","Item Type Metadata:Physical Dimensions","Item Type Metadata:Duration","Item Type Metadata:Compression","Item Type Metadata:Producer","Item Type Metadata:Director","Item Type Metadata:Bit Rate/Frequency","Item Type Metadata:Time Summary","Item Type Metadata:Email Body","Item Type Metadata:Subject Line","Item Type Metadata:From","Item Type Metadata:To","Item Type Metadata:CC","Item Type Metadata:BCC","Item Type Metadata:Number of Attachments","Item Type Metadata:Standards","Item Type Metadata:Objectives","Item Type Metadata:Materials","Item Type Metadata:Lesson Plan Text","Item Type Metadata:URL","Item Type Metadata:Event Type","Item Type Metadata:Participants","Item Type Metadata:Birth Date","Item Type Metadata:Birthplace","Item Type Metadata:Death Date","Item Type Metadata:Occupation","Item Type Metadata:Biographical Text","Item Type Metadata:Bibliography","Item Type Metadata:Digital Reproduction Information","Item Type Metadata:Repository","Item Type Metadata:Repository Collection","Item Type Metadata:Contact information.","Item Type Metadata:File Name","Item Type Metadata:Notes","Item Type Metadata:Digital item created","Item Type Metadata:Digital item modified","Item Type Metadata:Executive Orders","Item Type Metadata:Record Created","Item Type Metadata:Record Modified","Item Type Metadata:Transcription2","Item Type Metadata:Source URL","Omeka Legacy File:Additional Creator","Omeka Legacy File:Transcriber","Omeka Legacy File:Producer","Omeka Legacy File:Render Device","Omeka Legacy File:Render Details","Omeka Legacy File:Capture Date","Omeka Legacy File:Capture Device","Omeka Legacy File:Capture Details","Omeka Legacy File:Change History","Omeka Legacy File:Watermark","Omeka Legacy File:Encryption","Omeka Legacy File:Compression","Omeka Legacy File:Post Processing","Omeka Image File:Width","Omeka Image File:Height","Omeka Image File:Bit Depth","Omeka Image File:Channels","Omeka Image File:Exif String","Omeka Image File:Exif Array","Omeka Image File:IPTC String","Omeka Image File:IPTC Array","Omeka Video File:Bitrate","Omeka Video File:Duration","Omeka Video File:Sample Rate","Omeka Video File:Codec","Omeka Video File:Width","Omeka Video File:Height",tags,file,itemType,collection,public,featured
97521,https://www.iowaheritage.org/items/show/97521,"Annual Report, 1967","Annual Report - Cedar County Soil and Water Conservation District ","District published annual report includes Cedar SWCD district activities, financial report, photographs, and names of commissioners and staff.","Cedar County Soil and Water Conservation District ",,"State Library of Iowa",1967,"Cedar County Soil and Water Conservation District of Iowa. For questions about copyright, contact the State Library of Iowa at  <a href=""http://www.statelibraryofiowa.org"">http://www.statelibraryofiowa.org</a>.","This item is protected by copyright and/or related rights. Your are free to use this Item in any way that is permitted by the copyright and related rights legislation that applies to your use. For other uses you need to obtain permission from the rights-holder(s). <a href=""http://rightsstatements.org/"">http://rightsstatements.org</a>",,pdf,eng,"Text; Document ",,,,,,,,,,,,,,,,,,,,,,,,,,,,,,,,,,,,,,,,,Cedar_Co_Annual_Report_1967_20191202_001,,,,,,,,,,,,,,,,,,,,,,,,,,,,,,,,,,,,"Annual Report,Cedar County Soil and Water Conservation District,Clarence Beyer,Erosion,Financial Report,Frank Farm,Glenn Pederson,Grass Waterway,Keith Lilienthal,Kenneth Muller,Milo Ahrens,Pearson Farm,Ray Crock,Ray Lilienthal,Ray Pederson,Walter Rismiller,Willard Eiler",https://www.iowaheritage.org/files/original/7e63983e6ac5e859d38f7206fc1395a2.pdf,Document,"Cedar County Soil and Water Conservation District Historic Collection ",1,0
97522,https://www.iowaheritage.org/items/show/97522,"Annual Report, 1968","Annual Report - Cedar County Soil and Water Conservation District ","District published annual report includes Cedar SWCD district activities, financial report, photograph, and names of commissioners and staff.","Cedar County Soil and Water Conservation District ",,"State Library of Iowa",1968,"Cedar County Soil and Water Conservation District of Iowa. For questions about copyright, contact the State Library of Iowa at  <a href=""http://www.statelibraryofiowa.org"">http://www.statelibraryofiowa.org</a>.","This item is protected by copyright and/or related rights. Your are free to use this Item in any way that is permitted by the copyright and related rights legislation that applies to your use. For other uses you need to obtain permission from the rights-holder(s). <a href=""http://rightsstatements.org/"">http://rightsstatements.org</a>",,pdf,eng,"Text; Document ",,,,,,,,,,,,,,,,,,,,,,,,,,,,,,,,,,,,,,,,,Cedar_Co_Annual_Report_1968_20191202_001,,,,,,,,,,,,,,,,,,,,,,,,,,,,,,,,,,,,"Annual Report,Bill Driscoll,Cedar County Soil and Water Conservation District,Clarence Beyer,Don Williams,Financial Report,Kenneth Muller,Lafe Hudachek,Lawerence Kleppe,Richard Zenishek,Strip Cropping,Wilbur Colby",https://www.iowaheritage.org/files/original/98960a36a6135c6679c7a92a94ff1ab5.pdf,Document,"Cedar County Soil and Water Conservation District Historic Collection ",1,0
97523,https://www.iowaheritage.org/items/show/97523,"Annual Report, 1969","Annual Report - Cedar County Soil and Water Conservation District ","District published annual report includes Cedar SWCD district activities, financial report, photographs, and names of commissioners and staff.","Cedar County Soil and Water Conservation District ",,"State Library of Iowa",1969,"Cedar County Soil and Water Conservation District of Iowa. For questions about copyright, contact the State Library of Iowa at  <a href=""http://www.statelibraryofiowa.org"">http://www.statelibraryofiowa.org</a>.","This item is protected by copyright and/or related rights. Your are free to use this Item in any way that is permitted by the copyright and related rights legislation that applies to your use. For other uses you need to obtain permission from the rights-holder(s). <a href=""http://rightsstatements.org/"">http://rightsstatements.org</a>",,pdf,eng,"Text; Document ",,,,,,,,,,,,,,,,,,,,,,,,,,,,,,,,,,,,,,,,,Cedar_Co_Annual_Report_1969_20191202_001,,,,,,,,,,,,,,,,,,,,,,,,,,,,,,,,,,,,"Annual Report,Bob Gregory,Cedar County Soil and Water Conservation District,Clare Nebergall,Don Walters,Don Williams,Everett Crees,Everett Von Muenster,Fairport Fish Hatchery,Financial Report,Fred Kaufman,Harold Eiler,John Meixner,Lawrence Kleppe,Paul Hegarty,Windbreak",https://www.iowaheritage.org/files/original/2ab408446890506f261a9c94d0cc92ea.pdf,Document,"Cedar County Soil and Water Conservation District Historic Collection ",1,0
97524,https://www.iowaheritage.org/items/show/97524,"Annual Report, 1959","Annual Report - Cedar County Soil and Water Conservation District ","District published annual report includes Cedar SWCD district activities, financial report, and names of commissioners and staff.","Cedar County Soil and Water Conservation District ",,"State Library of Iowa",1959,"Cedar County Soil and Water Conservation District of Iowa. For questions about copyright, contact the State Library of Iowa at  <a href=""http://www.statelibraryofiowa.org"">http://www.statelibraryofiowa.org</a>.","This item is protected by copyright and/or related rights. Your are free to use this Item in any way that is permitted by the copyright and related rights legislation that applies to your use. For other uses you need to obtain permission from the rights-holder(s). <a href=""http://rightsstatements.org/"">http://rightsstatements.org</a>",,pdf,eng,"Text; Document ",,,,,,,,,,,,,,,,,,,,,,,,,,,,,,,,,,,,,,,,,Cedar_Co_Annual_Report_1959_,,,,,,,,,,,,,,,,,,,,,,,,,,,,,,,,,,,,"Annual Report,Cedar County Soil and Water Conservation District,Financial Report,Harold Oldorf,Milo Ahrens,Paul Hain,Wm. Wertzbaugher",https://www.iowaheritage.org/files/original/abc92288e2fdfa0fd1d0180b548f8638.pdf,Document,"Cedar County Soil and Water Conservation District Historic Collection ",1,0
97525,https://www.iowaheritage.org/items/show/97525,"Annual Report, 1970","Annual Report - Cedar County Soil and Water Conservation District ","District published annual report includes Cedar SWCD district activities, financial report, and names of commissioners and staff.","Cedar County Soil and Water Conservation District ",,"State Library of Iowa",1970,"Cedar County Soil and Water Conservation District of Iowa. For questions about copyright, contact the State Library of Iowa at  <a href=""http://www.statelibraryofiowa.org"">http://www.statelibraryofiowa.org</a>.","This item is protected by copyright and/or related rights. Your are free to use this Item in any way that is permitted by the copyright and related rights legislation that applies to your use. For other uses you need to obtain permission from the rights-holder(s). <a href=""http://rightsstatements.org/"">http://rightsstatements.org</a>",,pdf,eng,"Text; Document ",,,,,,,,,,,,,,,,,,,,,,,,,,,,,,,,,,,,,,,,,Cedar_Co_Annual_Report_1970_20191202_001,,,,,,,,,,,,,,,,,,,,,,,,,,,,,,,,,,,,"Annual Report,Cedar County Soil and Water Conservation District,Financial Report,Grassed Waterways,Lou Schnack,Marolf Farm,Maurice Walton,Pond,Soil Erosion,Soil Survey,Vetch",https://www.iowaheritage.org/files/original/8ee29c6379e252646f0a8ef9831ddc98.pdf,Document,"Cedar County Soil and Water Conservation District Historic Collection ",1,0
97526,https://www.iowaheritage.org/items/show/97526,"Annual Report, 1971","Annual Report - Cedar County Soil and Water Conservation District ","District published annual report includes Cedar SWCD district activities, financial report, photographs, and names of commissioners and staff.","Cedar County Soil and Water Conservation District ",,"State Library of Iowa",1971,"Cedar County Soil and Water Conservation District of Iowa. For questions about copyright, contact the State Library of Iowa at  <a href=""http://www.statelibraryofiowa.org"">http://www.statelibraryofiowa.org</a>.","This item is protected by copyright and/or related rights. Your are free to use this Item in any way that is permitted by the copyright and related rights legislation that applies to your use. For other uses you need to obtain permission from the rights-holder(s). <a href=""http://rightsstatements.org/"">http://rightsstatements.org</a>",,pdf,eng,"Text; Document ",,,,,,,,,,,,,,,,,,,,,,,,,,,,,,,,,,,,,,,,,Cedar_Co_Annual_Report_1971_20191202_001,,,,,,,,,,,,,,,,,,,,,,,,,,,,,,,,,,,,"Annual Report,Cedar County Soil and Water Conservation District,Clarence Beyer,Don Hora,Don Williams,Ecology,Ed Schermerhorn,Financial Report,Forestry,Francis Abel,George Bowie,Grassed Waterway,Harold Barnhart,Kenneth Dunn,Neal Williamson,Raymond Millett,Soil Survey,Strip Cropping,Wally Elms",https://www.iowaheritage.org/files/original/35c9b20848f15d9d39bd1d501a55e8c6.pdf,Document,"Cedar County Soil and Water Conservation District Historic Collection ",1,0
97527,https://www.iowaheritage.org/items/show/97527,"Annual Report, 1972","Annual Report - Cedar County Soil and Water Conservation District ","District published annual report includes Cedar SWCD district activities, financial report, and names of commissioners and staff.","Cedar County Soil and Water Conservation District ",,"State Library of Iowa",1972,"Cedar County Soil and Water Conservation District of Iowa. For questions about copyright, contact the State Library of Iowa at  <a href=""http://www.statelibraryofiowa.org"">http://www.statelibraryofiowa.org</a>.","This item is protected by copyright and/or related rights. Your are free to use this Item in any way that is permitted by the copyright and related rights legislation that applies to your use. For other uses you need to obtain permission from the rights-holder(s). <a href=""http://rightsstatements.org/"">http://rightsstatements.org</a>",,pdf,eng,"Text; Document ",,,,,,,,,,,,,,,,,,,,,,,,,,,,,,,,,,,,,,,,,Cedar_Co_Annual_Report_1972_20191202_001,,,,,,,,,,,,,,,,,,,,,,,,,,,,,,,,,,,,"Annual Report,Cedar County Soil and Water Conservation District,Clarence Beyer,Darrell Brown,Ed Gardiner,FFA,Financial Report,Forestry,Jeff Anliker,Karen Arbuckle,Kenneth Muller,Marvel Harmel,REAP,Sherri Gahring,Soil Survey,Terraces,Varlyn Fink,Waterways",https://www.iowaheritage.org/files/original/bd9ad3794568ba7f40abde9257c9fb94.pdf,Document,"Cedar County Soil and Water Conservation District Historic Collection ",1,0
97528,https://www.iowaheritage.org/items/show/97528,"Annual Report, 1973","Annual Report - Cedar County Soil and Water Conservation District ","District published annual report includes Cedar SWCD district activities, financial report, photographs, and names of commissioners and staff.","Cedar County Soil and Water Conservation District ",,"State Library of Iowa",1973,"Cedar County Soil and Water Conservation District of Iowa. For questions about copyright, contact the State Library of Iowa at  <a href=""http://www.statelibraryofiowa.org"">http://www.statelibraryofiowa.org</a>.","This item is protected by copyright and/or related rights. Your are free to use this Item in any way that is permitted by the copyright and related rights legislation that applies to your use. For other uses you need to obtain permission from the rights-holder(s). <a href=""http://rightsstatements.org/"">http://rightsstatements.org</a>",,pdf,eng,"Text; Document ",,,,,,,,,,,,,,,,,,,,,,,,,,,,,,,,,,,,,,,,,Cedar_Co_Annual_Report_1973_20191202_001,,,,,,,,,,,,,,,,,,,,,,,,,,,,,,,,,,,,"Annual Report,Baldwin Creek,Carl Mitzner,Cedar County Soil and Water Conservation District,Clarence Beyer,Conservation Resource Planning,Darrell Brown,Donald Pfeiffer,Financial Report,Flood Damage,Flooding,Hilda Carey,Howard Bright,Jeff Anliker,Ken Muller,Richard Mitzner,Soil Survey,Terrace,Wayne Ralfs,Windbreaks",https://www.iowaheritage.org/files/original/b92d5fab32d11dffa43a11432e78d9f4.pdf,Document,"Cedar County Soil and Water Conservation District Historic Collection ",1,0
97534,https://www.iowaheritage.org/items/show/97534,"Budget allocation ledger ","Cedar County Soil and Water Conservation District |Financial Report ","District ledger of budget allocations including a cash receipts journal and cash payments journal. Earliest entry was 1949, latest 1981.","Cedar County Soil and Water Conservation District ",,"State Library of Iowa","1949 to 1981","Cedar County Soil and Water Conservation District of Iowa. For questions about copyright, contact the State Library of Iowa at  <a href=""http://www.statelibraryofiowa.org"">http://www.statelibraryofiowa.org</a>.","This item is protected by copyright and/or related rights. Your are free to use this Item in any way that is permitted by the copyright and related rights legislation that applies to your use. For other uses you need to obtain permission from the rights-holder(s). <a href=""http://rightsstatements.org/"">http://rightsstatements.org</a>",,pdf,,"Text; Document ",,,,,,,,,,,,,,,,,,,,,,,,,,,,,,,,,,,,,,,,,Cedar_Co_Annual_Report_1974_20191202_001,,,,,,,,,,,,,,,,,,,,,,,,,,,,,,,,,,,,"Cedar County Soil and Water Conservation District,Financial Report",https://www.iowaheritage.org/files/original/e252df70ecea8b69c04c99e1c43037ff.pdf,Document,"Cedar County Soil and Water Conservation District Historic Collection ",1,0
97540,https://www.iowaheritage.org/items/show/97540,"Annual Report, 1974","Annual Report - Cedar County Soil and Water Conservation District ","District published annual report includes Cedar SWCD district activities, financial report, photographs, and names of commissioners and staff.","Cedar County Soil and Water Conservation District ",,"State Library of Iowa",1974,"Cedar County Soil and Water Conservation District of Iowa. For questions about copyright, contact the State Library of Iowa at  <a href=""http://www.statelibraryofiowa.org"">http://www.statelibraryofiowa.org</a>.","This item is protected by copyright and/or related rights. Your are free to use this Item in any way that is permitted by the copyright and related rights legislation that applies to your use. For other uses you need to obtain permission from the rights-holder(s). <a href=""http://rightsstatements.org/"">http://rightsstatements.org</a>",,pdf,eng,"Text; Document ",,,,,,,,,,,,,,,,,,,,,,,,,,,,,,,,,,,,,,,,,Cedar_Co_Annual_Report_1974_20191202_001,,,,,,,,,,,,,,,,,,,,,,,,,,,,,,,,,,,,"Annual Report,Cedar County Soil and Water Conservation District,Clarence Beyer,Conservation Poster Contest,Don Barnhart,Donald Pfeiffer,Ed Daufeldt,Ed Schermerhorn,Financial Report,Hilda Carey,Jeff Anliker,Lowden,Terrace,William Davidson II,Wilson Moon",https://www.iowaheritage.org/files/original/1c51ef2681dedeabc9674da738b9738f.pdf,Document,"Cedar County Soil and Water Conservation District Historic Collection ",1,0
