 




﻿"Item Id","Item URI","Dublin Core:Title","Dublin Core:Subject","Dublin Core:Description","Dublin Core:Creator","Dublin Core:Source","Dublin Core:Publisher","Dublin Core:Date","Dublin Core:Contributor","Dublin Core:Rights","Dublin Core:Relation","Dublin Core:Format","Dublin Core:Language","Dublin Core:Type","Dublin Core:Identifier","Dublin Core:Coverage","Item Type Metadata:Text","Item Type Metadata:Interviewer","Item Type Metadata:Interviewee","Item Type Metadata:Location","Item Type Metadata:Transcription","Item Type Metadata:Local URL","Item Type Metadata:Original Format","Item Type Metadata:Physical Dimensions","Item Type Metadata:Duration","Item Type Metadata:Compression","Item Type Metadata:Producer","Item Type Metadata:Director","Item Type Metadata:Bit Rate/Frequency","Item Type Metadata:Time Summary","Item Type Metadata:Email Body","Item Type Metadata:Subject Line","Item Type Metadata:From","Item Type Metadata:To","Item Type Metadata:CC","Item Type Metadata:BCC","Item Type Metadata:Number of Attachments","Item Type Metadata:Standards","Item Type Metadata:Objectives","Item Type Metadata:Materials","Item Type Metadata:Lesson Plan Text","Item Type Metadata:URL","Item Type Metadata:Event Type","Item Type Metadata:Participants","Item Type Metadata:Birth Date","Item Type Metadata:Birthplace","Item Type Metadata:Death Date","Item Type Metadata:Occupation","Item Type Metadata:Biographical Text","Item Type Metadata:Bibliography","Item Type Metadata:Digital Reproduction Information","Item Type Metadata:Repository","Item Type Metadata:Repository Collection","Item Type Metadata:Contact information.","Item Type Metadata:File Name","Item Type Metadata:Notes","Item Type Metadata:Digital item created","Item Type Metadata:Digital item modified","Item Type Metadata:Executive Orders","Item Type Metadata:Record Created","Item Type Metadata:Record Modified","Item Type Metadata:Transcription2","Item Type Metadata:Source URL","Omeka Legacy File:Additional Creator","Omeka Legacy File:Transcriber","Omeka Legacy File:Producer","Omeka Legacy File:Render Device","Omeka Legacy File:Render Details","Omeka Legacy File:Capture Date","Omeka Legacy File:Capture Device","Omeka Legacy File:Capture Details","Omeka Legacy File:Change History","Omeka Legacy File:Watermark","Omeka Legacy File:Encryption","Omeka Legacy File:Compression","Omeka Legacy File:Post Processing","Omeka Image File:Width","Omeka Image File:Height","Omeka Image File:Bit Depth","Omeka Image File:Channels","Omeka Image File:Exif String","Omeka Image File:Exif Array","Omeka Image File:IPTC String","Omeka Image File:IPTC Array","Omeka Video File:Bitrate","Omeka Video File:Duration","Omeka Video File:Sample Rate","Omeka Video File:Codec","Omeka Video File:Width","Omeka Video File:Height",tags,file,itemType,collection,public,featured
8693,https://www.iowaheritage.org/items/show/8693,"Adolf's chickens come home to roost.","War|Hitler, Adolf, 1889-1945|World War, 1939-1945|Germany|Chickens|aggression|retaliation|airpower|Europe|eggs|bombs.",,"Darling, Jay N. (Jay Norwood), 1876-1962","The Editorial cartoons of J.N. ""Ding"" Darling [electronic resource] : The Cowles Collection, Drake University, 1912-1962",,1940/10/07|1940,,"Copyright is owned by the ""Ding"" Darling Wildlife Society; it is administered on behalf of the Society by The University of Iowa. While use within the classroom is encouraged without specific authorization, publishing this cartoon in any format requires written permission. See policy and permissions procedure at: http://www.lib.uiowa.edu/spec-coll/services/dingdarling_fees.html","Cowles Library, Drake University, 2507 University Ave., Des Moines, IA 50311-4505.",,,,"401007.jpg|http://ddr.lib.drake.edu/u?/ddarling,5623",,,,,,,,,,,,,,,,,,,,,,,,,,,,,,,,,,,,,,,,,,,,,,,,"<a href=""http://ddr.lib.drake.edu/u?/ddarling,5623"" target=""_blank"">View this item in its source respository</a>",,,,,,,,,,,,,,,,,,,,,,,,,,,,,https://www.iowaheritage.org/files/original/3f108ff7d34f163860a303722e5f2d99.jpg,"Remote Item","Editorial Cartoons of J.N. ""Ding"" Darling, Drake University",1,0
9139,https://www.iowaheritage.org/items/show/9139,"Moral: if you don't select good eggs, the best hen in the world can't hatch out pure-bred Plymouth Rocks.","Government|Elections 1944|Eggs|politics|elections|direct primaries|chickens|animals.",,"Darling, Jay N. (Jay Norwood), 1876-1962","The Editorial cartoons of J.N. ""Ding"" Darling [electronic resource] : The Cowles Collection, Drake University, 1912-1962",,1944/02/27|1944,,"Copyright is owned by the ""Ding"" Darling Wildlife Society; it is administered on behalf of the Society by The University of Iowa. While use within the classroom is encouraged without specific authorization, publishing this cartoon in any format requires written permission. See policy and permissions procedure at: http://www.lib.uiowa.edu/spec-coll/services/dingdarling_fees.html","Cowles Library, Drake University, 2507 University Ave., Des Moines, IA 50311-4505.",,,,"440227.jpg|http://ddr.lib.drake.edu/u?/ddarling,6069",,,,,,,,,,,,,,,,,,,,,,,,,,,,,,,,,,,,,,,,,,,,,,,,"<a href=""http://ddr.lib.drake.edu/u?/ddarling,6069"" target=""_blank"">View this item in its source respository</a>",,,,,,,,,,,,,,,,,,,,,,,,,,,,,https://www.iowaheritage.org/files/original/5dd48ff6646ca416f3e9ced84dcb3986.jpg,"Remote Item","Editorial Cartoons of J.N. ""Ding"" Darling, Drake University",1,0
9501,https://www.iowaheritage.org/items/show/9501,"Love's labor lost.","Government|Truman, Harry S., 1884-1972|Chickens|politics|legislation|presidential vetoes|taxes|taxation|labor|unions|strikes and lockouts|consumers|eggs|ordinary citizen.",,"Darling, Jay N. (Jay Norwood), 1876-1962","The Editorial cartoons of J.N. ""Ding"" Darling [electronic resource] : The Cowles Collection, Drake University, 1912-1962",,1947/06/19|1947,,"Copyright is owned by the ""Ding"" Darling Wildlife Society; it is administered on behalf of the Society by The University of Iowa. While use within the classroom is encouraged without specific authorization, publishing this cartoon in any format requires written permission. See policy and permissions procedure at: http://www.lib.uiowa.edu/spec-coll/services/dingdarling_fees.html","Cowles Library, Drake University, 2507 University Ave., Des Moines, IA 50311-4505.",,,,"470619.jpg|http://ddr.lib.drake.edu/u?/ddarling,6431",,,,,,,,,,,,,,,,,,,,,,,,,,,,,,,,,,,,,,,,,,,,,,,,"<a href=""http://ddr.lib.drake.edu/u?/ddarling,6431"" target=""_blank"">View this item in its source respository</a>",,,,,,,,,,,,,,,,,,,,,,,,,,,,,https://www.iowaheritage.org/files/original/0a98338f0f332308668d9bef7f0e5cca.jpg,"Remote Item","Editorial Cartoons of J.N. ""Ding"" Darling, Drake University",1,0
9583,https://www.iowaheritage.org/items/show/9583,"What of Mother Love if the eggs spoil?","War|United States|Eggs|peace|international relations|foreign policy|postwar|Cold War|United Nations|vetoes|Russia|England|Palestine|Greece|China|doves|doorknobs|Uncle Sam|John Bull.",,"Darling, Jay N. (Jay Norwood), 1876-1962","The Editorial cartoons of J.N. ""Ding"" Darling [electronic resource] : The Cowles Collection, Drake University, 1912-1962",,1947/12/18|1947,,"Copyright is owned by the ""Ding"" Darling Wildlife Society; it is administered on behalf of the Society by The University of Iowa. While use within the classroom is encouraged without specific authorization, publishing this cartoon in any format requires written permission. See policy and permissions procedure at: http://www.lib.uiowa.edu/spec-coll/services/dingdarling_fees.html","Cowles Library, Drake University, 2507 University Ave., Des Moines, IA 50311-4505.",,,,"471218.jpg|http://ddr.lib.drake.edu/u?/ddarling,6513",,,,,,,,,,,,,,,,,,,,,,,,,,,,,,,,,,,,,,,,,,,,,,,,"<a href=""http://ddr.lib.drake.edu/u?/ddarling,6513"" target=""_blank"">View this item in its source respository</a>",,,,,,,,,,,,,,,,,,,,,,,,,,,,,https://www.iowaheritage.org/files/original/3bee3d5db28a2a240aa0d1cdd850c768.jpg,"Remote Item","Editorial Cartoons of J.N. ""Ding"" Darling, Drake University",1,0
9664,https://www.iowaheritage.org/items/show/9664,"Counting his chickens.","Politics|Truman, Harry S., 1884-1972|Elections 1948|Chickens|elections|candidates|Republican Party|Democratic Party|eggs|elephants.",,"Darling, Jay N. (Jay Norwood), 1876-1962","The Editorial cartoons of J.N. ""Ding"" Darling [electronic resource] : The Cowles Collection, Drake University, 1912-1962",,1948/06/03|1948,,"Copyright is owned by the ""Ding"" Darling Wildlife Society; it is administered on behalf of the Society by The University of Iowa. While use within the classroom is encouraged without specific authorization, publishing this cartoon in any format requires written permission. See policy and permissions procedure at: http://www.lib.uiowa.edu/spec-coll/services/dingdarling_fees.html","Cowles Library, Drake University, 2507 University Ave., Des Moines, IA 50311-4505.",,,,"480603.jpg|http://ddr.lib.drake.edu/u?/ddarling,6594",,,,,,,,,,,,,,,,,,,,,,,,,,,,,,,,,,,,,,,,,,,,,,,,"<a href=""http://ddr.lib.drake.edu/u?/ddarling,6594"" target=""_blank"">View this item in its source respository</a>",,,,,,,,,,,,,,,,,,,,,,,,,,,,,https://www.iowaheritage.org/files/original/8f242209438dc7000b67c455aae47d93.jpg,"Remote Item","Editorial Cartoons of J.N. ""Ding"" Darling, Drake University",1,0
64331,https://www.iowaheritage.org/items/show/64331,"Isn't that one of our nest eggs?","Retirement|United States|Men|2000-2010|Savings|Economy|Economic conditions|Families|Recession|Women|Eggs|Eggshells|Frying pans|Stoves|Newspaper headlines|Newspapers|Cooking","Now it's dinner; 401K; Americans tap into savings to survive","Duffy, Brian, 1955-",,"University of Iowa. Libraries. Special Collections Dept.",2008-09-03|2011-04,,"Educational use only, no other permissions given. Copyright to this digital object is owned by The Des Moines Register; it may not be downloaded, reproduced, or distributed without written permission. For more information, contact the Special Collections Department.","Editorial Cartoons of Brian Duffy; Des Moines Register Cartoonists|Papers of Brian Duffy|Des Moines Register",,English,"Still image|Editorial cartoons",MSC916|duffy-080903|http://digital.lib.uiowa.edu/cdm/ref/collection/duffy/id/169,,,,,,,,,,,,,,,,,,,,,,,,,,,,,,,,,,,,,,,,,,,,,,,,"<a href=""http://digital.lib.uiowa.edu/cdm/ref/collection/duffy/id/169"" target=""_blank"">View this item in its source respository</a>",,,,,,,,,,,,,,,,,,,,,,,,,,,,,https://www.iowaheritage.org/files/original/d5c1c0cb53b0d3d1e283e555e9edf5f3.jpg,"Remote Item","Editorial Cartoons of Brian Duffy",1,0
64409,https://www.iowaheritage.org/items/show/64409,Deficit,"Governors|Branstad, Terry E.|Iowa|Kitchens|1990-2000|Budgets|States|State governments|Spending|Government|Government spending|Government spending policy|Deficits|Legislature|Stoves|Pots|Explosions|Governors|Cooks|Cooking|Men|Doors|Windows|Food|Eggs|Spoons|Cookbooks","Cooked book budget recipes; Legislature","Duffy, Brian, 1955-",,"University of Iowa. Libraries. Special Collections Dept.",1991-01-03|2011-04,,"Educational use only, no other permissions given. Copyright to this digital object is owned by The Des Moines Register; it may not be downloaded, reproduced, or distributed without written permission. For more information, contact the Special Collections Department.","Editorial Cartoons of Brian Duffy; Des Moines Register Cartoonists|Papers of Brian Duffy|Des Moines Register",,English,"Still image|Editorial cartoons",MSC916|duffy-910103|http://digital.lib.uiowa.edu/cdm/ref/collection/duffy/id/247,,,,,,,,,,,,,,,,,,,,,,,,,,,,,,,,,,,,,,,,,,,,,,,,"<a href=""http://digital.lib.uiowa.edu/cdm/ref/collection/duffy/id/247"" target=""_blank"">View this item in its source respository</a>",,,,,,,,,,,,,,,,,,,,,,,,,,,,,https://www.iowaheritage.org/files/original/fbb0f5646e988eccf3daa25d958f9861.jpg,"Remote Item","Editorial Cartoons of Brian Duffy",1,0
64412,https://www.iowaheritage.org/items/show/64412,"S & L's banks","Savings|United States|Chickens|1990-2000|Loans|Banks|Credit|Money|Nests|Eyeglasses|Eggs|Eggshells","?; Nest eggs","Duffy, Brian, 1955-",,"University of Iowa. Libraries. Special Collections Dept.",1991-01-09|2011-04,,"Educational use only, no other permissions given. Copyright to this digital object is owned by The Des Moines Register; it may not be downloaded, reproduced, or distributed without written permission. For more information, contact the Special Collections Department.","Editorial Cartoons of Brian Duffy; Des Moines Register Cartoonists|Papers of Brian Duffy|Des Moines Register",,English,"Still image|Editorial cartoons",MSC916|duffy-910109|http://digital.lib.uiowa.edu/cdm/ref/collection/duffy/id/250,,,,,,,,,,,,,,,,,,,,,,,,,,,,,,,,,,,,,,,,,,,,,,,,"<a href=""http://digital.lib.uiowa.edu/cdm/ref/collection/duffy/id/250"" target=""_blank"">View this item in its source respository</a>",,,,,,,,,,,,,,,,,,,,,,,,,,,,,https://www.iowaheritage.org/files/original/a04afc6ef02b521fc21f1e340811b035.jpg,"Remote Item","Editorial Cartoons of Brian Duffy",1,0
64495,https://www.iowaheritage.org/items/show/64495,"I think the heat has gotten to Dad","Christmas|United States|Christmas trees|1990-2000|Holidays|Winter|Weather|Men|Costumes|Fathers|Children|Thermometers|Sun|Eggs|Rabbits",,"Duffy, Brian, 1955-",,"University of Iowa. Libraries. Special Collections Dept.",1998-12-03|2011-04,,"Educational use only, no other permissions given. Copyright to this digital object is owned by The Des Moines Register; it may not be downloaded, reproduced, or distributed without written permission. For more information, contact the Special Collections Department.","Editorial Cartoons of Brian Duffy; Des Moines Register Cartoonists|Papers of Brian Duffy|Des Moines Register",,English,"Still image|Editorial cartoons",MSC916|duffy-981203|http://digital.lib.uiowa.edu/cdm/ref/collection/duffy/id/333,,,,,,,,,,,,,,,,,,,,,,,,,,,,,,,,,,,,,,,,,,,,,,,,"<a href=""http://digital.lib.uiowa.edu/cdm/ref/collection/duffy/id/333"" target=""_blank"">View this item in its source respository</a>",,,,,,,,,,,,,,,,,,,,,,,,,,,,,https://www.iowaheritage.org/files/original/e00d190a4c53b722250a1f9c0b7aac9a.jpg,"Remote Item","Editorial Cartoons of Brian Duffy",1,0
64540,https://www.iowaheritage.org/items/show/64540,"Ventriloquist Ronald Reagan","Presidents|Reagan, Ronald|United States|Presidents|1980-1990|Presidents -- United States|Presidential power|Presidential appointees|Press|Men|Ventriloquism|Dummies|Comedians|Stools|Eggs|Eggshells|Chickens|Bottles|Eyeglasses|Puppets",,"Duffy, Brian, 1955-",,"University of Iowa. Libraries. Special Collections Dept.",1985-03-03|2011-04,,"Educational use only, no other permissions given. Copyright to this digital object is owned by The Des Moines Register; it may not be downloaded, reproduced, or distributed without written permission. For more information, contact the Special Collections Department.","Editorial Cartoons of Brian Duffy; Des Moines Register Cartoonists|Papers of Brian Duffy|Des Moines Register",,English,"Still image|Editorial cartoons",MSC916|duffy-850303|http://digital.lib.uiowa.edu/cdm/ref/collection/duffy/id/378,,,,,,,,,,,,,,,,,,,,,,,,,,,,,,,,,,,,,,,,,,,,,,,,"<a href=""http://digital.lib.uiowa.edu/cdm/ref/collection/duffy/id/378"" target=""_blank"">View this item in its source respository</a>",,,,,,,,,,,,,,,,,,,,,,,,,,,,,https://www.iowaheritage.org/files/original/4408a022dd840bb26167a6c538dd0cc2.jpg,"Remote Item","Editorial Cartoons of Brian Duffy",1,0
