 




﻿"Item Id","Item URI","Dublin Core:Title","Dublin Core:Subject","Dublin Core:Description","Dublin Core:Creator","Dublin Core:Source","Dublin Core:Publisher","Dublin Core:Date","Dublin Core:Contributor","Dublin Core:Rights","Dublin Core:Relation","Dublin Core:Format","Dublin Core:Language","Dublin Core:Type","Dublin Core:Identifier","Dublin Core:Coverage","Item Type Metadata:Text","Item Type Metadata:Interviewer","Item Type Metadata:Interviewee","Item Type Metadata:Location","Item Type Metadata:Transcription","Item Type Metadata:Local URL","Item Type Metadata:Original Format","Item Type Metadata:Physical Dimensions","Item Type Metadata:Duration","Item Type Metadata:Compression","Item Type Metadata:Producer","Item Type Metadata:Director","Item Type Metadata:Bit Rate/Frequency","Item Type Metadata:Time Summary","Item Type Metadata:Email Body","Item Type Metadata:Subject Line","Item Type Metadata:From","Item Type Metadata:To","Item Type Metadata:CC","Item Type Metadata:BCC","Item Type Metadata:Number of Attachments","Item Type Metadata:Standards","Item Type Metadata:Objectives","Item Type Metadata:Materials","Item Type Metadata:Lesson Plan Text","Item Type Metadata:URL","Item Type Metadata:Event Type","Item Type Metadata:Participants","Item Type Metadata:Birth Date","Item Type Metadata:Birthplace","Item Type Metadata:Death Date","Item Type Metadata:Occupation","Item Type Metadata:Biographical Text","Item Type Metadata:Bibliography","Item Type Metadata:Digital Reproduction Information","Item Type Metadata:Repository","Item Type Metadata:Repository Collection","Item Type Metadata:Contact information.","Item Type Metadata:File Name","Item Type Metadata:Notes","Item Type Metadata:Digital item created","Item Type Metadata:Digital item modified","Item Type Metadata:Executive Orders","Item Type Metadata:Record Created","Item Type Metadata:Record Modified","Item Type Metadata:Transcription2","Item Type Metadata:Source URL","Omeka Legacy File:Additional Creator","Omeka Legacy File:Transcriber","Omeka Legacy File:Producer","Omeka Legacy File:Render Device","Omeka Legacy File:Render Details","Omeka Legacy File:Capture Date","Omeka Legacy File:Capture Device","Omeka Legacy File:Capture Details","Omeka Legacy File:Change History","Omeka Legacy File:Watermark","Omeka Legacy File:Encryption","Omeka Legacy File:Compression","Omeka Legacy File:Post Processing","Omeka Image File:Width","Omeka Image File:Height","Omeka Image File:Bit Depth","Omeka Image File:Channels","Omeka Image File:Exif String","Omeka Image File:Exif Array","Omeka Image File:IPTC String","Omeka Image File:IPTC Array","Omeka Video File:Bitrate","Omeka Video File:Duration","Omeka Video File:Sample Rate","Omeka Video File:Codec","Omeka Video File:Width","Omeka Video File:Height",tags,file,itemType,collection,public,featured
64554,https://www.iowaheritage.org/items/show/64554,"House budget plan","Congress|United States|Donkeys|1980-1990|Budgets|Budgets -- United States|Political parties|Politicians|Politics|Washington (D.C.)|Elephants|Suits (Clothing)|Papers","Senate budget plan","Duffy, Brian, 1955-",,"University of Iowa. Libraries. Special Collections Dept.",1985-07-14|2011-04,,"Educational use only, no other permissions given. Copyright to this digital object is owned by The Des Moines Register; it may not be downloaded, reproduced, or distributed without written permission. For more information, contact the Special Collections Department.","Editorial Cartoons of Brian Duffy; Des Moines Register Cartoonists|Papers of Brian Duffy|Des Moines Register",,English,"Still image|Editorial cartoons",MSC916|duffy-850714|http://digital.lib.uiowa.edu/cdm/ref/collection/duffy/id/392,,,,,,,,,,,,,,,,,,,,,,,,,,,,,,,,,,,,,,,,,,,,,,,,"<a href=""http://digital.lib.uiowa.edu/cdm/ref/collection/duffy/id/392"" target=""_blank"">View this item in its source respository</a>",,,,,,,,,,,,,,,,,,,,,,,,,,,,,https://www.iowaheritage.org/files/original/10ad822344ed1fbf1af2f3ca454d2952.jpg,"Remote Item","Editorial Cartoons of Brian Duffy",1,0
64549,https://www.iowaheritage.org/items/show/64549,"We pledge allegiance to the PACs of the United States of America ...","Political action committees|United States|Capitol|1980-1990|Congress|Influence|Political corruption|Political influence|Lobbyists|Washington (D.C.)|Monuments|Flags|Money|Dollars",,"Duffy, Brian, 1955-",,"University of Iowa. Libraries. Special Collections Dept.",1985-03-29|2011-04,,"Educational use only, no other permissions given. Copyright to this digital object is owned by The Des Moines Register; it may not be downloaded, reproduced, or distributed without written permission. For more information, contact the Special Collections Department.","Editorial Cartoons of Brian Duffy; Des Moines Register Cartoonists|Papers of Brian Duffy|Des Moines Register",,English,"Still image|Editorial cartoons",MSC916|duffy-850329|http://digital.lib.uiowa.edu/cdm/ref/collection/duffy/id/387,,,,,,,,,,,,,,,,,,,,,,,,,,,,,,,,,,,,,,,,,,,,,,,,"<a href=""http://digital.lib.uiowa.edu/cdm/ref/collection/duffy/id/387"" target=""_blank"">View this item in its source respository</a>",,,,,,,,,,,,,,,,,,,,,,,,,,,,,https://www.iowaheritage.org/files/original/013e76fd98dc4f9d642d5189afdd25a8.jpg,"Remote Item","Editorial Cartoons of Brian Duffy",1,0
64548,https://www.iowaheritage.org/items/show/64548,"Yahoo ...","Presidents|Reagan, Ronald|Washington (D.C.)|Presidents|1980-1990|Nuclear power|Arms race|Arms control|Cowboys|Rockets|Missiles|White House",MX;,"Duffy, Brian, 1955-",,"University of Iowa. Libraries. Special Collections Dept.",1985-03-28|2011-04,,"Educational use only, no other permissions given. Copyright to this digital object is owned by The Des Moines Register; it may not be downloaded, reproduced, or distributed without written permission. For more information, contact the Special Collections Department.","Editorial Cartoons of Brian Duffy; Des Moines Register Cartoonists|Papers of Brian Duffy|Des Moines Register",,English,"Still image|Editorial cartoons",MSC916|duffy-850328|http://digital.lib.uiowa.edu/cdm/ref/collection/duffy/id/386,,,,,,,,,,,,,,,,,,,,,,,,,,,,,,,,,,,,,,,,,,,,,,,,"<a href=""http://digital.lib.uiowa.edu/cdm/ref/collection/duffy/id/386"" target=""_blank"">View this item in its source respository</a>",,,,,,,,,,,,,,,,,,,,,,,,,,,,,https://www.iowaheritage.org/files/original/83f996fc8619d8c2215b5ed0555bf076.jpg,"Remote Item","Editorial Cartoons of Brian Duffy",1,0
64539,https://www.iowaheritage.org/items/show/64539,"Someone must stand up to those who say here's the keys, there's the Treasury, take as many tax dollars as you want","Presidents|Reagan, Ronald|United States|Presidents|1980-1990|Taxation|Taxes|Treasuries|Government|Government spending|Government spending policy|Congress|Washington (D.C.)|Money|Men|Money bags|Monuments|Keys|Generals|Treasury Building|Thieves","Treasury; $; Here's the keys, the Treasury is empty!","Duffy, Brian, 1955-",,"University of Iowa. Libraries. Special Collections Dept.",1985-03-10|2011-04,,"Educational use only, no other permissions given. Copyright to this digital object is owned by The Des Moines Register; it may not be downloaded, reproduced, or distributed without written permission. For more information, contact the Special Collections Department.","Editorial Cartoons of Brian Duffy; Des Moines Register Cartoonists|Papers of Brian Duffy|Des Moines Register",,English,"Still image|Editorial cartoons",MSC916|duffy-850310|http://digital.lib.uiowa.edu/cdm/ref/collection/duffy/id/377,,,,,,,,,,,,,,,,,,,,,,,,,,,,,,,,,,,,,,,,,,,,,,,,"<a href=""http://digital.lib.uiowa.edu/cdm/ref/collection/duffy/id/377"" target=""_blank"">View this item in its source respository</a>",,,,,,,,,,,,,,,,,,,,,,,,,,,,,https://www.iowaheritage.org/files/original/c3e888194e2c7f1367d52daa1947141f.jpg,"Remote Item","Editorial Cartoons of Brian Duffy",1,0
64538,https://www.iowaheritage.org/items/show/64538,"The Larry Speakes Show","Presidency|Speakes, Larry|United States|Senators|1980-1990|Presidents -- United States|Presidents|Presidential power|Presidential appointees|Press|Senate|Campaigning|Campaigns|Republican Party|Political promises|Political parties|Political influence|Politics|Politicians|Washington (D.C.)|Senate|Press|Press conferences|Men|Podiums|Microphones|Ladders|Flags|Contracts|Pens|Signs|Stars","And you can forget about the president campaigning for you in '86!; Could I have that in writing?; Senate Republicans; We know who our friends are","Duffy, Brian, 1955-",,"University of Iowa. Libraries. Special Collections Dept.",1985-03-19|2011-04,,"Educational use only, no other permissions given. Copyright to this digital object is owned by The Des Moines Register; it may not be downloaded, reproduced, or distributed without written permission. For more information, contact the Special Collections Department.","Editorial Cartoons of Brian Duffy; Des Moines Register Cartoonists|Papers of Brian Duffy|Des Moines Register",,English,"Still image|Editorial cartoons",MSC916|duffy-850319|http://digital.lib.uiowa.edu/cdm/ref/collection/duffy/id/376,,,,,,,,,,,,,,,,,,,,,,,,,,,,,,,,,,,,,,,,,,,,,,,,"<a href=""http://digital.lib.uiowa.edu/cdm/ref/collection/duffy/id/376"" target=""_blank"">View this item in its source respository</a>",,,,,,,,,,,,,,,,,,,,,,,,,,,,,https://www.iowaheritage.org/files/original/9b0b2d87ecd91756108d848c20d8ef71.jpg,"Remote Item","Editorial Cartoons of Brian Duffy",1,0
64529,https://www.iowaheritage.org/items/show/64529,"Bozo beer","Congress|Washington (D.C.)|Beer|1980-1990|Politicians|Politics|Capitols|Capitol|Explosions|Cans|Stars","Capitol Hill Brewery; Serve warm","Duffy, Brian, 1955-",,"University of Iowa. Libraries. Special Collections Dept.",1985-03-04|2011-04,,"Educational use only, no other permissions given. Copyright to this digital object is owned by The Des Moines Register; it may not be downloaded, reproduced, or distributed without written permission. For more information, contact the Special Collections Department.","Editorial Cartoons of Brian Duffy; Des Moines Register Cartoonists|Papers of Brian Duffy|Des Moines Register",,English,"Still image|Editorial cartoons","MSC916|duffy-850304 2|http://digital.lib.uiowa.edu/cdm/ref/collection/duffy/id/367",,,,,,,,,,,,,,,,,,,,,,,,,,,,,,,,,,,,,,,,,,,,,,,,"<a href=""http://digital.lib.uiowa.edu/cdm/ref/collection/duffy/id/367"" target=""_blank"">View this item in its source respository</a>",,,,,,,,,,,,,,,,,,,,,,,,,,,,,https://www.iowaheritage.org/files/original/40b243bcdd39df50617e71f970d650be.jpg,"Remote Item","Editorial Cartoons of Brian Duffy",1,0
64502,https://www.iowaheritage.org/items/show/64502,"OK, you're going to kick the chair out, and then he's going to cut the rope, is that how it's supposed to work?","Impeachments|Clinton, Bill, 1946-|United States|Men|1990-2000|Presidents|Congress|Washington (D.C.)|Presidents|Trees|Tree limbs|Nooses|Capitols|Capitol|Knives","Theoretically; House; Senate; Public","Duffy, Brian, 1955-",,"University of Iowa. Libraries. Special Collections Dept.",1998-12-17|2011-04,,"Educational use only, no other permissions given. Copyright to this digital object is owned by The Des Moines Register; it may not be downloaded, reproduced, or distributed without written permission. For more information, contact the Special Collections Department.","Editorial Cartoons of Brian Duffy; Des Moines Register Cartoonists|Papers of Brian Duffy|Des Moines Register",,English,"Still image|Editorial cartoons",MSC916|duffy-981217|http://digital.lib.uiowa.edu/cdm/ref/collection/duffy/id/340,,,,,,,,,,,,,,,,,,,,,,,,,,,,,,,,,,,,,,,,,,,,,,,,"<a href=""http://digital.lib.uiowa.edu/cdm/ref/collection/duffy/id/340"" target=""_blank"">View this item in its source respository</a>",,,,,,,,,,,,,,,,,,,,,,,,,,,,,https://www.iowaheritage.org/files/original/1c2eaf5c1fff75999abc46b581dcc3ca.jpg,"Remote Item","Editorial Cartoons of Brian Duffy",1,0
64499,https://www.iowaheritage.org/items/show/64499,"Congress maintenance dept.","Presidents|Johnson, Andrew, 1808-1875|United States|Men|1990-2000|Presidents -- United States|Congress|Impeachments|Nixon, Richard M. (Richard Milhous), 1913-1994|Clinton, Bill, 1946-|Washington (D.C.)|Presidents|Hammers|Ladders|Nails|Portraits|Signs","Andrew Johnson; Richard Nixon; Bill","Duffy, Brian, 1955-",,"University of Iowa. Libraries. Special Collections Dept.",1998-12-11|2011-04,,"Educational use only, no other permissions given. Copyright to this digital object is owned by The Des Moines Register; it may not be downloaded, reproduced, or distributed without written permission. For more information, contact the Special Collections Department.","Editorial Cartoons of Brian Duffy; Des Moines Register Cartoonists|Papers of Brian Duffy|Des Moines Register",,English,"Still image|Editorial cartoons",MSC916|duffy-981211|http://digital.lib.uiowa.edu/cdm/ref/collection/duffy/id/337,,,,,,,,,,,,,,,,,,,,,,,,,,,,,,,,,,,,,,,,,,,,,,,,"<a href=""http://digital.lib.uiowa.edu/cdm/ref/collection/duffy/id/337"" target=""_blank"">View this item in its source respository</a>",,,,,,,,,,,,,,,,,,,,,,,,,,,,,https://www.iowaheritage.org/files/original/6f98382d824d9e94e35160f62f8dc2d6.jpg,"Remote Item","Editorial Cartoons of Brian Duffy",1,0
64477,https://www.iowaheritage.org/items/show/64477,House,"Elections|Gingrich, Newt|Washington (D.C.)|Elephants|1990-2000|Elections -- United States|Presidents|Political parties|Political influence|Politicians|Politics|Congress|Clinton, Bill, 1946-|Ticker tape parades|Parades|Men|Presidents|Presidential seal|Janitors|Brooms|Balloons|Politicians",Prez,"Duffy, Brian, 1955-",,"University of Iowa. Libraries. Special Collections Dept.",1995-04-20|2011-04,,"Educational use only, no other permissions given. Copyright to this digital object is owned by The Des Moines Register; it may not be downloaded, reproduced, or distributed without written permission. For more information, contact the Special Collections Department.","Editorial Cartoons of Brian Duffy; Des Moines Register Cartoonists|Papers of Brian Duffy|Des Moines Register",,English,"Still image|Editorial cartoons",MSC916|duffy-950420|http://digital.lib.uiowa.edu/cdm/ref/collection/duffy/id/315,,,,,,,,,,,,,,,,,,,,,,,,,,,,,,,,,,,,,,,,,,,,,,,,"<a href=""http://digital.lib.uiowa.edu/cdm/ref/collection/duffy/id/315"" target=""_blank"">View this item in its source respository</a>",,,,,,,,,,,,,,,,,,,,,,,,,,,,,https://www.iowaheritage.org/files/original/847435fa7b65791aadbba5ef8a7df9ac.jpg,"Remote Item","Editorial Cartoons of Brian Duffy",1,0
64473,https://www.iowaheritage.org/items/show/64473,Kitchen,"Congress|United States|School children|1990-2000|Political parties|Politicians|Politics|School|School children|Education|Education and state|Nutrition|Washington (D.C.)|Schools|Cafeterias|Doors|Trays|Signs|Menus|Cooks|Knives|Elephants|Donkeys|Fighting|Steam","Congress; School lunch program; Menu; Rhetoric on a roll; Fruit cup; Fortune cookie; Milk","Duffy, Brian, 1955-",,"University of Iowa. Libraries. Special Collections Dept.",1995-04-11|2011-04,,"Educational use only, no other permissions given. Copyright to this digital object is owned by The Des Moines Register; it may not be downloaded, reproduced, or distributed without written permission. For more information, contact the Special Collections Department.","Editorial Cartoons of Brian Duffy; Des Moines Register Cartoonists|Papers of Brian Duffy|Des Moines Register",,English,"Still image|Editorial cartoons",MSC916|duffy-950411|http://digital.lib.uiowa.edu/cdm/ref/collection/duffy/id/311,,,,,,,,,,,,,,,,,,,,,,,,,,,,,,,,,,,,,,,,,,,,,,,,"<a href=""http://digital.lib.uiowa.edu/cdm/ref/collection/duffy/id/311"" target=""_blank"">View this item in its source respository</a>",,,,,,,,,,,,,,,,,,,,,,,,,,,,,https://www.iowaheritage.org/files/original/19850f2832b5e07cfa3873fc58e95ad7.jpg,"Remote Item","Editorial Cartoons of Brian Duffy",1,0
