 




﻿"Item Id","Item URI","Dublin Core:Title","Dublin Core:Subject","Dublin Core:Description","Dublin Core:Creator","Dublin Core:Source","Dublin Core:Publisher","Dublin Core:Date","Dublin Core:Contributor","Dublin Core:Rights","Dublin Core:Relation","Dublin Core:Format","Dublin Core:Language","Dublin Core:Type","Dublin Core:Identifier","Dublin Core:Coverage","Item Type Metadata:Text","Item Type Metadata:Interviewer","Item Type Metadata:Interviewee","Item Type Metadata:Location","Item Type Metadata:Transcription","Item Type Metadata:Local URL","Item Type Metadata:Original Format","Item Type Metadata:Physical Dimensions","Item Type Metadata:Duration","Item Type Metadata:Compression","Item Type Metadata:Producer","Item Type Metadata:Director","Item Type Metadata:Bit Rate/Frequency","Item Type Metadata:Time Summary","Item Type Metadata:Email Body","Item Type Metadata:Subject Line","Item Type Metadata:From","Item Type Metadata:To","Item Type Metadata:CC","Item Type Metadata:BCC","Item Type Metadata:Number of Attachments","Item Type Metadata:Standards","Item Type Metadata:Objectives","Item Type Metadata:Materials","Item Type Metadata:Lesson Plan Text","Item Type Metadata:URL","Item Type Metadata:Event Type","Item Type Metadata:Participants","Item Type Metadata:Birth Date","Item Type Metadata:Birthplace","Item Type Metadata:Death Date","Item Type Metadata:Occupation","Item Type Metadata:Biographical Text","Item Type Metadata:Bibliography","Item Type Metadata:Digital Reproduction Information","Item Type Metadata:Repository","Item Type Metadata:Repository Collection","Item Type Metadata:Contact information.","Item Type Metadata:File Name","Item Type Metadata:Notes","Item Type Metadata:Digital item created","Item Type Metadata:Digital item modified","Item Type Metadata:Executive Orders","Item Type Metadata:Record Created","Item Type Metadata:Record Modified","Item Type Metadata:Transcription2","Item Type Metadata:Source URL","Omeka Legacy File:Additional Creator","Omeka Legacy File:Transcriber","Omeka Legacy File:Producer","Omeka Legacy File:Render Device","Omeka Legacy File:Render Details","Omeka Legacy File:Capture Date","Omeka Legacy File:Capture Device","Omeka Legacy File:Capture Details","Omeka Legacy File:Change History","Omeka Legacy File:Watermark","Omeka Legacy File:Encryption","Omeka Legacy File:Compression","Omeka Legacy File:Post Processing","Omeka Image File:Width","Omeka Image File:Height","Omeka Image File:Bit Depth","Omeka Image File:Channels","Omeka Image File:Exif String","Omeka Image File:Exif Array","Omeka Image File:IPTC String","Omeka Image File:IPTC Array","Omeka Video File:Bitrate","Omeka Video File:Duration","Omeka Video File:Sample Rate","Omeka Video File:Codec","Omeka Video File:Width","Omeka Video File:Height",tags,file,itemType,collection,public,featured
7152,https://www.iowaheritage.org/items/show/7152,"Busted again in the same place.","Government|Roosevelt, Franklin D. (Franklin Delano), 1882-1945|Elections 1928|Wagons|politics|elections|issues|Prohibition|alcohol|Democratic Party|Republican Party|Raskob, John Jakob, 1879-1950||Elections 1930|Elections 1932|elephants|donkeys.",,"Darling, Jay N. (Jay Norwood), 1876-1962","The Editorial cartoons of J.N. ""Ding"" Darling [electronic resource] : The Cowles Collection, Drake University, 1912-1962",,1930/10/08|1930,,"Copyright is owned by the ""Ding"" Darling Wildlife Society; it is administered on behalf of the Society by The University of Iowa. While use within the classroom is encouraged without specific authorization, publishing this cartoon in any format requires written permission. See policy and permissions procedure at: http://www.lib.uiowa.edu/spec-coll/services/dingdarling_fees.html","Cowles Library, Drake University, 2507 University Ave., Des Moines, IA 50311-4505.",,,,"301008.jpg|http://ddr.lib.drake.edu/u?/ddarling,4081",,,,,,,,,,,,,,,,,,,,,,,,,,,,,,,,,,,,,,,,,,,,,,,,"<a href=""http://ddr.lib.drake.edu/u?/ddarling,4081"" target=""_blank"">View this item in its source respository</a>",,,,,,,,,,,,,,,,,,,,,,,,,,,,,https://www.iowaheritage.org/files/original/fdad474ed543fedf91f6a0742dd913fa.jpg,"Remote Item","Editorial Cartoons of J.N. ""Ding"" Darling, Drake University",1,0
7314,https://www.iowaheritage.org/items/show/7314,"Of course we're all out pushing as hard as we can, aren't we?","Human nature|Great Depression|Wagons|business|cycles|credit|money|hoarding.|money.",,"Darling, Jay N. (Jay Norwood), 1876-1962","The Editorial cartoons of J.N. ""Ding"" Darling [electronic resource] : The Cowles Collection, Drake University, 1912-1962",,1931/11/05|1931,,"Copyright is owned by the ""Ding"" Darling Wildlife Society; it is administered on behalf of the Society by The University of Iowa. While use within the classroom is encouraged without specific authorization, publishing this cartoon in any format requires written permission. See policy and permissions procedure at: http://www.lib.uiowa.edu/spec-coll/services/dingdarling_fees.html","Cowles Library, Drake University, 2507 University Ave., Des Moines, IA 50311-4505.",,,,"311105.jpg|http://ddr.lib.drake.edu/u?/ddarling,4243",,,,,,,,,,,,,,,,,,,,,,,,,,,,,,,,,,,,,,,,,,,,,,,,"<a href=""http://ddr.lib.drake.edu/u?/ddarling,4243"" target=""_blank"">View this item in its source respository</a>",,,,,,,,,,,,,,,,,,,,,,,,,,,,,https://www.iowaheritage.org/files/original/dafef520b02a33bdf9dd9fcbb39147a0.jpg,"Remote Item","Editorial Cartoons of J.N. ""Ding"" Darling, Drake University",1,0
7365,https://www.iowaheritage.org/items/show/7365,"Something missing from the band-wagon.","Politics|Roosevelt, Franklin D. (Franklin Delano), 1882-1945|Elections 1932|Wagons|elections|campaigns|candidates|Democratic Party|Raskob, John Jakob, 1879-1950|Ritchie, Albert Cabell, 1876-1936|Baker, Newton Diehl, 1871-1937|Bowers, Claude Gernade, 1878-1958|Cox, James Middleton, 1870-1957|Davis, John William, 1873-1955|Smith, Alfred Emanuel, 1873-1944|wheels|donkeys.",,"Darling, Jay N. (Jay Norwood), 1876-1962","The Editorial cartoons of J.N. ""Ding"" Darling [electronic resource] : The Cowles Collection, Drake University, 1912-1962",,1932/01/08|1932,,"Copyright is owned by the ""Ding"" Darling Wildlife Society; it is administered on behalf of the Society by The University of Iowa. While use within the classroom is encouraged without specific authorization, publishing this cartoon in any format requires written permission. See policy and permissions procedure at: http://www.lib.uiowa.edu/spec-coll/services/dingdarling_fees.html","Cowles Library, Drake University, 2507 University Ave., Des Moines, IA 50311-4505.",,,,"320108.jpg|http://ddr.lib.drake.edu/u?/ddarling,4294",,,,,,,,,,,,,,,,,,,,,,,,,,,,,,,,,,,,,,,,,,,,,,,,"<a href=""http://ddr.lib.drake.edu/u?/ddarling,4294"" target=""_blank"">View this item in its source respository</a>",,,,,,,,,,,,,,,,,,,,,,,,,,,,,https://www.iowaheritage.org/files/original/041395c7c13a2a4fdec9b0fae522a370.jpg,"Remote Item","Editorial Cartoons of J.N. ""Ding"" Darling, Drake University",1,0
7541,https://www.iowaheritage.org/items/show/7541,"It makes a lot of difference these days.","Government|Roosevelt, Franklin D. (Franklin Delano), 1882-1945|Elections 1932|Wagons|politics|elections|candidates|agriculture|farming|Democratic Party|donkeys|farmers.",,"Darling, Jay N. (Jay Norwood), 1876-1962","The Editorial cartoons of J.N. ""Ding"" Darling [electronic resource] : The Cowles Collection, Drake University, 1912-1962",,1932/09/15|1932,,"Copyright is owned by the ""Ding"" Darling Wildlife Society; it is administered on behalf of the Society by The University of Iowa. While use within the classroom is encouraged without specific authorization, publishing this cartoon in any format requires written permission. See policy and permissions procedure at: http://www.lib.uiowa.edu/spec-coll/services/dingdarling_fees.html","Cowles Library, Drake University, 2507 University Ave., Des Moines, IA 50311-4505.",,,,"320915.jpg|http://ddr.lib.drake.edu/u?/ddarling,4470",,,,,,,,,,,,,,,,,,,,,,,,,,,,,,,,,,,,,,,,,,,,,,,,"<a href=""http://ddr.lib.drake.edu/u?/ddarling,4470"" target=""_blank"">View this item in its source respository</a>",,,,,,,,,,,,,,,,,,,,,,,,,,,,,https://www.iowaheritage.org/files/original/1b20d61f64cfc11c8ff1f155817d3d3a.jpg,"Remote Item","Editorial Cartoons of J.N. ""Ding"" Darling, Drake University",1,0
7638,https://www.iowaheritage.org/items/show/7638,"Seems as though something ought to start pretty soon.","Government|Great Depression|Wagons|agriculture|farming|aid|supports|recovery|mud.",,"Darling, Jay N. (Jay Norwood), 1876-1962","The Editorial cartoons of J.N. ""Ding"" Darling [electronic resource] : The Cowles Collection, Drake University, 1912-1962",,1933/02/13|1933,,"Copyright is owned by the ""Ding"" Darling Wildlife Society; it is administered on behalf of the Society by The University of Iowa. While use within the classroom is encouraged without specific authorization, publishing this cartoon in any format requires written permission. See policy and permissions procedure at: http://www.lib.uiowa.edu/spec-coll/services/dingdarling_fees.html","Cowles Library, Drake University, 2507 University Ave., Des Moines, IA 50311-4505.",,,,"330213.jpg|http://ddr.lib.drake.edu/u?/ddarling,4567",,,,,,,,,,,,,,,,,,,,,,,,,,,,,,,,,,,,,,,,,,,,,,,,"<a href=""http://ddr.lib.drake.edu/u?/ddarling,4567"" target=""_blank"">View this item in its source respository</a>",,,,,,,,,,,,,,,,,,,,,,,,,,,,,https://www.iowaheritage.org/files/original/b763820094b222ac58bf47ec8fc69c14.jpg,"Remote Item","Editorial Cartoons of J.N. ""Ding"" Darling, Drake University",1,0
7901,https://www.iowaheritage.org/items/show/7901,"Question: whether to hit him or take the ditch?","Government|Roosevelt, Franklin D. (Franklin Delano), 1882-1945|Cliffs|politics|taxes|taxation|budgets|spending|deficits|New Deal|economics|inflation|wagons|ordinary citizen.",,"Darling, Jay N. (Jay Norwood), 1876-1962","The Editorial cartoons of J.N. ""Ding"" Darling [electronic resource] : The Cowles Collection, Drake University, 1912-1962",,1936/02/27|1936,,"Copyright is owned by the ""Ding"" Darling Wildlife Society; it is administered on behalf of the Society by The University of Iowa. While use within the classroom is encouraged without specific authorization, publishing this cartoon in any format requires written permission. See policy and permissions procedure at: http://www.lib.uiowa.edu/spec-coll/services/dingdarling_fees.html","Cowles Library, Drake University, 2507 University Ave., Des Moines, IA 50311-4505.",,,,"360227.jpg|http://ddr.lib.drake.edu/u?/ddarling,4830",,,,,,,,,,,,,,,,,,,,,,,,,,,,,,,,,,,,,,,,,,,,,,,,"<a href=""http://ddr.lib.drake.edu/u?/ddarling,4830"" target=""_blank"">View this item in its source respository</a>",,,,,,,,,,,,,,,,,,,,,,,,,,,,,https://www.iowaheritage.org/files/original/bc2cf8b0a493b3e8e074c5a9b84efbbd.jpg,"Remote Item","Editorial Cartoons of J.N. ""Ding"" Darling, Drake University",1,0
8849,https://www.iowaheritage.org/items/show/8849,"Why they want to do it, nobody knows.","War|World War, 1939-1945|Wagons|economics|inflation|wages|prices|labor|oxen|ordinary citizen.",,"Darling, Jay N. (Jay Norwood), 1876-1962","The Editorial cartoons of J.N. ""Ding"" Darling [electronic resource] : The Cowles Collection, Drake University, 1912-1962",,1941/10/07|1941,,"Copyright is owned by the ""Ding"" Darling Wildlife Society; it is administered on behalf of the Society by The University of Iowa. While use within the classroom is encouraged without specific authorization, publishing this cartoon in any format requires written permission. See policy and permissions procedure at: http://www.lib.uiowa.edu/spec-coll/services/dingdarling_fees.html","Cowles Library, Drake University, 2507 University Ave., Des Moines, IA 50311-4505.",,,,"411007.jpg|http://ddr.lib.drake.edu/u?/ddarling,5779",,,,,,,,,,,,,,,,,,,,,,,,,,,,,,,,,,,,,,,,,,,,,,,,"<a href=""http://ddr.lib.drake.edu/u?/ddarling,5779"" target=""_blank"">View this item in its source respository</a>",,,,,,,,,,,,,,,,,,,,,,,,,,,,,https://www.iowaheritage.org/files/original/186fc75413ff046159a99f8ee3406b29.jpg,"Remote Item","Editorial Cartoons of J.N. ""Ding"" Darling, Drake University",1,0
69437,https://www.iowaheritage.org/items/show/69437,"Billy Robinson with passenger in cockpit ","Airplanes|Air pilots -- Iowa -- Grinnell|Robinson, Billy, 1884-1916|Wagons|Propellers, Aerial|Aviation|Transportation","Billy Robinson with unknown passenger in cockpit of his monoplane with radial engine. Partial view of wagon in background. ",unknown,,,"ca. 1915","Smith, Robert D."," This digital image may be used for educational purposes, as long as it is not altered in any way. No commercial reproduction or distribution of this file is permitted without written permission of Grinnell Public Library. See http://www.grinnell.lib.ia.us/files/copyright.htm  ",,"1 photograph : b&w ; 12 x 17 cm. ",,"Still image",,,,,,,,,,,,,,,,,,,,,,,,,,,,,,,,,,,,,"150 dpi resolution ","Grinnell Public Library Archives ","Billy Robinson Collection","Contact Grinnell Public Library http://www.grinnell.lib.ia.us  ",aeroplane9,"Finding Aid - Collection 25, Box 2  ","May 3, 2004",,,,,,,,,,,,,,,,,,,,,,,,,,,,,,,,,,,https://www.iowaheritage.org/files/original/495a9c611fa8f66aacca70b3c22b58fe.jpg,"Still Image","Billy Robinson Heritage Digital Photo Exhibit",1,0
50189,https://www.iowaheritage.org/items/show/50189,"Street scene with horses and wagons, Amana, Iowa, 1900s","Horses|United States -- Iowa -- Iowa County -- Amana|Agriculture and Rural Life|Wagons|Business, Industry, and Trades|Religion",,,215.18,,-19,"Amana Heritage Society","U.S. and international copyright laws protect this digital image. Commercial use or distribution of the image is not permitted without prior permission of the copyright holder. For permission to use the digital image, please contact the Amana Heritage Society",,"1 photograph: b&w; 4 x 5 in.",,"Still image",,,,,,,,,,,,,,,,,,,,,,,,,,,,,,,,,,,,,"image/jpeg|83,779 bytes|Scanned with HP Scanjet 3400C at 300 ppi. Archival master image available in tiff format.","Amana Heritage Society Collection",,"Please contact the Amana Heritage Society: (319) 622-3567; amherit@juno.com ; http://www.amanaheritage.org/",215.18.jpg,,5/23/2006,,,,,,,,,,,,,,,,,,,,,,,,,,,,,,,,,,,https://www.iowaheritage.org/files/original/33767d71f5ea637f71b5427df18dc7d4.jpg,"Still Image","Amana Heritage Society Collection",1,0
50206,https://www.iowaheritage.org/items/show/50206,"Middle Amana street scene 1908, Middle Amana, Iowa, 1908","Buildings|Dwellings|United States -- Iowa -- Iowa County -- Middle Amana|Agriculture and Rural Life|General views|Fences|Roads|Wagons|Religion|Transportation",,,92.221,,1908,"Amana Heritage Society","U.S. and international copyright laws protect this digital image. Commercial use or distribution of the image is not permitted without prior permission of the copyright holder. For permission to use the digital image, please contact the Amana Heritage Society",,"1 photograph: b&w; 3.5 x 5.5 in.",,"Still image",,,,,,,,,,,,,,,,,,,,,,,,,,,,,,,,,,,,,"image/jpeg|23,402 bytes|Scanned with HP Scanjet 3400C at 300 ppi. Archival master image available in tiff format.","Amana Heritage Society Collection",,"Please contact the Amana Heritage Society: (319) 622-3567; amherit@juno.com ; http://www.amanaheritage.org/",92.221.jpg,,6/8/2006,,,,,,,,,,,,,,,,,,,,,,,,,,,,,,,,,,,https://www.iowaheritage.org/files/original/e19b7ed822d0c5f0a8ef5639d5fd74b2.jpg,"Still Image","Amana Heritage Society Collection",1,0
