 




﻿"Item Id","Item URI","Dublin Core:Title","Dublin Core:Subject","Dublin Core:Description","Dublin Core:Creator","Dublin Core:Source","Dublin Core:Publisher","Dublin Core:Date","Dublin Core:Contributor","Dublin Core:Rights","Dublin Core:Relation","Dublin Core:Format","Dublin Core:Language","Dublin Core:Type","Dublin Core:Identifier","Dublin Core:Coverage","Item Type Metadata:Text","Item Type Metadata:Interviewer","Item Type Metadata:Interviewee","Item Type Metadata:Location","Item Type Metadata:Transcription","Item Type Metadata:Local URL","Item Type Metadata:Original Format","Item Type Metadata:Physical Dimensions","Item Type Metadata:Duration","Item Type Metadata:Compression","Item Type Metadata:Producer","Item Type Metadata:Director","Item Type Metadata:Bit Rate/Frequency","Item Type Metadata:Time Summary","Item Type Metadata:Email Body","Item Type Metadata:Subject Line","Item Type Metadata:From","Item Type Metadata:To","Item Type Metadata:CC","Item Type Metadata:BCC","Item Type Metadata:Number of Attachments","Item Type Metadata:Standards","Item Type Metadata:Objectives","Item Type Metadata:Materials","Item Type Metadata:Lesson Plan Text","Item Type Metadata:URL","Item Type Metadata:Event Type","Item Type Metadata:Participants","Item Type Metadata:Birth Date","Item Type Metadata:Birthplace","Item Type Metadata:Death Date","Item Type Metadata:Occupation","Item Type Metadata:Biographical Text","Item Type Metadata:Bibliography","Item Type Metadata:Digital Reproduction Information","Item Type Metadata:Repository","Item Type Metadata:Repository Collection","Item Type Metadata:Contact information.","Item Type Metadata:File Name","Item Type Metadata:Notes","Item Type Metadata:Digital item created","Item Type Metadata:Digital item modified","Item Type Metadata:Executive Orders","Item Type Metadata:Record Created","Item Type Metadata:Record Modified","Item Type Metadata:Transcription2","Item Type Metadata:Source URL","Omeka Legacy File:Additional Creator","Omeka Legacy File:Transcriber","Omeka Legacy File:Producer","Omeka Legacy File:Render Device","Omeka Legacy File:Render Details","Omeka Legacy File:Capture Date","Omeka Legacy File:Capture Device","Omeka Legacy File:Capture Details","Omeka Legacy File:Change History","Omeka Legacy File:Watermark","Omeka Legacy File:Encryption","Omeka Legacy File:Compression","Omeka Legacy File:Post Processing","Omeka Image File:Width","Omeka Image File:Height","Omeka Image File:Bit Depth","Omeka Image File:Channels","Omeka Image File:Exif String","Omeka Image File:Exif Array","Omeka Image File:IPTC String","Omeka Image File:IPTC Array","Omeka Video File:Bitrate","Omeka Video File:Duration","Omeka Video File:Sample Rate","Omeka Video File:Codec","Omeka Video File:Width","Omeka Video File:Height",tags,file,itemType,collection,public,featured
24079,https://www.iowaheritage.org/items/show/24079,"Barrel rolling in parade, The University of Iowa, 1910s","Universities & colleges|University of Iowa|United States -- Iowa -- Iowa City|1910-1920|Parades & processions|Barrels",,"Kent, Frederick W. (Frederick Wallace), 1894-1984",,"University of Iowa. Libraries. University Archives",1910/1919|2008-05,,"Educational use only, no other permissions given. U.S. and international copyright laws may protect this digital object. Commercial use or distribution of the object is not permitted without prior permission of the copyright holder.","Iowa City Town and Campus Scenes|Frederick W. Kent Collection of Photographs, 1866-2000|http://www.lib.uiowa.edu/collguides/?RG30.0001.01|Prints|Events and activities|Parades, Miscellaneous|Parades, Miscellaneous|Scanned with Ricoh Aficio 3228C @ 600 ppi, full color. Master image saved in TIFF format.",9|14,,"Still image|Photographs; Postcards|jpeg",RG30.0001.01|https://digital.lib.uiowa.edu/,,,,,,,,,,,,,,,,,,,,,,,,,,,,,,,,,,,,,,,,,,,,,,,,"<a href=""https://digital.lib.uiowa.edu/"" target=""_blank"">View this item in its source respository</a>",,,,,,,,,,,,,,,,,,,,,,,,,,,,,https://www.iowaheritage.org/files/original/b06334480a652ec212cfef5ef4657e81.jpg,"Remote Item","Iowa City Town and Campus Scenes",1,0
24934,https://www.iowaheritage.org/items/show/24934,"Baseball players in parade for Senior Frolic, The University of Iowa, 1910s","Universities & colleges|University of Iowa|United States -- Iowa -- Iowa City|1910-1920|Baseball players|Celebrations|Trucks|Parades & processions","Senior Frolic was the senior class's annual commencement week celebration. The first commencement frolic took place in 1909.","Kent, Frederick W. (Frederick Wallace), 1894-1984",,"University of Iowa. Libraries. University Archives",1910/1919|2008-05,,"Educational use only, no other permissions given. U.S. and international copyright laws may protect this digital object. Commercial use or distribution of the object is not permitted without prior permission of the copyright holder.","Iowa City Town and Campus Scenes|Frederick W. Kent Collection of Photographs, 1866-2000|http://www.lib.uiowa.edu/collguides/?RG30.0001.01|Prints|Events and activities|Senior Frolic|Senior Frolic|Scanned with Ricoh Aficio 3228C @ 600 ppi, full color. Master image saved in TIFF format.",9|14,,"Still image|Photographs; Postcards|jpeg",RG30.0001.01|https://digital.lib.uiowa.edu/,,,,,,,,,,,,,,,,,,,,,,,,,,,,,,,,,,,,,,,,,,,,,,,,"<a href=""https://digital.lib.uiowa.edu/"" target=""_blank"">View this item in its source respository</a>",,,,,,,,,,,,,,,,,,,,,,,,,,,,,https://www.iowaheritage.org/files/original/1a5de1f49eb7b33b70cd640361f28b31.jpg,"Remote Item","Iowa City Town and Campus Scenes",1,0
24548,https://www.iowaheritage.org/items/show/24548,"Bicyclists in Mecca Day parade, The University of Iowa, 1922","Universities & colleges|University of Iowa|United States -- Iowa -- Iowa City|1920-1930|Parades & processions|Cyclists|Bicycles & tricycles|Football players","Mecca Day was put on by the College of Engineers. The name Mecca derives from the first letters of the names of  the engineerng departments:  mechanical, electrical, civil, chemical, and architectural.  Mecca Day events included a parade highlighting progress in engineering plus more humorous floats; in the evening was a play put on by engineering students.","Kent, Frederick W. (Frederick Wallace), 1894-1984",,"University of Iowa. Libraries. University Archives",1922|2008-05,,"Educational use only, no other permissions given. U.S. and international copyright laws may protect this digital object. Commercial use or distribution of the object is not permitted without prior permission of the copyright holder.","Iowa City Town and Campus Scenes|Frederick W. Kent Collection of Photographs, 1866-2000|http://www.lib.uiowa.edu/collguides/?RG30.0001.01|Prints|Events and activities|Parades, Mecca Day|Parades, Mecca Day|Scanned with Ricoh Aficio 3228C @ 600 ppi, full color. Master image saved in TIFF format.",9|14,,"Still image|Photographs; Postcards|jpeg",RG30.0001.01|https://digital.lib.uiowa.edu/,,,,,,,,,,,,,,,,,,,,,,,,,,,,,,,,,,,,,,,,,,,,,,,,"<a href=""https://digital.lib.uiowa.edu/"" target=""_blank"">View this item in its source respository</a>",,,,,,,,,,,,,,,,,,,,,,,,,,,,,https://www.iowaheritage.org/files/original/56220593c4bc40fc5df8f555f47993a8.jpg,"Remote Item","Iowa City Town and Campus Scenes",1,0
24379,https://www.iowaheritage.org/items/show/24379,"Bird costumes on Mecca Day, The University of Iowa, 1916","Universities & colleges|University of Iowa|United States -- Iowa -- Iowa City|1910-1920|Parades & processions|Celebrations|Costumes|Arts & crafts","Mecca Day was put on by the College of Engineers. The name Mecca derives from the first letters of the names of  the engineerng departments:  mechanical, electrical, civil, chemical, and architectural.  Mecca Day events included a parade highlighting progress in engineering plus more humorous floats; in the evening was a play put on by engineering students.","Kent, Frederick W. (Frederick Wallace), 1894-1984",,"University of Iowa. Libraries. University Archives",1916|2008-05,,"Educational use only, no other permissions given. U.S. and international copyright laws may protect this digital object. Commercial use or distribution of the object is not permitted without prior permission of the copyright holder.","Iowa City Town and Campus Scenes|Frederick W. Kent Collection of Photographs, 1866-2000|http://www.lib.uiowa.edu/collguides/?RG30.0001.01|Prints|Events and activities|Parades, Mecca Day|Parades, Mecca Day|Scanned with Ricoh Aficio 3228C @ 600 ppi, full color. Master image saved in TIFF format.",9|14,,"Still image|Photographs; Postcards|jpeg",RG30.0001.01|https://digital.lib.uiowa.edu/,,,,,,,,,,,,,,,,,,,,,,,,,,,,,,,,,,,,,,,,,,,,,,,,"<a href=""https://digital.lib.uiowa.edu/"" target=""_blank"">View this item in its source respository</a>",,,,,,,,,,,,,,,,,,,,,,,,,,,,,https://www.iowaheritage.org/files/original/1d9ffe21ec6aadb796d487949c79b29b.jpg,"Remote Item","Iowa City Town and Campus Scenes",1,0
24584,https://www.iowaheritage.org/items/show/24584,"Boys on Mecca Day parade float mocking law students and their Law Jubilee, The University of Iowa 1922","Universities & colleges|University of Iowa|United States -- Iowa -- Iowa City|1920-1930|Parades & processions|Celebrations|Floats (Parades)|Carts & wagons|Bicycles & tricycles|Boys","A rivalry existed between the law and engineering students, and the law students' Law Jubilee was an evening of satirical skits and musical numbers scheduled to coincide with Mecca Day. Mecca Day was put on by the College of Engineers. The name Mecca derives from the first letters of the names of  the engineerng departments:  mechanical, electrical, civil, chemical, and architectural.  Mecca Day events included a parade highlighting progress in engineering plus more humorous floats; in the evening was a play put on by engineering students.","Kent, Frederick W. (Frederick Wallace), 1894-1984",,"University of Iowa. Libraries. University Archives",1922|2008-05,,"Educational use only, no other permissions given. U.S. and international copyright laws may protect this digital object. Commercial use or distribution of the object is not permitted without prior permission of the copyright holder.","Iowa City Town and Campus Scenes|Frederick W. Kent Collection of Photographs, 1866-2000|http://www.lib.uiowa.edu/collguides/?RG30.0001.01|Prints|Events and activities|Parades, Mecca Day|Parades, Mecca Day|Scanned with Ricoh Aficio 3228C @ 600 ppi, full color. Master image saved in TIFF format.",9|14,,"Still image|Photographs; Postcards|jpeg",RG30.0001.01|https://digital.lib.uiowa.edu/,,,,,,,,,,,,,,,,,,,,,,,,,,,,,,,,,,,,,,,,,,,,,,,,"<a href=""https://digital.lib.uiowa.edu/"" target=""_blank"">View this item in its source respository</a>",,,,,,,,,,,,,,,,,,,,,,,,,,,,,https://www.iowaheritage.org/files/original/16bb4c1a525ab08e53ca6682342a24fa.jpg,"Remote Item","Iowa City Town and Campus Scenes",1,0
68118,https://www.iowaheritage.org/items/show/68118,"BPOE parade float, Marshalltown, Iowa, August, 1910","Parades & processions|Floats (Parades)|Kuchemann, Augusta|Elks (Fraternal order)|United States -- Iowa -- Marshalltown|1910-1920","Note on verso from ""B.C.O."" to Mrs. Augusta Kuchemann in Galena, Ill. describing a week's activities in Marshalltown, Iowa.",unknown,,"University of Iowa. Libraries. Iowa Women's Archives",1910-08|2006-09-20,,"No known copyright restrictions.","Noble Photographs|Noble Photograph collection|http://www.lib.uiowa.edu/collguides/?IWA0031",9|14,,"Still image; Text|Photographic postcards; Correspondence|jpeg",IWA0031|160192410|http://digital.lib.uiowa.edu/cdm/ref/collection/noble/id/23,,,,,,,,,,,,,,,,,,,,,,,,,,,,,,,,,,,,,,,,,,,,,,,,"<a href=""http://digital.lib.uiowa.edu/cdm/ref/collection/noble/id/23"" target=""_blank"">View this item in its source respository</a>",,,,,,,,,,,,,,,,,,,,,,,,,,,,,https://www.iowaheritage.org/files/original/a0643b56b5656797d71473fa90d24796.jpg,"Remote Item","Mary Noble Historical Photograph Collection",1,0
24498,https://www.iowaheritage.org/items/show/24498,"Brewery equipment on float in Mecca Day parade, The University of Iowa, 1920","Universities & colleges|University of Iowa|United States -- Iowa -- Iowa City|1920-1930|Parades & processions|Floats (Parades)|Brewing industry|Trucks","Mecca Day was put on by the College of Engineers. The name Mecca derives from the first letters of the names of  the engineerng departments:  mechanical, electrical, civil, chemical, and architectural.  Mecca Day events included a parade highlighting progress in engineering plus more humorous floats; in the evening was a play put on by engineering students.","Kent, Frederick W. (Frederick Wallace), 1894-1984",,"University of Iowa. Libraries. University Archives",1920|2008-05,,"Educational use only, no other permissions given. U.S. and international copyright laws may protect this digital object. Commercial use or distribution of the object is not permitted without prior permission of the copyright holder.","Iowa City Town and Campus Scenes|Frederick W. Kent Collection of Photographs, 1866-2000|http://www.lib.uiowa.edu/collguides/?RG30.0001.01|Prints|Events and activities|Parades, Mecca Day|Parades, Mecca Day|Scanned with Ricoh Aficio 3228C @ 600 ppi, full color. Master image saved in TIFF format.",9|14,,"Still image|Photographs; Postcards|jpeg",RG30.0001.01|https://digital.lib.uiowa.edu/,,,,,,,,,,,,,,,,,,,,,,,,,,,,,,,,,,,,,,,,,,,,,,,,"<a href=""https://digital.lib.uiowa.edu/"" target=""_blank"">View this item in its source respository</a>",,,,,,,,,,,,,,,,,,,,,,,,,,,,,https://www.iowaheritage.org/files/original/c8f56607974d7929961edea14cc46427.jpg,"Remote Item","Iowa City Town and Campus Scenes",1,0
24505,https://www.iowaheritage.org/items/show/24505,"Bugle boys in blackface on horse in Mecca Day parade, The University of Iowa, 1920","Universities & colleges|University of Iowa|United States -- Iowa -- Iowa City|1920-1930|Parades & processions|Horses|Bugles","Mecca Day was put on by the College of Engineers. The name Mecca derives from the first letters of the names of  the engineerng departments:  mechanical, electrical, civil, chemical, and architectural.  Mecca Day events included a parade highlighting progress in engineering plus more humorous floats; in the evening was a play put on by engineering students.","Kent, Frederick W. (Frederick Wallace), 1894-1984",,"University of Iowa. Libraries. University Archives",1920|2008-05,,"Educational use only, no other permissions given. U.S. and international copyright laws may protect this digital object. Commercial use or distribution of the object is not permitted without prior permission of the copyright holder.","Iowa City Town and Campus Scenes|Frederick W. Kent Collection of Photographs, 1866-2000|http://www.lib.uiowa.edu/collguides/?RG30.0001.01|Prints|Events and activities|Parades, Mecca Day|Parades, Mecca Day|Scanned with Ricoh Aficio 3228C @ 600 ppi, full color. Master image saved in TIFF format.",9|14,,"Still image|Photographs; Postcards|jpeg",RG30.0001.01|https://digital.lib.uiowa.edu/,,,,,,,,,,,,,,,,,,,,,,,,,,,,,,,,,,,,,,,,,,,,,,,,"<a href=""https://digital.lib.uiowa.edu/"" target=""_blank"">View this item in its source respository</a>",,,,,,,,,,,,,,,,,,,,,,,,,,,,,https://www.iowaheritage.org/files/original/6e2687ec932fde0e983c723aba6441e8.jpg,"Remote Item","Iowa City Town and Campus Scenes",1,0
24117,https://www.iowaheritage.org/items/show/24117,"Burlington, Iowa marching band in parade, The University of Iowa, 1910s","Universities & colleges|University of Iowa|United States -- Iowa -- Iowa City|1910-1920|Parades & processions|Marching bands|United States -- Iowa -- Burlington",,"Kent, Frederick W. (Frederick Wallace), 1894-1984",,"University of Iowa. Libraries. University Archives",1910/1919|2008-05,,"Educational use only, no other permissions given. U.S. and international copyright laws may protect this digital object. Commercial use or distribution of the object is not permitted without prior permission of the copyright holder.","Iowa City Town and Campus Scenes|Frederick W. Kent Collection of Photographs, 1866-2000|http://www.lib.uiowa.edu/collguides/?RG30.0001.01|Prints|Events and activities|Parades, Miscellaneous|Parades, Miscellaneous|Scanned with Ricoh Aficio 3228C @ 600 ppi, full color. Master image saved in TIFF format.",9|14,,"Still image|Photographs; Postcards|jpeg",RG30.0001.01|https://digital.lib.uiowa.edu/,,,,,,,,,,,,,,,,,,,,,,,,,,,,,,,,,,,,,,,,,,,,,,,,"<a href=""https://digital.lib.uiowa.edu/"" target=""_blank"">View this item in its source respository</a>",,,,,,,,,,,,,,,,,,,,,,,,,,,,,https://www.iowaheritage.org/files/original/ebb6538ea1f73bec498a3f4a9e458495.jpg,"Remote Item","Iowa City Town and Campus Scenes",1,0
24472,https://www.iowaheritage.org/items/show/24472,"Cable car float in Mecca Day parade, The University of Iowa, 1919","Universities & colleges|University of Iowa|United States -- Iowa -- Iowa City|1910-1920|Parades & processions|Floats (Parades)|Cable railroads","Mecca Day was put on by the College of Engineers. The name Mecca derives from the first letters of the names of  the engineerng departments:  mechanical, electrical, civil, chemical, and architectural.  Mecca Day events included a parade highlighting progress in engineering plus more humorous floats; in the evening was a play put on by engineering students.","Kent, Frederick W. (Frederick Wallace), 1894-1984",,"University of Iowa. Libraries. University Archives",1919|2008-05,,"Educational use only, no other permissions given. U.S. and international copyright laws may protect this digital object. Commercial use or distribution of the object is not permitted without prior permission of the copyright holder.","Iowa City Town and Campus Scenes|Frederick W. Kent Collection of Photographs, 1866-2000|http://www.lib.uiowa.edu/collguides/?RG30.0001.01|Prints|Events and activities|Parades, Mecca Day|Parades, Mecca Day|Scanned with Ricoh Aficio 3228C @ 600 ppi, full color. Master image saved in TIFF format.",9|14,,"Still image|Photographs; Postcards|jpeg",RG30.0001.01|https://digital.lib.uiowa.edu/,,,,,,,,,,,,,,,,,,,,,,,,,,,,,,,,,,,,,,,,,,,,,,,,"<a href=""https://digital.lib.uiowa.edu/"" target=""_blank"">View this item in its source respository</a>",,,,,,,,,,,,,,,,,,,,,,,,,,,,,https://www.iowaheritage.org/files/original/6c7ded4ec0655f0b497d010aef118541.jpg,"Remote Item","Iowa City Town and Campus Scenes",1,0
