 




﻿"Item Id","Item URI","Dublin Core:Title","Dublin Core:Subject","Dublin Core:Description","Dublin Core:Creator","Dublin Core:Source","Dublin Core:Publisher","Dublin Core:Date","Dublin Core:Contributor","Dublin Core:Rights","Dublin Core:Relation","Dublin Core:Format","Dublin Core:Language","Dublin Core:Type","Dublin Core:Identifier","Dublin Core:Coverage","Item Type Metadata:Text","Item Type Metadata:Interviewer","Item Type Metadata:Interviewee","Item Type Metadata:Location","Item Type Metadata:Transcription","Item Type Metadata:Local URL","Item Type Metadata:Original Format","Item Type Metadata:Physical Dimensions","Item Type Metadata:Duration","Item Type Metadata:Compression","Item Type Metadata:Producer","Item Type Metadata:Director","Item Type Metadata:Bit Rate/Frequency","Item Type Metadata:Time Summary","Item Type Metadata:Email Body","Item Type Metadata:Subject Line","Item Type Metadata:From","Item Type Metadata:To","Item Type Metadata:CC","Item Type Metadata:BCC","Item Type Metadata:Number of Attachments","Item Type Metadata:Standards","Item Type Metadata:Objectives","Item Type Metadata:Materials","Item Type Metadata:Lesson Plan Text","Item Type Metadata:URL","Item Type Metadata:Event Type","Item Type Metadata:Participants","Item Type Metadata:Birth Date","Item Type Metadata:Birthplace","Item Type Metadata:Death Date","Item Type Metadata:Occupation","Item Type Metadata:Biographical Text","Item Type Metadata:Bibliography","Item Type Metadata:Digital Reproduction Information","Item Type Metadata:Repository","Item Type Metadata:Repository Collection","Item Type Metadata:Contact information.","Item Type Metadata:File Name","Item Type Metadata:Notes","Item Type Metadata:Digital item created","Item Type Metadata:Digital item modified","Item Type Metadata:Executive Orders","Item Type Metadata:Record Created","Item Type Metadata:Record Modified","Item Type Metadata:Transcription2","Item Type Metadata:Source URL","Omeka Legacy File:Additional Creator","Omeka Legacy File:Transcriber","Omeka Legacy File:Producer","Omeka Legacy File:Render Device","Omeka Legacy File:Render Details","Omeka Legacy File:Capture Date","Omeka Legacy File:Capture Device","Omeka Legacy File:Capture Details","Omeka Legacy File:Change History","Omeka Legacy File:Watermark","Omeka Legacy File:Encryption","Omeka Legacy File:Compression","Omeka Legacy File:Post Processing","Omeka Image File:Width","Omeka Image File:Height","Omeka Image File:Bit Depth","Omeka Image File:Channels","Omeka Image File:Exif String","Omeka Image File:Exif Array","Omeka Image File:IPTC String","Omeka Image File:IPTC Array","Omeka Video File:Bitrate","Omeka Video File:Duration","Omeka Video File:Sample Rate","Omeka Video File:Codec","Omeka Video File:Width","Omeka Video File:Height",tags,file,itemType,collection,public,featured
17469,https://www.iowaheritage.org/items/show/17469,"Joseph Rosenfield, 1982-2000","Men|Rosenfield, Joseph|Delta Queen (Steamboat)|United States -- Iowa|1980-1990|Business people|Lawyers|Philanthropists|Women|Activists|Authors|Civic leaders|Families|Birthdays|Birthday parties|Noun, Louise R.|Benshoof, Janet|Buffett, Susie|Burke, Donna|Chrystal, John|Duchen, Chuck|Hutchison, Tom|Johnston, Dan|Knapp, Bill|Knapp, Susan|Murphy, June|Rosenfield, Alan|Sandler, Mildred|Blosten, Louise|Osherenko, Margo|Wurtz, Babette|Greer, Madeline|Hunter, Pete|United States -- Iowa -- Grinnell|1990-2000",,unknown,,"University of Iowa. Libraries. Iowa Women's Archives",1982-2000|2007-09-13,,"Educational use only, no other permissions given. U.S. and international copyright laws may protect this item. Commercial use or distribution of this digital object is not permitted without written permission of the Iowa Women's Archives.","Iowa Women's Archives Founders|Louise Rosenfield Noun Papers, 1926-2002|http://www.lib.uiowa.edu/collguides/?IWA0035",jpeg,,"Still image|Photographs",IWA0035|https://digital.lib.uiowa.edu/,,,,,,,,,,,,,,,,,,,,,,,,,,,,,,,,,,,,,,,,,,,,,,,,"<a href=""https://digital.lib.uiowa.edu/"" target=""_blank"">View this item in its source respository</a>",,,,,,,,,,,,,,,,,,,,,,,,,,,,,https://www.iowaheritage.org/files/original/65206611782567fd5f35683ad69fb59f.jpg,"Remote Item","Iowa Women's Archives Founders",1,0
68602,https://www.iowaheritage.org/items/show/68602,"Journey to autonomy, a memoir, 1990","Women's suffrage|Noun, Louise R.|University of Iowa. Libraries. Iowa Women's Archives|United States -- Iowa|1990-2000|Women|Activists|Organizations|Civic leaders",,"Noun, Louise R.",,"Iowa State University Press|Iowa Women's Archives",1990|2011-01-27,,"Educational use only, no other permissions given. U.S. and International copyright laws may protect this item. Commercial use or distribution of this digital object is not permitted without written permission of the Iowa Women's Archives.","Iowa Women's Suffrage|Printed Works Collection|book, copyright 1996",jpeg|22|14,,"Text; Still image|Memoirs; Histories","IWAPWC|suf-PWC-03; 001953772|http://digital.lib.uiowa.edu/cdm/ref/collection/suffrage/id/2683",,,,,,,,,,,,,,,,,,,,,,,,,,,,,,,,,,,,,,,,,,,,,,,,"<a href=""http://digital.lib.uiowa.edu/cdm/ref/collection/suffrage/id/2683"" target=""_blank"">View this item in its source respository</a>",,,,,,,,,,,,,,,,,,,,,,,,,,,,,https://www.iowaheritage.org/files/original/d56b791b0d452a4f8cf81af7a693056f.jpg,"Remote Item",,1,0
68600,https://www.iowaheritage.org/items/show/68600,"Leader and pariah: Annie Savery and the campaign for women's rights in Iowa 1868-1891, 2002","Women's suffrage|Savery, Annie|United States -- Iowa|2000-2010|Women|Activists|Organizations|Civic leaders|Suffragists",,"Noun, Louise R.; Bohlmann, Rachel E.",,"University of Iowa. Libraries. Iowa Women's Archives|Iowa Women's Archives",2002|2011-01-27,,"Educational use only, no other permissions given. U.S. and International copyright laws may protect this item. Commercial use or distribution of this digital object is not permitted without written permission of the Iowa Women's Archives.","Iowa Women's Suffrage|Printed Works Collection|book, copyright 2002",jpeg|25|17,,"Text|Biographies; Histories","IWAPWC|suf-PWC-01; 002892841|http://digital.lib.uiowa.edu/cdm/ref/collection/suffrage/id/2524",,,,,,,,,,,,,,,,,,,,,,,,,,,,,,,,,,,,,,,,,,,,,,,,"<a href=""http://digital.lib.uiowa.edu/cdm/ref/collection/suffrage/id/2524"" target=""_blank"">View this item in its source respository</a>",,,,,,,,,,,,,,,,,,,,,,,,,,,,,https://www.iowaheritage.org/files/original/fb7362b0b3626d9525f82dc2f7369011.jpg,"Remote Item",,1,0
17441,https://www.iowaheritage.org/items/show/17441,"Louise Noun and Kay Stroud, [Des Moines Register and] Tribune, November 23, 1950","Women|Noun, Louise R.|Des Moines register|United States -- Iowa -- Des Moines|1950-1960|Activists|Art collectors|Authors|Civic leaders|Stroud, Katherine, 1913-1996",,unknown,,"University of Iowa. Libraries. Iowa Women's Archives",1950-11-23|2007-09-13,,"Educational use only, no other permissions given. U.S. and international copyright laws may protect this item. Commercial use or distribution of this digital object is not permitted without written permission of the Iowa Women's Archives.","Iowa Women's Archives Founders|Louise Rosenfield Noun Papers, 1926-2002|http://www.lib.uiowa.edu/collguides/?IWA0035|Assorted photographs of Louse Noun, 1950-2000",jpeg,,"Still image|Photographs",IWA0035|https://digital.lib.uiowa.edu/,,,,,,,,,,,,,,,,,,,,,,,,,,,,,,,,,,,,,,,,,,,,,,,,"<a href=""https://digital.lib.uiowa.edu/"" target=""_blank"">View this item in its source respository</a>",,,,,,,,,,,,,,,,,,,,,,,,,,,,,https://www.iowaheritage.org/files/original/ce31777fde4b5e8ac6930f2757a9e8e6.jpg,"Remote Item","Iowa Women's Archives Founders",1,0
17461,https://www.iowaheritage.org/items/show/17461,"Louise Noun scrapbook, Des Moines, Iowa, 1949-2000","Women|Museum trustees|Noun, Louise R.|Younkers, Inc.|United States -- Iowa -- Des Moines|1940-1950|Activists|Authors|Art collectors|Civic leaders|Philanthropists|Civil liberties|Freedom of speech|Families|Artists|Political elections|Capitols|Weddings|State government|Business people|Brides|Governors|Journalists|Men|Draft protests|Demonstrations|Student movements|Site plans|Awards|Historic buildings|Community service|Family history|Demetrion, James|Flora, Jason|Frankel, Babette|Johnston, Dan|Noun, Susan|Noun, Maurice|Rosenfield, Joseph|Rosenfield, Meyer|Rosenfield, Rose|Rosenfield, Ruth|Duchen, Chuck|Dunlap, Flora|Sostrin, Morey|Flora, Ronald|Kirsch, Dwight, b. 1899|Flansburg, James Sherman, 1932-|Hughes, Harold E. (Harold Everett), 1922-|Darling, Jay N. (Jay Norwood), 1876-1962|Tinker, John|Tinker, Mary Beth|Smith, Stephen|Dunlap, Leslie W. (Leslie Whittaker), 1911-|Mattern, Karl|Tilson, Joe, 1928-|Murphy, Donald R.|Schramm, James S.|Strebelle, Olivier, 1927-|Sims, Susan|Lasansky, Mauricio, 1914-|Biederman, Charles Joseph, 1906-|Shane, George Walker, 1906-1969|Roadside Settlement House, Des Moines, Ia.|Christian Science Monitor (Newspaper)|Piney Woods School|Des Moines register|Binau Blatt|Iowa Federationist|The Iowan (Shenandoah, Iowa)|Des Moines Art Center|Iowa Power and Light Company|Good Government News|Grinnell College|Iowa. Capitol Planning Commission|Defender (Des Moines, Iowa)|Iowa Civil Liberties Union|American Civil Liberties Union|Iowa. Advisory Commission on Governmental Reorganization|Iowa Children's Home Society|Germany -- Binau||1950-1960|1960-1970|1970-1980|1980-1990|1990-2000",,"Noun, Louise R.",,"University of Iowa. Libraries. Iowa Women's Archives",1949-2000|2007-09-13,,"Educational use only, no other permissions given. U.S. and international copyright laws may protect this item. Commercial use or distribution of this digital object is not permitted without written permission of the Iowa Women's Archives.","Iowa Women's Archives Founders|Louise Rosenfield Noun Papers, 1926-2002|http://www.lib.uiowa.edu/collguides/?IWA0035",jpeg,,"Still image; Text|Photographs; Scrapbooks; Clippings; Correspondence; Editorial cartoons; Christmas cards; Greeting cards",IWA0035|https://digital.lib.uiowa.edu/,,,,,,,,,,,,,,,,,,,,,,,,,,,,,,,,,,,,,,,,,,,,,,,,"<a href=""https://digital.lib.uiowa.edu/"" target=""_blank"">View this item in its source respository</a>",,,,,,,,,,,,,,,,,,,,,,,,,,,,,https://www.iowaheritage.org/files/original/0fa29fde763b81b0281eca2f269593b5.jpg,"Remote Item","Iowa Women's Archives Founders",1,0
17482,https://www.iowaheritage.org/items/show/17482,"Louise Noun tribute dinner, Des Moines, Iowa, May 1990","Women|Noun, Louise R.|United States -- Iowa -- Des Moines|1990-2000|Activists|Art collectors|Authors|Business people|Civic leaders|Politicians|Men|Conlin, Roxanne Barton|Johnston, Dan|Morrissey, Claudia|Smith, Mary Louise|Stone, Kay|Talbott, Irene|Wilson, Marie (Marie C.)|Wood, Kathy|Benware, Virginia|Blosten, Louise|Lynner, Darwin|Lynner, Ruth|Overholser, Geneva|Winklepleck, Judy|Green, Mae|Purdy, Grant|Meers, Geneva|Knight, Rosalie|Clark, Beverly|Hawk, Geneva|Rome, Topsy|Donhoue, Pat|Turner, Betty|Parker, Ann|Hayes, Carol|Juny, Mitzi|Claussen, Beverly|Knox, Lorena|Sidles, Kathy|Weiss, Elise|May, Aileen",,unknown,,"University of Iowa. Libraries. Iowa Women's Archives",1990-05|2007-09-13,,"Educational use only, no other permissions given. U.S. and international copyright laws may protect this item. Commercial use or distribution of this digital object is not permitted without written permission of the Iowa Women's Archives.","Iowa Women's Archives Founders|Louise Rosenfield Noun Papers, 1926-2002|http://www.lib.uiowa.edu/collguides/?IWA0035",jpeg,,"Still image|Photographs",IWA0035|https://digital.lib.uiowa.edu/,,,,,,,,,,,,,,,,,,,,,,,,,,,,,,,,,,,,,,,,,,,,,,,,"<a href=""https://digital.lib.uiowa.edu/"" target=""_blank"">View this item in its source respository</a>",,,,,,,,,,,,,,,,,,,,,,,,,,,,,https://www.iowaheritage.org/files/original/f106b8495e5b708fc64c7a857bfe88d0.jpg,"Remote Item","Iowa Women's Archives Founders",1,0
17443,https://www.iowaheritage.org/items/show/17443,"Louise Noun, Bill Knapp, Hillary Clinton, and Liz and David Kruidenier, Iowa, July 2000","Women|Noun, Louise R.|United States -- Iowa|1990-2000|Presidents' spouses|Men|Civic leaders|Business people|Clinton, Hillary Rodham|Knapp, Bill|Kruidenier, David|Kruidenier, Liz",,unknown,,"University of Iowa. Libraries. Iowa Women's Archives",2000|2007-09-13,,"Educational use only, no other permissions given. U.S. and international copyright laws may protect this item. Commercial use or distribution of this digital object is not permitted without written permission of the Iowa Women's Archives.","Iowa Women's Archives Founders|Louise Rosenfield Noun Papers, 1926-2002|http://www.lib.uiowa.edu/collguides/?IWA0035|LN with other people, 1991-2000",jpeg,,"Still image|Photographs",IWA0035|https://digital.lib.uiowa.edu/,,,,,,,,,,,,,,,,,,,,,,,,,,,,,,,,,,,,,,,,,,,,,,,,"<a href=""https://digital.lib.uiowa.edu/"" target=""_blank"">View this item in its source respository</a>",,,,,,,,,,,,,,,,,,,,,,,,,,,,,https://www.iowaheritage.org/files/original/c4de793bc75e17356f4740f48f4bea39.jpg,"Remote Item","Iowa Women's Archives Founders",1,0
35636,https://www.iowaheritage.org/items/show/35636,"Mary Louise Smith at the 15th session of United Nations Population Commission, Geneva, Switzerland, 1969","Women|Smith, Mary Louise|United Nations. Population Commission|Switzerland -- Geneva|1960-1970|Men|Receptions|Civic leaders",,"Vuarchex, Gaston G.",,"University of Iowa. Libraries. Iowa Women's Archives",1969|2007-09-13,,"Educational use only, no other permissions given. U.S. and international copyright laws may protect this item. Commercial use or distribution of this digital object is not permitted without written permission of the Iowa Women's Archives.","Iowa Women's Archives Founders|Mary Louise Smith Papers, 1914-1997|http://lib.uiowa.edu/collguides/?IWA0027|MLS et al, 1968-1972, misc.",jpeg,,"Still image|Photographs",IWA0027|https://digital.lib.uiowa.edu/,,,,,,,,,,,,,,,,,,,,,,,,,,,,,,,,,,,,,,,,,,,,,,,,"<a href=""https://digital.lib.uiowa.edu/"" target=""_blank"">View this item in its source respository</a>",,,,,,,,,,,,,,,,,,,,,,,,,,,,,https://www.iowaheritage.org/files/original/23d36002e0a6c23ef146c4add0dbc7fa.jpg,"Remote Item","Iowa Women's Archives Founders",1,0
35664,https://www.iowaheritage.org/items/show/35664,"Mary Louise Smith presenting a report at the Iowa Women's Archives board meeting, Iowa City, Iowa, October 1991","Women|Smith, Mary Louise|University of Iowa|United States -- Iowa -- Iowa City|1990-2000|Activists|Civic leaders|Public speaking|University of Iowa. Libraries. Iowa Women's Archives|","University of Iowa Foundation meeting",unknown,,"University of Iowa. Libraries. Iowa Women's Archives",1991-10|2007-09-13,,"Educational use only, no other permissions given. U.S. and international copyright laws may protect this item. Commercial use or distribution of this digital object is not permitted without written permission of the Iowa Women's Archives.","Iowa Women's Archives Founders|Mary Louise Smith Papers, 1914-1997|http://lib.uiowa.edu/collguides/?IWA0027",jpeg,,"Still image|Photographs",IWA0027|https://digital.lib.uiowa.edu/,,,,,,,,,,,,,,,,,,,,,,,,,,,,,,,,,,,,,,,,,,,,,,,,"<a href=""https://digital.lib.uiowa.edu/"" target=""_blank"">View this item in its source respository</a>",,,,,,,,,,,,,,,,,,,,,,,,,,,,,https://www.iowaheritage.org/files/original/2c5db106cdd10fcdae2d1de558082841.jpg,"Remote Item","Iowa Women's Archives Founders",1,0
17403,https://www.iowaheritage.org/items/show/17403,"Mary Louise Smith with attendees of the New Older Woman Conference, Big Sur, Calif., July 1992","Women|Smith, Mary Louise|United States -- California -- Big Sur|1990-2000|Activists|Politicians|Civic leaders|Mudd, Virginia|Zuckerman, Eleanor|Downes Baskin, Peggy|Lilienthal, Sally|Falkenstein, Claire, 1908-1997|Faul, Pat|Tinker, Irene|Tuttle, Ilene|Reemtsma, Judy|Yeo, Gwen|Porcino, Jane|Paige, Judy|Cater, Libby A., 1925-",,unknown,,"University of Iowa. Libraries. Iowa Women's Archives",1992-07|2007-09-13,,"Educational use only, no other permissions given. U.S. and international copyright laws may protect this item. Commercial use or distribution of this digital object is not permitted without written permission of the Iowa Women's Archives.","Iowa Women's Archives Founders|Mary Louise Smith Papers, 1914-1997|http://lib.uiowa.edu/collguides/?IWA0027",jpeg,,"Still image|Photographs; Group portraits",IWA0027|https://digital.lib.uiowa.edu/,,,,,,,,,,,,,,,,,,,,,,,,,,,,,,,,,,,,,,,,,,,,,,,,"<a href=""https://digital.lib.uiowa.edu/"" target=""_blank"">View this item in its source respository</a>",,,,,,,,,,,,,,,,,,,,,,,,,,,,,https://www.iowaheritage.org/files/original/5ada4ebae96b6251c22f756df11058fc.jpg,"Remote Item","Iowa Women's Archives Founders",1,0
