 




﻿"Item Id","Item URI","Dublin Core:Title","Dublin Core:Subject","Dublin Core:Description","Dublin Core:Creator","Dublin Core:Source","Dublin Core:Publisher","Dublin Core:Date","Dublin Core:Contributor","Dublin Core:Rights","Dublin Core:Relation","Dublin Core:Format","Dublin Core:Language","Dublin Core:Type","Dublin Core:Identifier","Dublin Core:Coverage","Item Type Metadata:Text","Item Type Metadata:Interviewer","Item Type Metadata:Interviewee","Item Type Metadata:Location","Item Type Metadata:Transcription","Item Type Metadata:Local URL","Item Type Metadata:Original Format","Item Type Metadata:Physical Dimensions","Item Type Metadata:Duration","Item Type Metadata:Compression","Item Type Metadata:Producer","Item Type Metadata:Director","Item Type Metadata:Bit Rate/Frequency","Item Type Metadata:Time Summary","Item Type Metadata:Email Body","Item Type Metadata:Subject Line","Item Type Metadata:From","Item Type Metadata:To","Item Type Metadata:CC","Item Type Metadata:BCC","Item Type Metadata:Number of Attachments","Item Type Metadata:Standards","Item Type Metadata:Objectives","Item Type Metadata:Materials","Item Type Metadata:Lesson Plan Text","Item Type Metadata:URL","Item Type Metadata:Event Type","Item Type Metadata:Participants","Item Type Metadata:Birth Date","Item Type Metadata:Birthplace","Item Type Metadata:Death Date","Item Type Metadata:Occupation","Item Type Metadata:Biographical Text","Item Type Metadata:Bibliography","Item Type Metadata:Digital Reproduction Information","Item Type Metadata:Repository","Item Type Metadata:Repository Collection","Item Type Metadata:Contact information.","Item Type Metadata:File Name","Item Type Metadata:Notes","Item Type Metadata:Digital item created","Item Type Metadata:Digital item modified","Item Type Metadata:Executive Orders","Item Type Metadata:Record Created","Item Type Metadata:Record Modified","Item Type Metadata:Transcription2","Item Type Metadata:Source URL","Omeka Legacy File:Additional Creator","Omeka Legacy File:Transcriber","Omeka Legacy File:Producer","Omeka Legacy File:Render Device","Omeka Legacy File:Render Details","Omeka Legacy File:Capture Date","Omeka Legacy File:Capture Device","Omeka Legacy File:Capture Details","Omeka Legacy File:Change History","Omeka Legacy File:Watermark","Omeka Legacy File:Encryption","Omeka Legacy File:Compression","Omeka Legacy File:Post Processing","Omeka Image File:Width","Omeka Image File:Height","Omeka Image File:Bit Depth","Omeka Image File:Channels","Omeka Image File:Exif String","Omeka Image File:Exif Array","Omeka Image File:IPTC String","Omeka Image File:IPTC Array","Omeka Video File:Bitrate","Omeka Video File:Duration","Omeka Video File:Sample Rate","Omeka Video File:Codec","Omeka Video File:Width","Omeka Video File:Height",tags,file,itemType,collection,public,featured
10118,https://www.iowaheritage.org/items/show/10118,"House at the original site of Atarashiki Mura, Hyuga, Japan, 1965","Collective settlements|Japanese|Atarashiki Mura|Japan -- Hyuga|1960-1970|Houses",,"Plath, David W.",,"University of Iowa. Libraries. University Archives",1965,,"Educational use only, no other permissions given. U.S. and international copyright laws may protect this item. Commercial use or distribution of this digital object is not permitted without written permission of the University Archives at The University of Iowa Libraries.","Anthropology at Iowa Digital Collection|David Plath Japanese Fieldwork Collection|David Plath Papers",5|5,,"Still image|Color slides|jpeg",PLA-slide070.jpg|https://digital.lib.uiowa.edu/,,,,,,,,,,,,,,,,,,,,,,,,,,,,,,,,,,,,,,,,,,,,,,,,"<a href=""https://digital.lib.uiowa.edu/"" target=""_blank"">View this item in its source respository</a>",,,,,,,,,,,,,,,,,,,,,,,,,,,,,https://www.iowaheritage.org/files/original/4f2e36b7fd141c732e172ffe30431a4c.jpg,"Remote Item","African American Women in Iowa Collection",1,0
10116,https://www.iowaheritage.org/items/show/10116,"House at the original site of Atarashiki Mura, Hyuga, Japan, 1965","Collective settlements|Japanese|Atarashiki Mura|Japan -- Hyuga|1960-1970|Houses",,"Plath, David W.",,"University of Iowa. Libraries. University Archives",1965,,"Educational use only, no other permissions given. U.S. and international copyright laws may protect this item. Commercial use or distribution of this digital object is not permitted without written permission of the University Archives at The University of Iowa Libraries.","Anthropology at Iowa Digital Collection|David Plath Japanese Fieldwork Collection|David Plath Papers",5|5,,"Still image|Color slides|jpeg",PLA-slide068.jpg|https://digital.lib.uiowa.edu/,,,,,,,,,,,,,,,,,,,,,,,,,,,,,,,,,,,,,,,,,,,,,,,,"<a href=""https://digital.lib.uiowa.edu/"" target=""_blank"">View this item in its source respository</a>",,,,,,,,,,,,,,,,,,,,,,,,,,,,,https://www.iowaheritage.org/files/original/318dd48fd460952d7d76fb25f7e1effb.jpg,"Remote Item","African American Women in Iowa Collection",1,0
10115,https://www.iowaheritage.org/items/show/10115,"House at the original site of Atarashiki Mura, Hyuga, Japan, 1965","Collective settlements|Japanese|Atarashiki Mura|Japan -- Hyuga|1960-1970|Houses",,"Plath, David W.",,"University of Iowa. Libraries. University Archives",1965,,"Educational use only, no other permissions given. U.S. and international copyright laws may protect this item. Commercial use or distribution of this digital object is not permitted without written permission of the University Archives at The University of Iowa Libraries.","Anthropology at Iowa Digital Collection|David Plath Japanese Fieldwork Collection|David Plath Papers",5|5,,"Still image|Color slides|jpeg",PLA-slide067.jpg|https://digital.lib.uiowa.edu/,,,,,,,,,,,,,,,,,,,,,,,,,,,,,,,,,,,,,,,,,,,,,,,,"<a href=""https://digital.lib.uiowa.edu/"" target=""_blank"">View this item in its source respository</a>",,,,,,,,,,,,,,,,,,,,,,,,,,,,,https://www.iowaheritage.org/files/original/3cd3764a1c37e8c5b058282852b35785.jpg,"Remote Item","African American Women in Iowa Collection",1,0
10119,https://www.iowaheritage.org/items/show/10119,"Garden at the original site of Atarashiki Mura, Hyuga, Japan, 1965","Collective settlements|Japanese|Atarashiki Mura|Japan -- Hyuga|1960-1970|Gardens",,"Plath, David W.",,"University of Iowa. Libraries. University Archives",1965,,"Educational use only, no other permissions given. U.S. and international copyright laws may protect this item. Commercial use or distribution of this digital object is not permitted without written permission of the University Archives at The University of Iowa Libraries.","Anthropology at Iowa Digital Collection|David Plath Japanese Fieldwork Collection|David Plath Papers",5|5,,"Still image|Color slides|jpeg",PLA-slide071.jpg|https://digital.lib.uiowa.edu/,,,,,,,,,,,,,,,,,,,,,,,,,,,,,,,,,,,,,,,,,,,,,,,,"<a href=""https://digital.lib.uiowa.edu/"" target=""_blank"">View this item in its source respository</a>",,,,,,,,,,,,,,,,,,,,,,,,,,,,,https://www.iowaheritage.org/files/original/76723edeb7b265ed1312d4c81c08d796.jpg,"Remote Item","African American Women in Iowa Collection",1,0
9969,https://www.iowaheritage.org/items/show/9969,"Ferryman crossing stream to site of original Atarashiki Mura 2, Hyuga, Japan, 1965","Men|Japanese|Atarashiki Mura|Japan -- Hyuga|1960-1970|People|Ferries|Boatmen|Collective settlements|Collective farms","""To reach the original Atarashiki-mura in Hyuga one had to be ferried across a small stream. The boatman was, I think, a close friend of Mushanokoji in the founding era of A.M. in Taisho""--Notes from D. Plath.","Plath, David W.",,"University of Iowa. Libraries. University Archives",1965|2008-03-03,,"Educational use only, no other permissions given. U.S. and international copyright laws may protect this item. Commercial use or distribution of this digital object is not permitted without written permission of the University Archives at The University of Iowa Libraries.","Anthropology at Iowa Digital Collection|David Plath Japanese Fieldwork Collection|David Plath Papers|In process",,,"Still image|Photographs|jpeg",AM00.jpg|https://digital.lib.uiowa.edu/,,,,,,,,,,,,,,,,,,,,,,,,,,,,,,,,,,,,,,,,,,,,,,,,"<a href=""https://digital.lib.uiowa.edu/"" target=""_blank"">View this item in its source respository</a>",,,,,,,,,,,,,,,,,,,,,,,,,,,,,https://www.iowaheritage.org/files/original/7b4f23d3339161579580f0c7322149b8.jpg,"Remote Item","African American Women in Iowa Collection",1,0
10113,https://www.iowaheritage.org/items/show/10113,"Ferryman crossing stream to site of original Atarashiki Mura 1, Hyuga, Japan, 1965","Collective settlements|Japanese|Atarashiki Mura|Japan -- Hyuga|1960-1970|Boatmen|Boats|Men|People",,"Plath, David W.",,"University of Iowa. Libraries. University Archives",1965,,"Educational use only, no other permissions given. U.S. and international copyright laws may protect this item. Commercial use or distribution of this digital object is not permitted without written permission of the University Archives at The University of Iowa Libraries.","Anthropology at Iowa Digital Collection|David Plath Japanese Fieldwork Collection|David Plath Papers",5|5,,"Still image|Color slides|jpeg",PLA-slide065.jpg|https://digital.lib.uiowa.edu/,,,,,,,,,,,,,,,,,,,,,,,,,,,,,,,,,,,,,,,,,,,,,,,,"<a href=""https://digital.lib.uiowa.edu/"" target=""_blank"">View this item in its source respository</a>",,,,,,,,,,,,,,,,,,,,,,,,,,,,,https://www.iowaheritage.org/files/original/5f7185427cf14560c762d4afd4551e36.jpg,"Remote Item","African American Women in Iowa Collection",1,0
10005,https://www.iowaheritage.org/items/show/10005,"Communal kitchen, Atarashiki Mura commune, Hyuga, Japan, 1965","Kitchens|Japanese|Atarashiki Mura|Japan -- Hyuga|1960-1970|Collective settlements|Collective farms",,"Plath, David W.",,"University of Iowa. Libraries. University Archives",1965|2008-03-03,,"Educational use only, no other permissions given. U.S. and international copyright laws may protect this item. Commercial use or distribution of this digital object is not permitted without written permission of the University Archives at The University of Iowa Libraries.","Anthropology at Iowa Digital Collection|David Plath Japanese Fieldwork Collection|David Plath Papers|In process",,,"Still image|Photographs|jpeg",AM05.jpg|https://digital.lib.uiowa.edu/,,,,,,,,,,,,,,,,,,,,,,,,,,,,,,,,,,,,,,,,,,,,,,,,"<a href=""https://digital.lib.uiowa.edu/"" target=""_blank"">View this item in its source respository</a>",,,,,,,,,,,,,,,,,,,,,,,,,,,,,https://www.iowaheritage.org/files/original/86c6aba6115eeb336c54061016da79b5.jpg,"Remote Item","African American Women in Iowa Collection",1,0
9970,https://www.iowaheritage.org/items/show/9970,"Atarashiki Mura commune founder Mushanokoji Saneatsu, garden of his house, Tokyo, Japan, 1965","Men|Japanese|Mushanokoji, Saneatsu, 1885-1976|Atarashiki Mura|Japan -- Hyuga|1960-1970|People|Authors|Spiritual leaders|Civic leaders|Collective settlements|Collective farms",,"Plath, David W.",,"University of Iowa. Libraries. University Archives",1965|2008-03-03,,"Educational use only, no other permissions given. U.S. and international copyright laws may protect this item. Commercial use or distribution of this digital object is not permitted without written permission of the University Archives at The University of Iowa Libraries.","Anthropology at Iowa Digital Collection|David Plath Japanese Fieldwork Collection|David Plath Papers|In process",,,"Still image|Photographs|jpeg",AM01.jpg|https://digital.lib.uiowa.edu/,,,,,,,,,,,,,,,,,,,,,,,,,,,,,,,,,,,,,,,,,,,,,,,,"<a href=""https://digital.lib.uiowa.edu/"" target=""_blank"">View this item in its source respository</a>",,,,,,,,,,,,,,,,,,,,,,,,,,,,,https://www.iowaheritage.org/files/original/8425044eb0456d5fbae6c8186878a45c.jpg,"Remote Item","African American Women in Iowa Collection",1,0
10011,https://www.iowaheritage.org/items/show/10011,"""Tokko"", educational retreat for non-members, Yamagishi Kai commune, Mie-ken, Japan, 1965","Men|Japanese|Atarashiki Mura|Japan -- Hyuga|1960-1970|Women|People|Collective settlements|Collective farms",,"Plath, David W.",,"University of Iowa. Libraries. University Archives",1965|2008-03-03,,"Educational use only, no other permissions given. U.S. and international copyright laws may protect this item. Commercial use or distribution of this digital object is not permitted without written permission of the University Archives at The University of Iowa Libraries.","Anthropology at Iowa Digital Collection|David Plath Japanese Fieldwork Collection|David Plath Papers|In process",,,"Still image|Photographs|jpeg",AM11.jpg|https://digital.lib.uiowa.edu/,,,,,,,,,,,,,,,,,,,,,,,,,,,,,,,,,,,,,,,,,,,,,,,,"<a href=""https://digital.lib.uiowa.edu/"" target=""_blank"">View this item in its source respository</a>",,,,,,,,,,,,,,,,,,,,,,,,,,,,,https://www.iowaheritage.org/files/original/0b2803b56f09b7c3d0b563915e6ca7cb.jpg,"Remote Item","African American Women in Iowa Collection",1,0
