 




﻿"Item Id","Item URI","Dublin Core:Title","Dublin Core:Subject","Dublin Core:Description","Dublin Core:Creator","Dublin Core:Source","Dublin Core:Publisher","Dublin Core:Date","Dublin Core:Contributor","Dublin Core:Rights","Dublin Core:Relation","Dublin Core:Format","Dublin Core:Language","Dublin Core:Type","Dublin Core:Identifier","Dublin Core:Coverage","Item Type Metadata:Text","Item Type Metadata:Interviewer","Item Type Metadata:Interviewee","Item Type Metadata:Location","Item Type Metadata:Transcription","Item Type Metadata:Local URL","Item Type Metadata:Original Format","Item Type Metadata:Physical Dimensions","Item Type Metadata:Duration","Item Type Metadata:Compression","Item Type Metadata:Producer","Item Type Metadata:Director","Item Type Metadata:Bit Rate/Frequency","Item Type Metadata:Time Summary","Item Type Metadata:Email Body","Item Type Metadata:Subject Line","Item Type Metadata:From","Item Type Metadata:To","Item Type Metadata:CC","Item Type Metadata:BCC","Item Type Metadata:Number of Attachments","Item Type Metadata:Standards","Item Type Metadata:Objectives","Item Type Metadata:Materials","Item Type Metadata:Lesson Plan Text","Item Type Metadata:URL","Item Type Metadata:Event Type","Item Type Metadata:Participants","Item Type Metadata:Birth Date","Item Type Metadata:Birthplace","Item Type Metadata:Death Date","Item Type Metadata:Occupation","Item Type Metadata:Biographical Text","Item Type Metadata:Bibliography","Item Type Metadata:Digital Reproduction Information","Item Type Metadata:Repository","Item Type Metadata:Repository Collection","Item Type Metadata:Contact information.","Item Type Metadata:File Name","Item Type Metadata:Notes","Item Type Metadata:Digital item created","Item Type Metadata:Digital item modified","Item Type Metadata:Executive Orders","Item Type Metadata:Record Created","Item Type Metadata:Record Modified","Item Type Metadata:Transcription2","Item Type Metadata:Source URL","Omeka Legacy File:Additional Creator","Omeka Legacy File:Transcriber","Omeka Legacy File:Producer","Omeka Legacy File:Render Device","Omeka Legacy File:Render Details","Omeka Legacy File:Capture Date","Omeka Legacy File:Capture Device","Omeka Legacy File:Capture Details","Omeka Legacy File:Change History","Omeka Legacy File:Watermark","Omeka Legacy File:Encryption","Omeka Legacy File:Compression","Omeka Legacy File:Post Processing","Omeka Image File:Width","Omeka Image File:Height","Omeka Image File:Bit Depth","Omeka Image File:Channels","Omeka Image File:Exif String","Omeka Image File:Exif Array","Omeka Image File:IPTC String","Omeka Image File:IPTC Array","Omeka Video File:Bitrate","Omeka Video File:Duration","Omeka Video File:Sample Rate","Omeka Video File:Codec","Omeka Video File:Width","Omeka Video File:Height",tags,file,itemType,collection,public,featured
2118,https://www.iowaheritage.org/items/show/2118,"Drake Relays, 1964","Track athletics--Iowa--Des Moines|Billboards--Iowa--Des Moines|Advertising--Iowa--Des Moines","The 1964 Drake Relays sign","Clinton, John D.","Special Collections, Cowles Library -- Drake University.",,1964,,"U.S. and International copyright laws protect this digital image. Commercial use or distribution of the image is not permitted without prior permission of the copyright holder. For permission to use the digital image, please contact: bart.schmidt@drake.edu","Drake Relays Digital Archive","35 mm color slide",,Image,"dr00269|http://ddr.lib.drake.edu/u?/du-relays,183",,,,,,,,,,,,,,,,,,,,,,,,,,,,,,,,,,,,,,,,,,,,,,,,"<a href=""http://ddr.lib.drake.edu/u?/du-relays,183"" target=""_blank"">View this item in its source respository</a>",,,,,,,,,,,,,,,,,,,,,,,,,,,,,https://www.iowaheritage.org/files/original/c949946c459ad43c14d32b21d8d7d5fe.jpg,"Remote Item","Drake Relays Digital Archive",1,0
2137,https://www.iowaheritage.org/items/show/2137,"Drake Relays, 1964","Track athletics--Iowa--Des Moines|Relay racing--Iowa--Des Moines","A runner from North High School competes in the High School One-Mile Relay. North won with a time of 3:22:3.","Clinton, John D.","Special Collections, Cowles Library -- Drake University.",,1964,,"U.S. and International copyright laws protect this digital image. Commercial use or distribution of the image is not permitted without prior permission of the copyright holder. For permission to use the digital image, please contact: bart.schmidt@drake.edu","Drake Relays Digital Archive","35 mm color slide",,Image,"dr00303|http://ddr.lib.drake.edu/u?/du-relays,208",,,,,,,,,,,,,,,,,,,,,,,,,,,,,,,,,,,,,,,,,,,,,,,,"<a href=""http://ddr.lib.drake.edu/u?/du-relays,208"" target=""_blank"">View this item in its source respository</a>",,,,,,,,,,,,,,,,,,,,,,,,,,,,,https://www.iowaheritage.org/files/original/88edf483960917eaadbe9cc54b5899d4.jpg,"Remote Item","Drake Relays Digital Archive",1,0
2201,https://www.iowaheritage.org/items/show/2201,"Drake Relays, 1964","Track athletics--Iowa--Des Moines|Athletes","Runners from the High School Girls 100-Yard Dash in 1964.","Clinton, John D.","Special Collections, Cowles Library -- Drake University.",,1964,,"U.S. and International copyright laws protect this digital image. Commercial use or distribution of the image is not permitted without prior permission of the copyright holder. For permission to use the digital image, please contact: bart.schmidt@drake.edu","Drake Relays Digital Archive","35 mm color slide",,Image,"dr00404|http://ddr.lib.drake.edu/u?/du-relays,294",,,,,,,,,,,,,,,,,,,,,,,,,,,,,,,,,,,,,,,,,,,,,,,,"<a href=""http://ddr.lib.drake.edu/u?/du-relays,294"" target=""_blank"">View this item in its source respository</a>",,,,,,,,,,,,,,,,,,,,,,,,,,,,,https://www.iowaheritage.org/files/original/2526c0ff4bbdc79acf9a21d4a9c59249.jpg,"Remote Item","Drake Relays Digital Archive",1,0
2339,https://www.iowaheritage.org/items/show/2339,"Drake Relays, 1964, Admission Ticket","Track athletics--Iowa--Des Moines|Tickets","A ticket for the Drake Relays on Saturday, April 25th, 1964. This ticket is marked ""High School and Grade School.""",,"Private Collection of Rich Hoidahl",,,,"U.S. and International copyright laws protect this digital image. Commercial use or distribution of the image is not permitted without prior permission of the copyright holder. For permission to use the digital image, please contact: bart.schmidt@drake.edu","Drake Relays Digital Archive",,,Memorabilia,"dr00650|http://ddr.lib.drake.edu/u?/du-relays,512",,,,,,,,,,,,,,,,,,,,,,,,,,,,,,,,,,,,,,,,,,,,,,,,"<a href=""http://ddr.lib.drake.edu/u?/du-relays,512"" target=""_blank"">View this item in its source respository</a>",,,,,,,,,,,,,,,,,,,,,,,,,,,,,https://www.iowaheritage.org/files/original/2e105c2f1d48b7d74104e20d82603803.jpg,"Remote Item","Drake Relays Digital Archive",1,0
2385,https://www.iowaheritage.org/items/show/2385,"Drake Relays, 1964, Bill Hardin","Track athletics--Iowa--Des Moines|Hurdle racing--Iowa--Des Moines","Bill Hardin of Louisiana State University leads Udell Cason of Drake, James Cooper of Texas and others in the 440 High Hurdles. Hardin went on to win with a time of 51.7 seconds","Clinton, John D.","Special Collections, Cowles Library -- Drake University.",,1964,,"U.S. and International copyright laws protect this digital image. Commercial use or distribution of the image is not permitted without prior permission of the copyright holder. For permission to use the digital image, please contact: bart.schmidt@drake.edu","Drake Relays Digital Archive","35 mm color slide",,Image,"dr00078|http://ddr.lib.drake.edu/u?/du-relays,590",,,,,,,,,,,,,,,,,,,,,,,,,,,,,,,,,,,,,,,,,,,,,,,,"<a href=""http://ddr.lib.drake.edu/u?/du-relays,590"" target=""_blank"">View this item in its source respository</a>",,,,,,,,,,,,,,,,,,,,,,,,,,,,,https://www.iowaheritage.org/files/original/cf700254f41e4df55707c27ae2eade2b.jpg,"Remote Item","Drake Relays Digital Archive",1,0
2384,https://www.iowaheritage.org/items/show/2384,"Drake Relays, 1964, Bill Younger","Track athletics--Iowa--Des Moines|Vaulting--Iowa--Des Moines|Athletes--Missouri","Bill Younger of Missouri wins the 1964 Pole Vault with a height of 15.9 1/4. This was a new Drake Relays record.","Clinton, John D.","Special Collections, Cowles Library -- Drake University.",,1964,,"U.S. and International copyright laws protect this digital image. Commercial use or distribution of the image is not permitted without prior permission of the copyright holder. For permission to use the digital image, please contact: bart.schmidt@drake.edu","Drake Relays Digital Archive","35 mm color slide",,Image,"dr00219|http://ddr.lib.drake.edu/u?/du-relays,589",,,,,,,,,,,,,,,,,,,,,,,,,,,,,,,,,,,,,,,,,,,,,,,,"<a href=""http://ddr.lib.drake.edu/u?/du-relays,589"" target=""_blank"">View this item in its source respository</a>",,,,,,,,,,,,,,,,,,,,,,,,,,,,,https://www.iowaheritage.org/files/original/6dbd157fb3f4eedf8e2b715634377495.jpg,"Remote Item","Drake Relays Digital Archive",1,0
2190,https://www.iowaheritage.org/items/show/2190,"Drake Relays, 1964, Clyde Duncan","Track athletics--Iowa--Des Moines|Athletes--Iowa","Clyde Duncan of North High School (Des Moines) talks with Henry or Gary Carr. Duncan won his third consecutive 110-Yard Dash in 1964 with a time of :09.3. That would have set a new National Interscholatic Record, but the record was not allowed because of favoring winds.","Clinton, John D.","Special Collections, Cowles Library -- Drake University.",,1964,,"U.S. and International copyright laws protect this digital image. Commercial use or distribution of the image is not permitted without prior permission of the copyright holder. For permission to use the digital image, please contact: bart.schmidt@drake.edu","Drake Relays Digital Archive","35 mm color slide",,Image,"dr00389|http://ddr.lib.drake.edu/u?/du-relays,276",,,,,,,,,,,,,,,,,,,,,,,,,,,,,,,,,,,,,,,,,,,,,,,,"<a href=""http://ddr.lib.drake.edu/u?/du-relays,276"" target=""_blank"">View this item in its source respository</a>",,,,,,,,,,,,,,,,,,,,,,,,,,,,,https://www.iowaheritage.org/files/original/dc3a573aed3a99a800da741a209f8c24.jpg,"Remote Item","Drake Relays Digital Archive",1,0
2217,https://www.iowaheritage.org/items/show/2217,"Drake Relays, 1964, Clyde Duncan","Track athletics--Iowa--Des Moines|Athletes--Iowa","Jim Duncan speaks with Clyde Duncan of North High School (Des Moines). Duncan won his third consecutive 110-Yard Dash in 1964 with a time of :09.3. That would have set a new National Interscholatic Record, but the record was not allowed because of favoring winds.","Clinton, John D.","Special Collections, Cowles Library -- Drake University.",,1964,,"U.S. and International copyright laws protect this digital image. Commercial use or distribution of the image is not permitted without prior permission of the copyright holder. For permission to use the digital image, please contact: bart.schmidt@drake.edu","Drake Relays Digital Archive","35 mm color slide",,Image,"dr00126|http://ddr.lib.drake.edu/u?/du-relays,316",,,,,,,,,,,,,,,,,,,,,,,,,,,,,,,,,,,,,,,,,,,,,,,,"<a href=""http://ddr.lib.drake.edu/u?/du-relays,316"" target=""_blank"">View this item in its source respository</a>",,,,,,,,,,,,,,,,,,,,,,,,,,,,,https://www.iowaheritage.org/files/original/59024a5377100ef8da42d9b3342854d8.jpg,"Remote Item","Drake Relays Digital Archive",1,0
2023,https://www.iowaheritage.org/items/show/2023,"Drake Relays, 1964, Dick Dare","Track athletics--Iowa--Des Moines|Hurdle racing--Iowa--Des Moines|Athletes","Dick Dare of the Air Force, is unable to catch Bobby May of Rice (not pictured) in the 120-yard high hurdles. Following is Bill Hardin (in gold). May finished in 14.3 seconds.  Dare won the  event in the 1965 Drake Relays with a time of 14.1 seconds. Hardin won the 1964 440-yard hurdles.","Clinton, John D.","Special Collections, Cowles Library -- Drake University.",,1964,,"U.S. and International copyright laws protect this digital image. Commercial use or distribution of the image is not permitted without prior permission of the copyright holder. For permission to use the digital image, please contact: bart.schmidt@drake.edu","Drake Relays Digital Archive","35 mm color slide",,Image,"dr00077|http://ddr.lib.drake.edu/u?/du-relays,67",,,,,,,,,,,,,,,,,,,,,,,,,,,,,,,,,,,,,,,,,,,,,,,,"<a href=""http://ddr.lib.drake.edu/u?/du-relays,67"" target=""_blank"">View this item in its source respository</a>",,,,,,,,,,,,,,,,,,,,,,,,,,,,,https://www.iowaheritage.org/files/original/bf874800e8effa475ae560908a091eb7.jpg,"Remote Item","Drake Relays Digital Archive",1,0
2383,https://www.iowaheritage.org/items/show/2383,"Drake Relays, 1964, Gayle Hopkins","Track athletics--Iowa--Des Moines|Athletes--Arizona","Gayle Hopkins of University of Arizona won the 1964 broad jump with distance of  26:2. The distance was a record and broke Jesse Owens' record that stood for 29 years. Hopkins also won the triple jump in 1964,  and was one of only 25 athletes to win two events in same year.","Clinton, John D.","Special Collections, Cowles Library -- Drake University.",,1964,,"U.S. and International copyright laws protect this digital image. Commercial use or distribution of the image is not permitted without prior permission of the copyright holder. For permission to use the digital image, please contact: bart.schmidt@drake.edu","Drake Relays Digital Archive","35 mm color slide",,Image,"dr00220|http://ddr.lib.drake.edu/u?/du-relays,588",,,,,,,,,,,,,,,,,,,,,,,,,,,,,,,,,,,,,,,,,,,,,,,,"<a href=""http://ddr.lib.drake.edu/u?/du-relays,588"" target=""_blank"">View this item in its source respository</a>",,,,,,,,,,,,,,,,,,,,,,,,,,,,,https://www.iowaheritage.org/files/original/195decffecc7420295399db38567deea.jpg,"Remote Item","Drake Relays Digital Archive",1,0
