 




﻿"Item Id","Item URI","Dublin Core:Title","Dublin Core:Subject","Dublin Core:Description","Dublin Core:Creator","Dublin Core:Source","Dublin Core:Publisher","Dublin Core:Date","Dublin Core:Contributor","Dublin Core:Rights","Dublin Core:Relation","Dublin Core:Format","Dublin Core:Language","Dublin Core:Type","Dublin Core:Identifier","Dublin Core:Coverage","Item Type Metadata:Text","Item Type Metadata:Interviewer","Item Type Metadata:Interviewee","Item Type Metadata:Location","Item Type Metadata:Transcription","Item Type Metadata:Local URL","Item Type Metadata:Original Format","Item Type Metadata:Physical Dimensions","Item Type Metadata:Duration","Item Type Metadata:Compression","Item Type Metadata:Producer","Item Type Metadata:Director","Item Type Metadata:Bit Rate/Frequency","Item Type Metadata:Time Summary","Item Type Metadata:Email Body","Item Type Metadata:Subject Line","Item Type Metadata:From","Item Type Metadata:To","Item Type Metadata:CC","Item Type Metadata:BCC","Item Type Metadata:Number of Attachments","Item Type Metadata:Standards","Item Type Metadata:Objectives","Item Type Metadata:Materials","Item Type Metadata:Lesson Plan Text","Item Type Metadata:URL","Item Type Metadata:Event Type","Item Type Metadata:Participants","Item Type Metadata:Birth Date","Item Type Metadata:Birthplace","Item Type Metadata:Death Date","Item Type Metadata:Occupation","Item Type Metadata:Biographical Text","Item Type Metadata:Bibliography","Item Type Metadata:Digital Reproduction Information","Item Type Metadata:Repository","Item Type Metadata:Repository Collection","Item Type Metadata:Contact information.","Item Type Metadata:File Name","Item Type Metadata:Notes","Item Type Metadata:Digital item created","Item Type Metadata:Digital item modified","Item Type Metadata:Executive Orders","Item Type Metadata:Record Created","Item Type Metadata:Record Modified","Item Type Metadata:Transcription2","Item Type Metadata:Source URL","Omeka Legacy File:Additional Creator","Omeka Legacy File:Transcriber","Omeka Legacy File:Producer","Omeka Legacy File:Render Device","Omeka Legacy File:Render Details","Omeka Legacy File:Capture Date","Omeka Legacy File:Capture Device","Omeka Legacy File:Capture Details","Omeka Legacy File:Change History","Omeka Legacy File:Watermark","Omeka Legacy File:Encryption","Omeka Legacy File:Compression","Omeka Legacy File:Post Processing","Omeka Image File:Width","Omeka Image File:Height","Omeka Image File:Bit Depth","Omeka Image File:Channels","Omeka Image File:Exif String","Omeka Image File:Exif Array","Omeka Image File:IPTC String","Omeka Image File:IPTC Array","Omeka Video File:Bitrate","Omeka Video File:Duration","Omeka Video File:Sample Rate","Omeka Video File:Codec","Omeka Video File:Width","Omeka Video File:Height",tags,file,itemType,collection,public,featured
9574,https://www.iowaheritage.org/items/show/9574,"Making it tough for Santa Claus.","Government|United States|Uncle Sam.|politics|international relations|foreign aid|Communism|postwar|Cold War|France",,"Darling, Jay N. (Jay Norwood), 1876-1962","The Editorial cartoons of J.N. ""Ding"" Darling [electronic resource] : The Cowles Collection, Drake University, 1912-1962",,1947/11/25|1947,,"Copyright is owned by the ""Ding"" Darling Wildlife Society; it is administered on behalf of the Society by The University of Iowa. While use within the classroom is encouraged without specific authorization, publishing this cartoon in any format requires written permission. See policy and permissions procedure at: http://www.lib.uiowa.edu/spec-coll/services/dingdarling_fees.html","Cowles Library, Drake University, 2507 University Ave., Des Moines, IA 50311-4505.",,,,"471125.jpg|http://ddr.lib.drake.edu/u?/ddarling,6504",,,,,,,,,,,,,,,,,,,,,,,,,,,,,,,,,,,,,,,,,,,,,,,,"<a href=""http://ddr.lib.drake.edu/u?/ddarling,6504"" target=""_blank"">View this item in its source respository</a>",,,,,,,,,,,,,,,,,,,,,,,,,,,,,https://www.iowaheritage.org/files/original/f13d9eedbefcba4d7ccc0af5ca6e6553.jpg,"Remote Item","Editorial Cartoons of J.N. ""Ding"" Darling, Drake University",1,0
9578,https://www.iowaheritage.org/items/show/9578,"Oh liberalism, what crimes have been committed in thy name.",Government|France|Mobs|liberalism|communism|revolution|riots|damsels.,,"Darling, Jay N. (Jay Norwood), 1876-1962","The Editorial cartoons of J.N. ""Ding"" Darling [electronic resource] : The Cowles Collection, Drake University, 1912-1962",,1947/12/04|1947,,"Copyright is owned by the ""Ding"" Darling Wildlife Society; it is administered on behalf of the Society by The University of Iowa. While use within the classroom is encouraged without specific authorization, publishing this cartoon in any format requires written permission. See policy and permissions procedure at: http://www.lib.uiowa.edu/spec-coll/services/dingdarling_fees.html","Cowles Library, Drake University, 2507 University Ave., Des Moines, IA 50311-4505.",,,,"471204.jpg|http://ddr.lib.drake.edu/u?/ddarling,6508",,,,,,,,,,,,,,,,,,,,,,,,,,,,,,,,,,,,,,,,,,,,,,,,"<a href=""http://ddr.lib.drake.edu/u?/ddarling,6508"" target=""_blank"">View this item in its source respository</a>",,,,,,,,,,,,,,,,,,,,,,,,,,,,,https://www.iowaheritage.org/files/original/03225ec5b0ff76ad9bf9b1dfa9d595d5.jpg,"Remote Item","Editorial Cartoons of J.N. ""Ding"" Darling, Drake University",1,0
9628,https://www.iowaheritage.org/items/show/9628,Next.,"War|Stalin, Joseph, 1879-1953|Post-World War, 1939-1945|Russia|Goldfish swallowing.|peace|aggression|foreign policy|imperialism|postwar|Cold War|Finland|France|Italy",,"Darling, Jay N. (Jay Norwood), 1876-1962","The Editorial cartoons of J.N. ""Ding"" Darling [electronic resource] : The Cowles Collection, Drake University, 1912-1962",,1948/03/16|1948,,"Copyright is owned by the ""Ding"" Darling Wildlife Society; it is administered on behalf of the Society by The University of Iowa. While use within the classroom is encouraged without specific authorization, publishing this cartoon in any format requires written permission. See policy and permissions procedure at: http://www.lib.uiowa.edu/spec-coll/services/dingdarling_fees.html","Cowles Library, Drake University, 2507 University Ave., Des Moines, IA 50311-4505.",,,,"480316.jpg|http://ddr.lib.drake.edu/u?/ddarling,6558",,,,,,,,,,,,,,,,,,,,,,,,,,,,,,,,,,,,,,,,,,,,,,,,"<a href=""http://ddr.lib.drake.edu/u?/ddarling,6558"" target=""_blank"">View this item in its source respository</a>",,,,,,,,,,,,,,,,,,,,,,,,,,,,,https://www.iowaheritage.org/files/original/6866389f920d3bbdce739b25d346de22.jpg,"Remote Item","Editorial Cartoons of J.N. ""Ding"" Darling, Drake University",1,0
9713,https://www.iowaheritage.org/items/show/9713,"Day after day.","War|Russia|Skeletons.|peace|international relations|foreign policy|conferences|treaties|United Nations|postwar|Cold War|Europe|United States|England|France",,"Darling, Jay N. (Jay Norwood), 1876-1962","The Editorial cartoons of J.N. ""Ding"" Darling [electronic resource] : The Cowles Collection, Drake University, 1912-1962",,1948/09/16|1948,,"Copyright is owned by the ""Ding"" Darling Wildlife Society; it is administered on behalf of the Society by The University of Iowa. While use within the classroom is encouraged without specific authorization, publishing this cartoon in any format requires written permission. See policy and permissions procedure at: http://www.lib.uiowa.edu/spec-coll/services/dingdarling_fees.html","Cowles Library, Drake University, 2507 University Ave., Des Moines, IA 50311-4505.",,,,"480916.jpg|http://ddr.lib.drake.edu/u?/ddarling,6643",,,,,,,,,,,,,,,,,,,,,,,,,,,,,,,,,,,,,,,,,,,,,,,,"<a href=""http://ddr.lib.drake.edu/u?/ddarling,6643"" target=""_blank"">View this item in its source respository</a>",,,,,,,,,,,,,,,,,,,,,,,,,,,,,https://www.iowaheritage.org/files/original/744e27f5b70519948e2bb5a6142da67e.jpg,"Remote Item","Editorial Cartoons of J.N. ""Ding"" Darling, Drake University",1,0
9720,https://www.iowaheritage.org/items/show/9720,"We tried everything but dynamite.","International relations|United States|Iron Curtain|foreign policy|postwar|Cold War|Iron Curtain|United Nations|Great Britain|France|Russia|Soviet Union|Uncle Sam|John Bull.",,"Darling, Jay N. (Jay Norwood), 1876-1962","The Editorial cartoons of J.N. ""Ding"" Darling [electronic resource] : The Cowles Collection, Drake University, 1912-1962",,1948/10/04|1948,,"Copyright is owned by the ""Ding"" Darling Wildlife Society; it is administered on behalf of the Society by The University of Iowa. While use within the classroom is encouraged without specific authorization, publishing this cartoon in any format requires written permission. See policy and permissions procedure at: http://www.lib.uiowa.edu/spec-coll/services/dingdarling_fees.html","Cowles Library, Drake University, 2507 University Ave., Des Moines, IA 50311-4505.",,,,"481004.jpg|http://ddr.lib.drake.edu/u?/ddarling,6650",,,,,,,,,,,,,,,,,,,,,,,,,,,,,,,,,,,,,,,,,,,,,,,,"<a href=""http://ddr.lib.drake.edu/u?/ddarling,6650"" target=""_blank"">View this item in its source respository</a>",,,,,,,,,,,,,,,,,,,,,,,,,,,,,https://www.iowaheritage.org/files/original/a8f449d5037fdcbd6a62280ed9acf7b6.jpg,"Remote Item","Editorial Cartoons of J.N. ""Ding"" Darling, Drake University",1,0
9723,https://www.iowaheritage.org/items/show/9723,"Popular bill at the Russian theater.","International relations|Molotov, Vyacheslav Mikhaylovich, 1890-1986|Moscow conference.|Russia|Eggs.|foreign policy|postwar|Cold War|conferences|treaties|United Nations|Stalin, Joseph, 1879-1953|United States|France|England",,"Darling, Jay N. (Jay Norwood), 1876-1962","The Editorial cartoons of J.N. ""Ding"" Darling [electronic resource] : The Cowles Collection, Drake University, 1912-1962",,1948/10/10|1948,,"Copyright is owned by the ""Ding"" Darling Wildlife Society; it is administered on behalf of the Society by The University of Iowa. While use within the classroom is encouraged without specific authorization, publishing this cartoon in any format requires written permission. See policy and permissions procedure at: http://www.lib.uiowa.edu/spec-coll/services/dingdarling_fees.html","Cowles Library, Drake University, 2507 University Ave., Des Moines, IA 50311-4505.",,,,"481010.jpg|http://ddr.lib.drake.edu/u?/ddarling,6653",,,,,,,,,,,,,,,,,,,,,,,,,,,,,,,,,,,,,,,,,,,,,,,,"<a href=""http://ddr.lib.drake.edu/u?/ddarling,6653"" target=""_blank"">View this item in its source respository</a>",,,,,,,,,,,,,,,,,,,,,,,,,,,,,https://www.iowaheritage.org/files/original/40c687ce7fa821d0a9f7995c5ce2230a.jpg,"Remote Item","Editorial Cartoons of J.N. ""Ding"" Darling, Drake University",1,0
9764,https://www.iowaheritage.org/items/show/9764,[Unknown],"War|World War, 1914-1918|Verdun|skulls|gambling|European War 1914-1918|France|Germany",,"Darling, Jay N. (Jay Norwood), 1876-1962","The Editorial cartoons of J.N. ""Ding"" Darling [electronic resource] : The Cowles Collection, Drake University, 1912-1962",,1916|1916,,"Copyright is owned by the ""Ding"" Darling Wildlife Society; it is administered on behalf of the Society by The University of Iowa. While use within the classroom is encouraged without specific authorization, publishing this cartoon in any format requires written permission. See policy and permissions procedure at: http://www.lib.uiowa.edu/spec-coll/services/dingdarling_fees.html","Cowles Library, Drake University, 2507 University Ave., Des Moines, IA 50311-4505.",,,,"150042|http://ddr.lib.drake.edu/u?/ddarling,6695",,,,,,,,,,,,,,,,,,,,,,,,,,,,,,,,,,,,,,,,,,,,,,,,"<a href=""http://ddr.lib.drake.edu/u?/ddarling,6695"" target=""_blank"">View this item in its source respository</a>",,,,,,,,,,,,,,,,,,,,,,,,,,,,,https://www.iowaheritage.org/files/original/6d4e4d7873206fa1c294ec67c14ebfb0.jpg,"Remote Item","Editorial Cartoons of J.N. ""Ding"" Darling, Drake University",1,0
64352,https://www.iowaheritage.org/items/show/64352,"We're right behind you old boy!","Presidents|Reagan, Ronald|United States|Presidents|1980-1990|Dictatorships|Economic sanctions|United States -- Foreign relations|United States -- Foreign economic relations|United States -- Foreign relations -- Libya|Great Britain|Western Europe|Germany|France|Libya|Leaders|Guns|Men|Caves|Skulls|Hunters|Hunting","Ja!; Oui!; Western Europe; Libya; Sanctions","Duffy, Brian, 1955-",,"University of Iowa. Libraries. Special Collections Dept.",1986-01-05|2011-04,,"Educational use only, no other permissions given. Copyright to this digital object is owned by The Des Moines Register; it may not be downloaded, reproduced, or distributed without written permission. For more information, contact the Special Collections Department.","Editorial Cartoons of Brian Duffy; Des Moines Register Cartoonists|Papers of Brian Duffy|Des Moines Register",,English,"Still image|Editorial cartoons",MSC916|duffy-860105|http://digital.lib.uiowa.edu/cdm/ref/collection/duffy/id/190,,,,,,,,,,,,,,,,,,,,,,,,,,,,,,,,,,,,,,,,,,,,,,,,"<a href=""http://digital.lib.uiowa.edu/cdm/ref/collection/duffy/id/190"" target=""_blank"">View this item in its source respository</a>",,,,,,,,,,,,,,,,,,,,,,,,,,,,,https://www.iowaheritage.org/files/original/53c9659ea35e79444b01c696355b3086.jpg,"Remote Item","Editorial Cartoons of Brian Duffy",1,0
64366,https://www.iowaheritage.org/items/show/64366,"Look out! There's a cod on the tracks","England|England|Tunnels|1980-1990|France -- Foreign relations -- Great Britain|Trains|Transportation|Travel|Cooperation|France|Trains|Fish|Railroad tracks|Flags","England; France; Channel Express; Cod catcher","Duffy, Brian, 1955-",,"University of Iowa. Libraries. Special Collections Dept.",1986-01-26|2011-04,,"Educational use only, no other permissions given. Copyright to this digital object is owned by The Des Moines Register; it may not be downloaded, reproduced, or distributed without written permission. For more information, contact the Special Collections Department.","Editorial Cartoons of Brian Duffy; Des Moines Register Cartoonists|Papers of Brian Duffy|Des Moines Register",,English,"Still image|Editorial cartoons",MSC916|duffy-860126|http://digital.lib.uiowa.edu/cdm/ref/collection/duffy/id/204,,,,,,,,,,,,,,,,,,,,,,,,,,,,,,,,,,,,,,,,,,,,,,,,"<a href=""http://digital.lib.uiowa.edu/cdm/ref/collection/duffy/id/204"" target=""_blank"">View this item in its source respository</a>",,,,,,,,,,,,,,,,,,,,,,,,,,,,,https://www.iowaheritage.org/files/original/e07ab98b9d060afd0dae5829513464be.jpg,"Remote Item","Editorial Cartoons of Brian Duffy",1,0
64822,https://www.iowaheritage.org/items/show/64822,"International Woman Suffrage Alliance 10th Congress Badge","France|Suffrage|Women's rights","White and gold ribbon with ""Officers"" inscribed in gold across it. At the top of the ribbon is a gold name plate holding a piece of paper with ""Carrie Chapman Catt"" hand written on it. At the bottom of the ribbon is a gold medal in an slightly oval shape with ""MAI 1926"" ""JUIN PARIS"" in raised letters, blue inlay with ""I.W.S.A."" inscribed in gold. This is from the Tenth Congress of the International Alliance of Women for Suffrage and Equal Citizenship, which was held in Paris, France, May 30 -June 6, 1926.|Carrie Lane Chapman Catt (1859-1947) was a suffragist, early feminist, political activist, and Iowa Agricultural College (Iowa State University) alumna (1880). She was president (1900-1904 and 1915-1920) of the National American Woman Suffrage Association. She also formed and was president (1904-1923) of the International Woman Suffrage Alliance. In 1920, she helped found the League of Women Voters.","International Alliance of Women for Suffrage and Equal Citizenship","RS 21/7/3",,"1926|Digital Item Created:2010-11-04|21-07-003.Catt.2002-R001.019.tif",,"U.S. and international copyright laws protect this digital image. Commercial use or distribution of the image is not permitted without prior permission of the copyright holder. For permission to use the digital image, please contact Iowa State University Library Special Collections at archives@iastate.edu   For reproductions see:  http://www.add.lib.iastate.edu/spcl/services/photfees.html","Carrie Chapman Catt Papers, 1878-ongoing; http://www.add.lib.iastate.edu/spcl/arch/rgrp/21-7-3.html","Badges; 2.54 x 8.3 cm|3",,Image,21-07-003.Catt.2002-R001.019|https://digitalcollections.lib.iastate.edu/,,,,,,,,,,,,,,,,,,,,,,,,,,,,,,,,,,,,,,,,,,,,,,,,"<a href=""https://digitalcollections.lib.iastate.edu/"" target=""_blank"">View this item in its source respository</a>",,,,,,,,,,,,,,,,,,,,,,,,,,,,,https://www.iowaheritage.org/files/original/0822743208264785663c807996c1fc94.jpg,"Remote Item","Carrie Chapman Catt",1,0
