 




﻿"Item Id","Item URI","Dublin Core:Title","Dublin Core:Subject","Dublin Core:Description","Dublin Core:Creator","Dublin Core:Source","Dublin Core:Publisher","Dublin Core:Date","Dublin Core:Contributor","Dublin Core:Rights","Dublin Core:Relation","Dublin Core:Format","Dublin Core:Language","Dublin Core:Type","Dublin Core:Identifier","Dublin Core:Coverage","Item Type Metadata:Text","Item Type Metadata:Interviewer","Item Type Metadata:Interviewee","Item Type Metadata:Location","Item Type Metadata:Transcription","Item Type Metadata:Local URL","Item Type Metadata:Original Format","Item Type Metadata:Physical Dimensions","Item Type Metadata:Duration","Item Type Metadata:Compression","Item Type Metadata:Producer","Item Type Metadata:Director","Item Type Metadata:Bit Rate/Frequency","Item Type Metadata:Time Summary","Item Type Metadata:Email Body","Item Type Metadata:Subject Line","Item Type Metadata:From","Item Type Metadata:To","Item Type Metadata:CC","Item Type Metadata:BCC","Item Type Metadata:Number of Attachments","Item Type Metadata:Standards","Item Type Metadata:Objectives","Item Type Metadata:Materials","Item Type Metadata:Lesson Plan Text","Item Type Metadata:URL","Item Type Metadata:Event Type","Item Type Metadata:Participants","Item Type Metadata:Birth Date","Item Type Metadata:Birthplace","Item Type Metadata:Death Date","Item Type Metadata:Occupation","Item Type Metadata:Biographical Text","Item Type Metadata:Bibliography","Item Type Metadata:Digital Reproduction Information","Item Type Metadata:Repository","Item Type Metadata:Repository Collection","Item Type Metadata:Contact information.","Item Type Metadata:File Name","Item Type Metadata:Notes","Item Type Metadata:Digital item created","Item Type Metadata:Digital item modified","Item Type Metadata:Executive Orders","Item Type Metadata:Record Created","Item Type Metadata:Record Modified","Item Type Metadata:Transcription2","Item Type Metadata:Source URL","Omeka Legacy File:Additional Creator","Omeka Legacy File:Transcriber","Omeka Legacy File:Producer","Omeka Legacy File:Render Device","Omeka Legacy File:Render Details","Omeka Legacy File:Capture Date","Omeka Legacy File:Capture Device","Omeka Legacy File:Capture Details","Omeka Legacy File:Change History","Omeka Legacy File:Watermark","Omeka Legacy File:Encryption","Omeka Legacy File:Compression","Omeka Legacy File:Post Processing","Omeka Image File:Width","Omeka Image File:Height","Omeka Image File:Bit Depth","Omeka Image File:Channels","Omeka Image File:Exif String","Omeka Image File:Exif Array","Omeka Image File:IPTC String","Omeka Image File:IPTC Array","Omeka Video File:Bitrate","Omeka Video File:Duration","Omeka Video File:Sample Rate","Omeka Video File:Codec","Omeka Video File:Width","Omeka Video File:Height",tags,file,itemType,collection,public,featured
12081,http://www.iowaheritage.org/items/show/12081,"Flood cleanup workers' lunch, The University of Iowa, July 17, 2008","Floods|University of Iowa|United States -- Iowa -- Iowa City|2000-2010|Evacuations|Disaster relief|Rest periods|Barbecues","A free lunch given to BMS CAT workers in the Hancher Auditorium parking lot. The lunch was a thank you from the university to the flood cleanup workers.","Schoon, Tim",,"University of Iowa. University News Services",2008-07-17|2008-07-17,,"Educational use only, no other permissions given. U.S. and international copyright laws may protect this item. Commercial use or distribution of this digital object is not permitted without written permission of the copyright holder.","Iowa City Flood|Flood Images|BMS lunch, July 17, 2008",jpeg,,"Still image|Photographs",https://digital.lib.uiowa.edu/,,,,,,,,,,,,,,,,,,,,,,,,,,,,,,,,,,,,,,,,,,,,,,,,"<a href=""https://digital.lib.uiowa.edu/"" target=""_blank"">View this item in its source respository</a>",,,,,,,,,,,,,,,,,,,,,,,,,,,,,http://www.iowaheritage.org/files/original/0ec354b918f85a61cfef7e7167c34003.jpg,"Remote Item","Iowa City Flood",1,0
12080,http://www.iowaheritage.org/items/show/12080,"Campus roads flooded, The University of Iowa, June 16, 2008","Floods|University of Iowa|United States -- Iowa -- Iowa City|2000-2010|Evacuations|Disaster relief|Streets","Images of some flooded campus streets on Monday, June 16, 2008.","Schoon, Tim",,"University of Iowa. University News Services",2008-06-16|2008-06-16,,"Educational use only, no other permissions given. U.S. and international copyright laws may protect this item. Commercial use or distribution of this digital object is not permitted without written permission of the copyright holder.","Iowa City Flood|Flood Images|Flood, June 16, 2008",jpeg,,"Still image|Photographs",https://digital.lib.uiowa.edu/,,,,,,,,,,,,,,,,,,,,,,,,,,,,,,,,,,,,,,,,,,,,,,,,"<a href=""https://digital.lib.uiowa.edu/"" target=""_blank"">View this item in its source respository</a>",,,,,,,,,,,,,,,,,,,,,,,,,,,,,http://www.iowaheritage.org/files/original/922b5772560876615b6e1f3cfa2dbb1e.jpg,"Remote Item","Iowa City Flood",1,0
12079,http://www.iowaheritage.org/items/show/12079,"Sandbags outside Iowa Advanced Technology Laboratories, The University of Iowa, June 12, 2008","Floods|University of Iowa|United States -- Iowa -- Iowa City|2000-2010|Evacuations|Disaster relief|Educational facilities|Iowa Advanced Technology Laboratories (Iowa City, Iowa)","Sandbags outside Iowa Advanced Technology Laboratories on Thursday, June 12, 2008.","Schoon, Tim",,"University of Iowa. University News Services",2008-06-12|2008-06-12,,"Educational use only, no other permissions given. U.S. and international copyright laws may protect this item. Commercial use or distribution of this digital object is not permitted without written permission of the copyright holder.","Iowa City Flood|Flood Images|Flood, June 12, 2008",jpeg,,"Still image|Photographs",https://digital.lib.uiowa.edu/,,,,,,,,,,,,,,,,,,,,,,,,,,,,,,,,,,,,,,,,,,,,,,,,"<a href=""https://digital.lib.uiowa.edu/"" target=""_blank"">View this item in its source respository</a>",,,,,,,,,,,,,,,,,,,,,,,,,,,,,http://www.iowaheritage.org/files/original/3d437ce8f8d8760e326bd5903e836343.jpg,"Remote Item","Iowa City Flood",1,0
12077,http://www.iowaheritage.org/items/show/12077,"IMU restoration, The University of Iowa, September 12, 2008","Floods|United States -- Iowa -- Iowa City|2000-2010|Evacuations|Disaster relief","Flood restoration and cleanup in the IMU. These photos are from the ground level where ductwork had to be cleaned, the basement level where walls were taken out down to their studs and the sub-basement.","Schoon, Tim",,,2008-09-12|2008-09-12,,,"080912-1-IMU restoration",jpeg|19|28,,"Still image|photographs",https://digital.lib.uiowa.edu/,,,,,,,,,,,,,,,,,,,,,,,,,,,,,,,,,,,,,,,,,,,,,,,,"<a href=""https://digital.lib.uiowa.edu/"" target=""_blank"">View this item in its source respository</a>",,,,,,,,,,,,,,,,,,,,,,,,,,,,,http://www.iowaheritage.org/files/original/df910f646d1a5e22945e2f8dc4077c74.jpg,"Remote Item","Iowa City Flood",1,0
12076,http://www.iowaheritage.org/items/show/12076,"IMU restoration, The University of Iowa, September 12, 2008","Floods|United States -- Iowa -- Iowa City|2000-2010|Evacuations|Disaster relief","Flood restoration and cleanup in the IMU. These photos are from the ground level where ductwork had to be cleaned, the basement level where walls were taken out down to their studs and the sub-basement.","Schoon, Tim",,,2008-09-12|2008-09-12,,,"080912-1-IMU restoration",jpeg|19|28,,"Still image|photographs",https://digital.lib.uiowa.edu/,,,,,,,,,,,,,,,,,,,,,,,,,,,,,,,,,,,,,,,,,,,,,,,,"<a href=""https://digital.lib.uiowa.edu/"" target=""_blank"">View this item in its source respository</a>",,,,,,,,,,,,,,,,,,,,,,,,,,,,,http://www.iowaheritage.org/files/original/a359427042e0cd3b9853a776c4fd26fa.jpg,"Remote Item","Iowa City Flood",1,0
12075,http://www.iowaheritage.org/items/show/12075,"Floodwater spilling over sandbags, The University of Iowa, June 13, 2008","Floods|University of Iowa|United States -- Iowa -- Iowa City|2000-2010|Evacuations|Disaster relief|Retaining walls|","Floodwater breaks through a sandbag wall on the university campus on Friday, June 13, 2008.","Schoon, Tim",,"University of Iowa. University News Services",2008-06-13|2008-06-13,,"Educational use only, no other permissions given. U.S. and international copyright laws may protect this item. Commercial use or distribution of this digital object is not permitted without written permission of the copyright holder.","Iowa City Flood|Flood Images|Flood, June 13, 2008",jpeg,,"Still image|Photographs",https://digital.lib.uiowa.edu/,,,,,,,,,,,,,,,,,,,,,,,,,,,,,,,,,,,,,,,,,,,,,,,,"<a href=""https://digital.lib.uiowa.edu/"" target=""_blank"">View this item in its source respository</a>",,,,,,,,,,,,,,,,,,,,,,,,,,,,,http://www.iowaheritage.org/files/original/4eb706431c451e14dd72f40863251f0b.jpg,"Remote Item","Iowa City Flood",1,0
12074,http://www.iowaheritage.org/items/show/12074,"Power Plant Rehabilitation, The University of Iowa, September 5, 2008","Floods|University of Iowa|United States -- Iowa -- Iowa City|2000-2010|Evacuations|Disaster relief|Power plants|University of Iowa Power Plant","Working to get the power plant ready to operate again after the flood.","Schoon, Tim",,"University of Iowa. University News Services",2008-09-05|2008-09-05,,"Educational use only, no other permissions given. U.S. and international copyright laws may protect this item. Commercial use or distribution of this digital object is not permitted without written permission of the copyright holder.","Iowa City Flood|Flood Images|Power Plant rehabbing, Sept. 5, 2008",jpeg,,"Still image|Photographs",https://digital.lib.uiowa.edu/,,,,,,,,,,,,,,,,,,,,,,,,,,,,,,,,,,,,,,,,,,,,,,,,"<a href=""https://digital.lib.uiowa.edu/"" target=""_blank"">View this item in its source respository</a>",,,,,,,,,,,,,,,,,,,,,,,,,,,,,http://www.iowaheritage.org/files/original/d4e392acde2816e5f093f2d5f5e695f7.jpg,"Remote Item","Iowa City Flood",1,0
12073,http://www.iowaheritage.org/items/show/12073,"Iowa River floods near Burlington Street bridge, The University of Iowa, June 12, 2008","Floods|University of Iowa|United States -- Iowa -- Iowa City|2000-2010|Evacuations|Disaster relief|Rivers|United States -- Iowa -- Iowa River","Iowa River floods near Burlington Street bridge Thursday, June 12, 2008.","Schoon, Tim",,"University of Iowa. University News Services",2008-06-12|2008-06-12,,"Educational use only, no other permissions given. U.S. and international copyright laws may protect this item. Commercial use or distribution of this digital object is not permitted without written permission of the copyright holder.","Iowa City Flood|Flood Images|Flood, June 12, 2008",jpeg,,"Still image|Photographs",https://digital.lib.uiowa.edu/,,,,,,,,,,,,,,,,,,,,,,,,,,,,,,,,,,,,,,,,,,,,,,,,"<a href=""https://digital.lib.uiowa.edu/"" target=""_blank"">View this item in its source respository</a>",,,,,,,,,,,,,,,,,,,,,,,,,,,,,http://www.iowaheritage.org/files/original/16c397dcdbfc82e076ae702cea6a4e1d.jpg,"Remote Item","Iowa City Flood",1,0
12072,http://www.iowaheritage.org/items/show/12072,"Volunteers fill sandbags outside Iowa Memorial Union, The University of Iowa, June 12, 2008","Floods|University of Iowa|United States -- Iowa -- Iowa City|2000-2010|Evacuations|Disaster relief|Community service|Student Unions||Iowa Memorial Union (Iowa City, Iowa)","Volunteers fill sandbags outside the Iowa Memorial Union on Thursday, June 12, 2008.","Schoon, Tim",,"University of Iowa. University News Services",2008-06-12|2008-06-12,,"Educational use only, no other permissions given. U.S. and international copyright laws may protect this item. Commercial use or distribution of this digital object is not permitted without written permission of the copyright holder.","Iowa City Flood|Flood Images|Flood, June 12, 2008",jpeg,,"Still image|Photographs",https://digital.lib.uiowa.edu/,,,,,,,,,,,,,,,,,,,,,,,,,,,,,,,,,,,,,,,,,,,,,,,,"<a href=""https://digital.lib.uiowa.edu/"" target=""_blank"">View this item in its source respository</a>",,,,,,,,,,,,,,,,,,,,,,,,,,,,,http://www.iowaheritage.org/files/original/98b2ea67c6e364ae4d4ed2566791a2cf.jpg,"Remote Item","Iowa City Flood",1,0
12070,http://www.iowaheritage.org/items/show/12070,"Campus facilities flooded, The University of Iowa, June 14, 2008","Floods|University of Iowa|United States -- Iowa -- Iowa City|2000-2010|Evacuations|Disaster relief|Educational facilities","Photos taken the morning of June 14 before the Iowa River crested the following day at 31.51 feet.","Jorgensen, Tom",,"University of Iowa. University News Services",2008-06-14|2008-06-14,,"Educational use only, no other permissions given. U.S. and international copyright laws may protect this item. Commercial use or distribution of this digital object is not permitted without written permission of the copyright holder.","Iowa City Flood|Flood Images|Campus Flooding, June 14, 2008",jpeg,,"Still image|Photographs",https://digital.lib.uiowa.edu/,,,,,,,,,,,,,,,,,,,,,,,,,,,,,,,,,,,,,,,,,,,,,,,,"<a href=""https://digital.lib.uiowa.edu/"" target=""_blank"">View this item in its source respository</a>",,,,,,,,,,,,,,,,,,,,,,,,,,,,,http://www.iowaheritage.org/files/original/88fb0a12c46ecb61d8253a2c480ad24d.jpg,"Remote Item","Iowa City Flood",1,0
