 




﻿"Item Id","Item URI","Dublin Core:Title","Dublin Core:Subject","Dublin Core:Description","Dublin Core:Creator","Dublin Core:Source","Dublin Core:Publisher","Dublin Core:Date","Dublin Core:Contributor","Dublin Core:Rights","Dublin Core:Relation","Dublin Core:Format","Dublin Core:Language","Dublin Core:Type","Dublin Core:Identifier","Dublin Core:Coverage","Item Type Metadata:Text","Item Type Metadata:Interviewer","Item Type Metadata:Interviewee","Item Type Metadata:Location","Item Type Metadata:Transcription","Item Type Metadata:Local URL","Item Type Metadata:Original Format","Item Type Metadata:Physical Dimensions","Item Type Metadata:Duration","Item Type Metadata:Compression","Item Type Metadata:Producer","Item Type Metadata:Director","Item Type Metadata:Bit Rate/Frequency","Item Type Metadata:Time Summary","Item Type Metadata:Email Body","Item Type Metadata:Subject Line","Item Type Metadata:From","Item Type Metadata:To","Item Type Metadata:CC","Item Type Metadata:BCC","Item Type Metadata:Number of Attachments","Item Type Metadata:Standards","Item Type Metadata:Objectives","Item Type Metadata:Materials","Item Type Metadata:Lesson Plan Text","Item Type Metadata:URL","Item Type Metadata:Event Type","Item Type Metadata:Participants","Item Type Metadata:Birth Date","Item Type Metadata:Birthplace","Item Type Metadata:Death Date","Item Type Metadata:Occupation","Item Type Metadata:Biographical Text","Item Type Metadata:Bibliography","Item Type Metadata:Digital Reproduction Information","Item Type Metadata:Repository","Item Type Metadata:Repository Collection","Item Type Metadata:Contact information.","Item Type Metadata:File Name","Item Type Metadata:Notes","Item Type Metadata:Digital item created","Item Type Metadata:Digital item modified","Item Type Metadata:Executive Orders","Item Type Metadata:Record Created","Item Type Metadata:Record Modified","Item Type Metadata:Transcription2","Item Type Metadata:Source URL","Omeka Legacy File:Additional Creator","Omeka Legacy File:Transcriber","Omeka Legacy File:Producer","Omeka Legacy File:Render Device","Omeka Legacy File:Render Details","Omeka Legacy File:Capture Date","Omeka Legacy File:Capture Device","Omeka Legacy File:Capture Details","Omeka Legacy File:Change History","Omeka Legacy File:Watermark","Omeka Legacy File:Encryption","Omeka Legacy File:Compression","Omeka Legacy File:Post Processing","Omeka Image File:Width","Omeka Image File:Height","Omeka Image File:Bit Depth","Omeka Image File:Channels","Omeka Image File:Exif String","Omeka Image File:Exif Array","Omeka Image File:IPTC String","Omeka Image File:IPTC Array","Omeka Video File:Bitrate","Omeka Video File:Duration","Omeka Video File:Sample Rate","Omeka Video File:Codec","Omeka Video File:Width","Omeka Video File:Height",tags,file,itemType,collection,public,featured
2065,https://www.iowaheritage.org/items/show/2065,"Drake Relays, 1960, Dave Odegard","Track athletics--Iowa--Des Moines|Hurdle racing--Iowa--Des Moines|Athletes--Minnesota","Dave Odegard of Minnesota (in orange) wins the 120 yard high hurdles with a time of 13.9.","Clinton, John D.","Special Collections, Cowles Library -- Drake University.",,1960,,"U.S. and International copyright laws protect this digital image. Commercial use or distribution of the image is not permitted without prior permission of the copyright holder. For permission to use the digital image, please contact: bart.schmidt@drake.edu","Drake Relays Digital Archive","35 mm color slide",,Image,"dr00187|http://ddr.lib.drake.edu/u?/du-relays,119",,,,,,,,,,,,,,,,,,,,,,,,,,,,,,,,,,,,,,,,,,,,,,,,"<a href=""http://ddr.lib.drake.edu/u?/du-relays,119"" target=""_blank"">View this item in its source respository</a>",,,,,,,,,,,,,,,,,,,,,,,,,,,,,https://www.iowaheritage.org/files/original/ab788f6004a59b9252b6f3c6ccd5b6d1.jpg,"Remote Item","Drake Relays Digital Archive",1,0
2100,https://www.iowaheritage.org/items/show/2100,"Drake Relays, 1960, Jan Stewart","Track athletics--Iowa--Des Moines|Relay racing--Iowa--Des Moines|Athletes--Iowa","The Cornell team that won the Iowa College Mile Relay with a time of 3:23:6 stands with Relays Queen Jan Stewart of Kansas State.","Clinton, John D.","Special Collections, Cowles Library -- Drake University.",,1960,,"U.S. and International copyright laws protect this digital image. Commercial use or distribution of the image is not permitted without prior permission of the copyright holder. For permission to use the digital image, please contact: bart.schmidt@drake.edu","Drake Relays Digital Archive","35 mm color slide",,Image,"dr00246|http://ddr.lib.drake.edu/u?/du-relays,161",,,,,,,,,,,,,,,,,,,,,,,,,,,,,,,,,,,,,,,,,,,,,,,,"<a href=""http://ddr.lib.drake.edu/u?/du-relays,161"" target=""_blank"">View this item in its source respository</a>",,,,,,,,,,,,,,,,,,,,,,,,,,,,,https://www.iowaheritage.org/files/original/3831d0e15fccfe710e38434b31f2356a.jpg,"Remote Item","Drake Relays Digital Archive",1,0
2082,https://www.iowaheritage.org/items/show/2082,"Drake Relays, 1960s","Track athletics--Iowa--Des Moines|Athletes","Irving High School students with long jumper Ralph Boston of Tennessee State University.","Clinton, John D.","Special Collections, Cowles Library -- Drake University.",,,,"U.S. and International copyright laws protect this digital image. Commercial use or distribution of the image is not permitted without prior permission of the copyright holder. For permission to use the digital image, please contact: bart.schmidt@drake.edu","Drake Relays Digital Archive","35 mm color slide",,Image,"dr00221|http://ddr.lib.drake.edu/u?/du-relays,143",,,,,,,,,,,,,,,,,,,,,,,,,,,,,,,,,,,,,,,,,,,,,,,,"<a href=""http://ddr.lib.drake.edu/u?/du-relays,143"" target=""_blank"">View this item in its source respository</a>",,,,,,,,,,,,,,,,,,,,,,,,,,,,,https://www.iowaheritage.org/files/original/c5995155f648f895addbf1692c96a734.jpg,"Remote Item","Drake Relays Digital Archive",1,0
2095,https://www.iowaheritage.org/items/show/2095,"Drake Relays, 1960s","Track athletics--Iowa--Des Moines","A Drake Relays official makes an announcement.","Clinton, John D.","Special Collections, Cowles Library -- Drake University.",,,,"U.S. and International copyright laws protect this digital image. Commercial use or distribution of the image is not permitted without prior permission of the copyright holder. For permission to use the digital image, please contact: bart.schmidt@drake.edu","Drake Relays Digital Archive","35 mm color slide",,Image,"dr00238|http://ddr.lib.drake.edu/u?/du-relays,156",,,,,,,,,,,,,,,,,,,,,,,,,,,,,,,,,,,,,,,,,,,,,,,,"<a href=""http://ddr.lib.drake.edu/u?/du-relays,156"" target=""_blank"">View this item in its source respository</a>",,,,,,,,,,,,,,,,,,,,,,,,,,,,,https://www.iowaheritage.org/files/original/4976885d320027bb69ac0200578e13f7.jpg,"Remote Item","Drake Relays Digital Archive",1,0
2093,https://www.iowaheritage.org/items/show/2093,"Drake Relays, 1960s, Shuttle Relay","Track athletics--Iowa--Des Moines|Relay racing--Iowa--Des Moines","The start of the Shuttle Relay, a race on the infield grass for elementary school kids.","Clinton, John D.","Special Collections, Cowles Library -- Drake University.",,,,"U.S. and International copyright laws protect this digital image. Commercial use or distribution of the image is not permitted without prior permission of the copyright holder. For permission to use the digital image, please contact: bart.schmidt@drake.edu","Drake Relays Digital Archive","35 mm color slide",,Image,"dr00236|http://ddr.lib.drake.edu/u?/du-relays,154",,,,,,,,,,,,,,,,,,,,,,,,,,,,,,,,,,,,,,,,,,,,,,,,"<a href=""http://ddr.lib.drake.edu/u?/du-relays,154"" target=""_blank"">View this item in its source respository</a>",,,,,,,,,,,,,,,,,,,,,,,,,,,,,https://www.iowaheritage.org/files/original/2070a9c1bff24e52513836560730d045.jpg,"Remote Item","Drake Relays Digital Archive",1,0
2098,https://www.iowaheritage.org/items/show/2098,"Drake Relays, 1960s, Womens Relay","Track athletics--Iowa--Des Moines|Relay racing--Iowa--Des Moines","Runners prepare to begin an unknown relay race.","Clinton, John D.","Special Collections, Cowles Library -- Drake University.",,,,"U.S. and International copyright laws protect this digital image. Commercial use or distribution of the image is not permitted without prior permission of the copyright holder. For permission to use the digital image, please contact: bart.schmidt@drake.edu","Drake Relays Digital Archive","35 mm color slide",,Image,"dr00244|http://ddr.lib.drake.edu/u?/du-relays,159",,,,,,,,,,,,,,,,,,,,,,,,,,,,,,,,,,,,,,,,,,,,,,,,"<a href=""http://ddr.lib.drake.edu/u?/du-relays,159"" target=""_blank"">View this item in its source respository</a>",,,,,,,,,,,,,,,,,,,,,,,,,,,,,https://www.iowaheritage.org/files/original/d54d26d9dd37a053998d2b861d851c9a.jpg,"Remote Item","Drake Relays Digital Archive",1,0
2058,https://www.iowaheritage.org/items/show/2058,"Drake Relays, 1961","Track athletics--Iowa--Des Moines|Flags, American","Athletes and officials face the flag during the national anthem at the 1961 Drake Relays.","Clinton, John D.","Special Collections, Cowles Library -- Drake University.",,1961,,"U.S. and International copyright laws protect this digital image. Commercial use or distribution of the image is not permitted without prior permission of the copyright holder. For permission to use the digital image, please contact: bart.schmidt@drake.edu","Drake Relays Digital Archive","35 mm color slide",,Image,"dr00177|http://ddr.lib.drake.edu/u?/du-relays,112",,,,,,,,,,,,,,,,,,,,,,,,,,,,,,,,,,,,,,,,,,,,,,,,"<a href=""http://ddr.lib.drake.edu/u?/du-relays,112"" target=""_blank"">View this item in its source respository</a>",,,,,,,,,,,,,,,,,,,,,,,,,,,,,https://www.iowaheritage.org/files/original/fb529d0c7d214f35be213e5bc04adebf.jpg,"Remote Item","Drake Relays Digital Archive",1,0
2210,https://www.iowaheritage.org/items/show/2210,"Drake Relays, 1961","Track athletics--Iowa--Des Moines|Athletes--Kansas|Queens--Drake Relays","Members of the Two-Mile Relay team on the winners stand with Relays Queen Meredith Auld behind them. The University of Kansas dominated the event from 1958-1962. The 1961 won the event with a time of 7:28:6. Team members were Kirk Hagan, Gordon Davis, Bill Thornton and Bill Dotson.","Clinton, John D.","Special Collections, Cowles Library -- Drake University.",,1961,,"U.S. and International copyright laws protect this digital image. Commercial use or distribution of the image is not permitted without prior permission of the copyright holder. For permission to use the digital image, please contact: bart.schmidt@drake.edu","Drake Relays Digital Archive","35 mm color slide",,Image,"dr00418|http://ddr.lib.drake.edu/u?/du-relays,304",,,,,,,,,,,,,,,,,,,,,,,,,,,,,,,,,,,,,,,,,,,,,,,,"<a href=""http://ddr.lib.drake.edu/u?/du-relays,304"" target=""_blank"">View this item in its source respository</a>",,,,,,,,,,,,,,,,,,,,,,,,,,,,,https://www.iowaheritage.org/files/original/356a73aa0e35902dca85d9c07bf99425.jpg,"Remote Item","Drake Relays Digital Archive",1,0
2099,https://www.iowaheritage.org/items/show/2099,"Drake Relays, 1961, 100-Yard Dash","Track athletics--Iowa--Des Moines|","These are the women who competed against Wilma Rudolph in the 1961 Womens 100-Yard Dash.  Rudolph, a world class sprinter who won 3 gold medals in the 1960 Olympics, lined up against these high school athletes for the first womens event in Drake Relays History.","Clinton, John D.","Special Collections, Cowles Library -- Drake University.",,,,"U.S. and International copyright laws protect this digital image. Commercial use or distribution of the image is not permitted without prior permission of the copyright holder. For permission to use the digital image, please contact: bart.schmidt@drake.edu","Drake Relays Digital Archive","35 mm color slide",,Image,"dr00245|http://ddr.lib.drake.edu/u?/du-relays,160",,,,,,,,,,,,,,,,,,,,,,,,,,,,,,,,,,,,,,,,,,,,,,,,"<a href=""http://ddr.lib.drake.edu/u?/du-relays,160"" target=""_blank"">View this item in its source respository</a>",,,,,,,,,,,,,,,,,,,,,,,,,,,,,https://www.iowaheritage.org/files/original/637189ec5a2145a44e52099d6b9c9e25.jpg,"Remote Item","Drake Relays Digital Archive",1,0
2024,https://www.iowaheritage.org/items/show/2024,"Drake Relays, 1961, Bobby Bernard","Track athletics--Iowa--Des Moines|Athletes--Texas","Bobby Bernard of TCU checks out his new watch after winning the 120 yard high hurdles. His time was 14.4 seconds.","Clinton, John D.","Special Collections, Cowles Library -- Drake University.",,1961,,"U.S. and International copyright laws protect this digital image. Commercial use or distribution of the image is not permitted without prior permission of the copyright holder. For permission to use the digital image, please contact: bart.schmidt@drake.edu","Drake Relays Digital Archive","35 mm color slide",,Image,"dr00079|http://ddr.lib.drake.edu/u?/du-relays,69",,,,,,,,,,,,,,,,,,,,,,,,,,,,,,,,,,,,,,,,,,,,,,,,"<a href=""http://ddr.lib.drake.edu/u?/du-relays,69"" target=""_blank"">View this item in its source respository</a>",,,,,,,,,,,,,,,,,,,,,,,,,,,,,https://www.iowaheritage.org/files/original/63b4e23fa6de46c079f1cf18818b7608.jpg,"Remote Item","Drake Relays Digital Archive",1,0
