 




﻿"Item Id","Item URI","Dublin Core:Title","Dublin Core:Subject","Dublin Core:Description","Dublin Core:Creator","Dublin Core:Source","Dublin Core:Publisher","Dublin Core:Date","Dublin Core:Contributor","Dublin Core:Rights","Dublin Core:Relation","Dublin Core:Format","Dublin Core:Language","Dublin Core:Type","Dublin Core:Identifier","Dublin Core:Coverage","Item Type Metadata:Text","Item Type Metadata:Interviewer","Item Type Metadata:Interviewee","Item Type Metadata:Location","Item Type Metadata:Transcription","Item Type Metadata:Local URL","Item Type Metadata:Original Format","Item Type Metadata:Physical Dimensions","Item Type Metadata:Duration","Item Type Metadata:Compression","Item Type Metadata:Producer","Item Type Metadata:Director","Item Type Metadata:Bit Rate/Frequency","Item Type Metadata:Time Summary","Item Type Metadata:Email Body","Item Type Metadata:Subject Line","Item Type Metadata:From","Item Type Metadata:To","Item Type Metadata:CC","Item Type Metadata:BCC","Item Type Metadata:Number of Attachments","Item Type Metadata:Standards","Item Type Metadata:Objectives","Item Type Metadata:Materials","Item Type Metadata:Lesson Plan Text","Item Type Metadata:URL","Item Type Metadata:Event Type","Item Type Metadata:Participants","Item Type Metadata:Birth Date","Item Type Metadata:Birthplace","Item Type Metadata:Death Date","Item Type Metadata:Occupation","Item Type Metadata:Biographical Text","Item Type Metadata:Bibliography","Item Type Metadata:Digital Reproduction Information","Item Type Metadata:Repository","Item Type Metadata:Repository Collection","Item Type Metadata:Contact information.","Item Type Metadata:File Name","Item Type Metadata:Notes","Item Type Metadata:Digital item created","Item Type Metadata:Digital item modified","Item Type Metadata:Executive Orders","Item Type Metadata:Record Created","Item Type Metadata:Record Modified","Item Type Metadata:Transcription2","Item Type Metadata:Source URL","Omeka Legacy File:Additional Creator","Omeka Legacy File:Transcriber","Omeka Legacy File:Producer","Omeka Legacy File:Render Device","Omeka Legacy File:Render Details","Omeka Legacy File:Capture Date","Omeka Legacy File:Capture Device","Omeka Legacy File:Capture Details","Omeka Legacy File:Change History","Omeka Legacy File:Watermark","Omeka Legacy File:Encryption","Omeka Legacy File:Compression","Omeka Legacy File:Post Processing","Omeka Image File:Width","Omeka Image File:Height","Omeka Image File:Bit Depth","Omeka Image File:Channels","Omeka Image File:Exif String","Omeka Image File:Exif Array","Omeka Image File:IPTC String","Omeka Image File:IPTC Array","Omeka Video File:Bitrate","Omeka Video File:Duration","Omeka Video File:Sample Rate","Omeka Video File:Codec","Omeka Video File:Width","Omeka Video File:Height",tags,file,itemType,collection,public,featured
17549,https://www.iowaheritage.org/items/show/17549,"Henry A. Wallace with wife, Ilo, United States, 1930s","Spouses|Wallace, Henry A. (Henry Agard), 1888-1965|United States|1930-1940|Statesmen|Wallace, Ilo",,unidentified,,"University of Iowa. Libraries. Special Collections Dept.",1930/1939|2010-02-01,,"Educational use only, no other permissions given. U.S. and international copyright laws may protect this item. Commercial use or distribution of this digital object is not permitted without written permission of the University of Iowa Special Collections Dept.","Henry A. Wallace Collection|Henry Agard Wallace papers|http://lib.uiowa.edu/collguides/?MSC0177|Photographs & images|Scanned with Ricoh 3228C scanner at 300 ppi. Archival tiff available.",jpeg,,"Still image|Photographs",MSC0177|7|25|wal-018.jpg|https://digital.lib.uiowa.edu/,,,,,,,,,,,,,,,,,,,,,,,,,,,,,,,,,,,,,,,,,,,,,,,,"<a href=""https://digital.lib.uiowa.edu/"" target=""_blank"">View this item in its source respository</a>",,,,,,,,,,,,,,,,,,,,,,,,,,,,,https://www.iowaheritage.org/files/original/767818513aa034d53b7b92ed06f79b6b.jpg,"Remote Item","Henry A. Wallace Collection",1,0
17547,https://www.iowaheritage.org/items/show/17547,"Henry A. Wallace, at left, standing with a group of men, United States, 1930s","Statesmen|Wallace, Henry A. (Henry Agard), 1888-1965|United States|1930-1940|Silos",,unidentified,,"University of Iowa. Libraries. Special Collections Dept.",1930/1939|2010-02-01,,"Educational use only, no other permissions given. U.S. and international copyright laws may protect this item. Commercial use or distribution of this digital object is not permitted without written permission of the University of Iowa Special Collections Dept.","Henry A. Wallace Collection|Henry Agard Wallace papers|http://lib.uiowa.edu/collguides/?MSC0177|Photographs & images|Scanned with Ricoh 3228C scanner at 300 ppi. Archival tiff available.",jpeg,,"Still image|Photographs; Group portraits",MSC0177|7|24|wal-019.jpg|https://digital.lib.uiowa.edu/,,,,,,,,,,,,,,,,,,,,,,,,,,,,,,,,,,,,,,,,,,,,,,,,"<a href=""https://digital.lib.uiowa.edu/"" target=""_blank"">View this item in its source respository</a>",,,,,,,,,,,,,,,,,,,,,,,,,,,,,https://www.iowaheritage.org/files/original/ff0147c48ec76762ed8bde55b3f71288.jpg,"Remote Item","Henry A. Wallace Collection",1,0
17541,https://www.iowaheritage.org/items/show/17541,"Henry A. Wallace as Secretary of Agriculture, Washington, D.C., 1930s","Cabinet officers|Wallace, Henry A. (Henry Agard), 1888-1965|United States -- Washington, D.C.|1930-1940",,unidentified,,"University of Iowa. Libraries. Special Collections Dept.",1930/1939|2010-02-01,,"Educational use only, no other permissions given. U.S. and international copyright laws may protect this item. Commercial use or distribution of this digital object is not permitted without written permission of the University of Iowa Special Collections Dept.","Henry A. Wallace Collection|Henry Agard Wallace papers|http://lib.uiowa.edu/collguides/?MSC0177|Photographs & images|Scanned with Ricoh 3228C scanner at 300 ppi. Archival tiff available.",jpeg,,"Still image|Photographs",MSC0177|7|22|wal-021.jpg|https://digital.lib.uiowa.edu/,,,,,,,,,,,,,,,,,,,,,,,,,,,,,,,,,,,,,,,,,,,,,,,,"<a href=""https://digital.lib.uiowa.edu/"" target=""_blank"">View this item in its source respository</a>",,,,,,,,,,,,,,,,,,,,,,,,,,,,,https://www.iowaheritage.org/files/original/96848ec5394674bfbc4d3f4be2a8c494.jpg,"Remote Item","Henry A. Wallace Collection",1,0
17539,https://www.iowaheritage.org/items/show/17539,"Henry A. Wallace as Secretary of Agriculture, Washington, D.C., 1930s","Cabinet officers|Wallace, Henry A. (Henry Agard), 1888-1965|United States -- Washington, D.C.|1930-1940",,unidentified,,"University of Iowa. Libraries. Special Collections Dept.",1930/1939|2010-02-01,,"Educational use only, no other permissions given. U.S. and international copyright laws may protect this item. Commercial use or distribution of this digital object is not permitted without written permission of the University of Iowa Special Collections Dept.","Henry A. Wallace Collection|Henry Agard Wallace papers|http://lib.uiowa.edu/collguides/?MSC0177|Photographs & images|Scanned with Ricoh 3228C scanner at 300 ppi. Archival tiff available.",jpeg,,"Still image|Photographs",MSC0177|7|20|wal-022.jpg|https://digital.lib.uiowa.edu/,,,,,,,,,,,,,,,,,,,,,,,,,,,,,,,,,,,,,,,,,,,,,,,,"<a href=""https://digital.lib.uiowa.edu/"" target=""_blank"">View this item in its source respository</a>",,,,,,,,,,,,,,,,,,,,,,,,,,,,,https://www.iowaheritage.org/files/original/f7f1c40b7b91685db71a3f2bfd890e3c.jpg,"Remote Item","Henry A. Wallace Collection",1,0
17518,https://www.iowaheritage.org/items/show/17518,"Secretary of Agriculture Henry Wallace in radio farm discussion with Lyman Bryson and Gen. Hugh S. Johnson (left to right), Washington, D.C., October 30, 1938","Cabinet officers|Wallace, Henry A. (Henry Agard), 1888-1965|United States -- Washington, D.C.|1930-1940|Farming|Radio broadcasting|Generals|College administrators|Bryson, Lyman|Johnson Hugh S.",,unidentified,,"University of Iowa. Libraries. Special Collections Dept.",1938-10-31|2010-02-01,,"Educational use only, no other permissions given. U.S. and international copyright laws may protect this item. Commercial use or distribution of this digital object is not permitted without written permission of the University of Iowa Special Collections Dept.","Henry A. Wallace Collection|Henry Agard Wallace papers|http://lib.uiowa.edu/collguides/?MSC0177|Photographs & images|Press Photographs - 7 x 9s|Scanned with Ricoh 3228C scanner at 300 ppi. Archival tiff available.",jpeg,,"Still image|Photographs",MSC0177|7|10|wal-033.jpg|https://digital.lib.uiowa.edu/,,,,,,,,,,,,,,,,,,,,,,,,,,,,,,,,,,,,,,,,,,,,,,,,"<a href=""https://digital.lib.uiowa.edu/"" target=""_blank"">View this item in its source respository</a>",,,,,,,,,,,,,,,,,,,,,,,,,,,,,https://www.iowaheritage.org/files/original/dedaf65560ced2866709055ea94953e5.jpg,"Remote Item","Henry A. Wallace Collection",1,0
17516,https://www.iowaheritage.org/items/show/17516,"President Franklin Roosevelt arrives at campaign stop, Springfield, Ill., October 15, 1936","Political campaigns|Wallace, Henry A. (Henry Agard), 1888-1965|United States -- Illinois -- Springfield|1930-1940|Railroads|Politicians|Governors|Presidents|Cabinet officers|Roosevelt, Franklin D. (Franklin Delano), 1882-1945|Horner, Henry, 1878-1940|Smith, F. Lynden",,unidentified,,"University of Iowa. Libraries. Special Collections Dept.",1936-10-15|2010-02-01,,"Educational use only, no other permissions given. U.S. and international copyright laws may protect this item. Commercial use or distribution of this digital object is not permitted without written permission of the University of Iowa Special Collections Dept.","Henry A. Wallace Collection|Henry Agard Wallace papers|http://lib.uiowa.edu/collguides/?MSC0177|Photographs & images|Press Photographs - 7 x 9s|Scanned with Ricoh 3228C scanner at 300 ppi. Archival tiff available.",jpeg,,"Still image|Photographs",MSC0177|7|6|wal-034.jpg|https://digital.lib.uiowa.edu/,,,,,,,,,,,,,,,,,,,,,,,,,,,,,,,,,,,,,,,,,,,,,,,,"<a href=""https://digital.lib.uiowa.edu/"" target=""_blank"">View this item in its source respository</a>",,,,,,,,,,,,,,,,,,,,,,,,,,,,,https://www.iowaheritage.org/files/original/e4aaeecae6531adfe7c94ef44269aee8.jpg,"Remote Item","Henry A. Wallace Collection",1,0
17515,https://www.iowaheritage.org/items/show/17515,"Secretary of Agriculture Henry Wallace and AAA administrator Chester Davis at White House after AAA ban, Washington, D.C., Jan. 6, 1936","Cabinet officers|United States. Agricultural Adjustment Act 1933|Wallace, Henry A. (Henry Agard), 1888-1965|White House (Washington, D.C.)|United States -- Washington, D.C.|1930-1940|Government officials|Supreme Court decisions|Davis, Chester","Agricultural Adjustment Act (AAA) restricted agricultural production in the New Deal era by paying farmers to reduce crop area. In 1936, the Supreme Court case United States v. Butler declared the Act unconstitutional.",unidentified,,"University of Iowa. Libraries. Special Collections Dept.",1936-01-06|2010-02-01,,"Educational use only, no other permissions given. U.S. and international copyright laws may protect this item. Commercial use or distribution of this digital object is not permitted without written permission of the University of Iowa Special Collections Dept.","Henry A. Wallace Collection|Henry Agard Wallace papers|http://lib.uiowa.edu/collguides/?MSC0177|Photographs & images|Press Photographs - 7 x 9s|Scanned with Ricoh 3228C scanner at 300 ppi. Archival tiff available.",jpeg,,"Still image|Photographs",MSC0177|7|3|wal-035.jpg|https://digital.lib.uiowa.edu/,,,,,,,,,,,,,,,,,,,,,,,,,,,,,,,,,,,,,,,,,,,,,,,,"<a href=""https://digital.lib.uiowa.edu/"" target=""_blank"">View this item in its source respository</a>",,,,,,,,,,,,,,,,,,,,,,,,,,,,,https://www.iowaheritage.org/files/original/5b865935c5b375158264e3c29b44fa88.jpg,"Remote Item","Henry A. Wallace Collection",1,0
17514,https://www.iowaheritage.org/items/show/17514,"Farmers at Constitution Hall listening to address by Secretary of Agriculture Henry Wallace, Washington, D.C., May 14, 1935","Farmers|Wallace, Henry A. (Henry Agard), 1888-1965|Constitution Hall (Washington, D.C.)|United States -- Washington, D.C.|1930-1940|Public speaking|Audiences|Cabinet officers",,unidentified,,"University of Iowa. Libraries. Special Collections Dept.",1935-05-14|2010-02-01,,"Educational use only, no other permissions given. U.S. and international copyright laws may protect this item. Commercial use or distribution of this digital object is not permitted without written permission of the University of Iowa Special Collections Dept.","Henry A. Wallace Collection|Henry Agard Wallace papers|http://lib.uiowa.edu/collguides/?MSC0177|Photographs & images|Press Photographs - 7 x 9s|Scanned with Ricoh 3228C scanner at 300 ppi. Archival tiff available.",jpeg,,"Still image|Photographs",MSC0177|7|2|wal-036.jpg|https://digital.lib.uiowa.edu/,,,,,,,,,,,,,,,,,,,,,,,,,,,,,,,,,,,,,,,,,,,,,,,,"<a href=""https://digital.lib.uiowa.edu/"" target=""_blank"">View this item in its source respository</a>",,,,,,,,,,,,,,,,,,,,,,,,,,,,,https://www.iowaheritage.org/files/original/f001f000dcc2c52fca93183225693fd9.jpg,"Remote Item","Henry A. Wallace Collection",1,0
17506,https://www.iowaheritage.org/items/show/17506,"Henry A. Wallace correspondence [reel 67], 1934-1965","Manuscripts|Vice presidents|Wallace, Henry Agard, 1888-1965|1930-1940|Politics & government|1940-1950|1950-1960|1960-1970","Includes several manuscripts of several pages each, by Henry A. Wallace, in his handwriting, and with titles supplied by him. Documents by Henry A. Wallace and others include: ""Abstract of Conversation with Mr. John Maynard Keynes,"" 1936, statements on the Board of Economic Warfare and the Reconstruction Finance Corporation, June-July, 1943,  a list of Wallace delegates, Aug. 11, 1944, ""Miscellaneous Recollections of the Interment Train, Apr. 14-15, 1945"" (Roosevelt funeral), cabinet meeting papers, Aug.-Sept., 1945,  ""Korea, Trygvie Lie and the Progressive Party from July 6 to 12, 1950"", personnel information on certain former USDA attorneys, economists, and others, 1951, ""The Last [Truman] Cabinet Dinner, Dec. 4, 1952, ""The End of an Era"", Henry A.  Wallace's notes on private meeting with Ezra Taft Benson, discussion with Marquis Childs, and Gridiron Dinner, Washington, D.C., Dec. 8, 1956, Henry A. Wallace's notes on Truman Committee 21st Anniversary Dinner, Feb. 13, 1962, ""Truman's 80th Birthday Celebration, May 8"" (Truman Committee, 23rd Anniversary Dinner, 1964), and ""Amateur Growing of Strawberries from Seed"", (1965?).","Wallace, Henry Agard, 1888-1965;",,"University of Iowa. Libraries. Special Collections Dept.",1934|2009,,"Educational use only, no other permissions given. U.S. and international copyright laws may protect this item. Commercial use or distribution of this digital object is not permitted without written permission of the University of Iowa Special Collections Dept.","Henry A. Wallace Collection|Henry A. Wallace Correspondence|Henry Agard Wallace papers|http://lib.uiowa.edu/collguides/?MSC0177|Microfilm digitized by Heritage Microfilm, Cedar Rapids, IA at 400 ppi, 8-bit grayscale.  Display images in JPEG format derived from master TIFFs.",jpeg,,Text|Correspondence,67|MSC0177|index.cpd|https://digital.lib.uiowa.edu/,,,,,,,,,,,,,,,,,,,,,,,,,,,,,,,,,,,,,,,,,,,,,,,,"<a href=""https://digital.lib.uiowa.edu/"" target=""_blank"">View this item in its source respository</a>",,,,,,,,,,,,,,,,,,,,,,,,,,,,,https://www.iowaheritage.org/files/original/6beb0e9782afe09b2a98ce064cd7c8fe.jpg,"Remote Item","Henry A. Wallace Collection",1,0
17495,https://www.iowaheritage.org/items/show/17495,"Henry A. Wallace correspondence [reel 61], 1936-1939","Appointment books|Vice presidents|Wallace, Henry Agard, 1888-1965|1930-1940|Politics & government","There are four appointment books, one for each year, on this reel.","Wallace, Henry Agard, 1888-1965;",,"University of Iowa. Libraries. Special Collections Dept.",1936|2009,,"Educational use only, no other permissions given. U.S. and international copyright laws may protect this item. Commercial use or distribution of this digital object is not permitted without written permission of the University of Iowa Special Collections Dept.","Henry A. Wallace Correspondence|Henry Agard Wallace papers|http://lib.uiowa.edu/collguides/?MSC0177|Microfilm digitized by Heritage Microfilm, Cedar Rapids, IA at 400 ppi, 8-bit grayscale.  Display images in JPEG format derived from master TIFFs.",jpeg,,Text|Correspondence,61|MSC0177|index.cpd|https://digital.lib.uiowa.edu/,,,,,,,,,,,,,,,,,,,,,,,,,,,,,,,,,,,,,,,,,,,,,,,,"<a href=""https://digital.lib.uiowa.edu/"" target=""_blank"">View this item in its source respository</a>",,,,,,,,,,,,,,,,,,,,,,,,,,,,,https://www.iowaheritage.org/files/original/dcc9776278ffd18d798e02c595beb3c0.jpg,"Remote Item","Henry A. Wallace Collection",1,0
