 




﻿"Item Id","Item URI","Dublin Core:Title","Dublin Core:Subject","Dublin Core:Description","Dublin Core:Creator","Dublin Core:Source","Dublin Core:Publisher","Dublin Core:Date","Dublin Core:Contributor","Dublin Core:Rights","Dublin Core:Relation","Dublin Core:Format","Dublin Core:Language","Dublin Core:Type","Dublin Core:Identifier","Dublin Core:Coverage","Item Type Metadata:Text","Item Type Metadata:Interviewer","Item Type Metadata:Interviewee","Item Type Metadata:Location","Item Type Metadata:Transcription","Item Type Metadata:Local URL","Item Type Metadata:Original Format","Item Type Metadata:Physical Dimensions","Item Type Metadata:Duration","Item Type Metadata:Compression","Item Type Metadata:Producer","Item Type Metadata:Director","Item Type Metadata:Bit Rate/Frequency","Item Type Metadata:Time Summary","Item Type Metadata:Email Body","Item Type Metadata:Subject Line","Item Type Metadata:From","Item Type Metadata:To","Item Type Metadata:CC","Item Type Metadata:BCC","Item Type Metadata:Number of Attachments","Item Type Metadata:Standards","Item Type Metadata:Objectives","Item Type Metadata:Materials","Item Type Metadata:Lesson Plan Text","Item Type Metadata:URL","Item Type Metadata:Event Type","Item Type Metadata:Participants","Item Type Metadata:Birth Date","Item Type Metadata:Birthplace","Item Type Metadata:Death Date","Item Type Metadata:Occupation","Item Type Metadata:Biographical Text","Item Type Metadata:Bibliography","Item Type Metadata:Digital Reproduction Information","Item Type Metadata:Repository","Item Type Metadata:Repository Collection","Item Type Metadata:Contact information.","Item Type Metadata:File Name","Item Type Metadata:Notes","Item Type Metadata:Digital item created","Item Type Metadata:Digital item modified","Item Type Metadata:Executive Orders","Item Type Metadata:Record Created","Item Type Metadata:Record Modified","Item Type Metadata:Transcription2","Item Type Metadata:Source URL","Omeka Legacy File:Additional Creator","Omeka Legacy File:Transcriber","Omeka Legacy File:Producer","Omeka Legacy File:Render Device","Omeka Legacy File:Render Details","Omeka Legacy File:Capture Date","Omeka Legacy File:Capture Device","Omeka Legacy File:Capture Details","Omeka Legacy File:Change History","Omeka Legacy File:Watermark","Omeka Legacy File:Encryption","Omeka Legacy File:Compression","Omeka Legacy File:Post Processing","Omeka Image File:Width","Omeka Image File:Height","Omeka Image File:Bit Depth","Omeka Image File:Channels","Omeka Image File:Exif String","Omeka Image File:Exif Array","Omeka Image File:IPTC String","Omeka Image File:IPTC Array","Omeka Video File:Bitrate","Omeka Video File:Duration","Omeka Video File:Sample Rate","Omeka Video File:Codec","Omeka Video File:Width","Omeka Video File:Height",tags,file,itemType,collection,public,featured
64472,https://www.iowaheritage.org/items/show/64472,"Play ball!","Baseball|United States|Men|1990-2000|Baseball commissioners|Baseball players|Sports|Strikes|Strikes and lockouts|Agreements|Speeches|Podiums|Press conferences|Microphones|Baseball bats|Baseball gloves|Baseball players|Stadiums|Soldiers|Trenches","We have a truce, but until we have a signed agreement from the combatants we have decided to send in a U.N. peace-keeping force","Duffy, Brian, 1955-",,"University of Iowa. Libraries. Special Collections Dept.",1995-04-09|2011-04,,"Educational use only, no other permissions given. Copyright to this digital object is owned by The Des Moines Register; it may not be downloaded, reproduced, or distributed without written permission. For more information, contact the Special Collections Department.","Editorial Cartoons of Brian Duffy; Des Moines Register Cartoonists|Papers of Brian Duffy|Des Moines Register",,English,"Still image|Editorial cartoons",MSC916|duffy-950409|http://digital.lib.uiowa.edu/cdm/ref/collection/duffy/id/310,,,,,,,,,,,,,,,,,,,,,,,,,,,,,,,,,,,,,,,,,,,,,,,,"<a href=""http://digital.lib.uiowa.edu/cdm/ref/collection/duffy/id/310"" target=""_blank"">View this item in its source respository</a>",,,,,,,,,,,,,,,,,,,,,,,,,,,,,https://www.iowaheritage.org/files/original/945360f07fcadd32e912e45ee56f084b.jpg,"Remote Item","Editorial Cartoons of Brian Duffy",1,0
64471,https://www.iowaheritage.org/items/show/64471,"Contract with America relays","Congress|Gingrich, Newt|Washington (D.C.)|Men|1990-2000|Political parties|Political promises|Politics|Politicians|Republican Party|Turtles|Running|Races|Batons|Sweating|Tongues","House; Senate; Pant; Pant; Pant; Pant; Gasp","Duffy, Brian, 1955-",,"University of Iowa. Libraries. Special Collections Dept.",1995-04-07|2011-04,,"Educational use only, no other permissions given. Copyright to this digital object is owned by The Des Moines Register; it may not be downloaded, reproduced, or distributed without written permission. For more information, contact the Special Collections Department.","Editorial Cartoons of Brian Duffy; Des Moines Register Cartoonists|Papers of Brian Duffy|Des Moines Register",,English,"Still image|Editorial cartoons",MSC916|duffy-950407|http://digital.lib.uiowa.edu/cdm/ref/collection/duffy/id/309,,,,,,,,,,,,,,,,,,,,,,,,,,,,,,,,,,,,,,,,,,,,,,,,"<a href=""http://digital.lib.uiowa.edu/cdm/ref/collection/duffy/id/309"" target=""_blank"">View this item in its source respository</a>",,,,,,,,,,,,,,,,,,,,,,,,,,,,,https://www.iowaheritage.org/files/original/9df1e6058496800b40c02b086857acce.jpg,"Remote Item","Editorial Cartoons of Brian Duffy",1,0
64470,https://www.iowaheritage.org/items/show/64470,"How many lives has he got left?","Presidents|Clinton, Bill, 1946-|Iraq|Presidents|1990-2000|United States -- Foreign relations -- Iraq|War|Dictators|Hussein, Saddam, 1937-2006|Christopher, Warren|Deserts|Smoke|Cats|Bandages|Bomb craters|Men",Saddam,"Duffy, Brian, 1955-",,"University of Iowa. Libraries. Special Collections Dept.",1995-04-06|2011-04,,"Educational use only, no other permissions given. Copyright to this digital object is owned by The Des Moines Register; it may not be downloaded, reproduced, or distributed without written permission. For more information, contact the Special Collections Department.","Editorial Cartoons of Brian Duffy; Des Moines Register Cartoonists|Papers of Brian Duffy|Des Moines Register",,English,"Still image|Editorial cartoons",MSC916|duffy-950406|http://digital.lib.uiowa.edu/cdm/ref/collection/duffy/id/308,,,,,,,,,,,,,,,,,,,,,,,,,,,,,,,,,,,,,,,,,,,,,,,,"<a href=""http://digital.lib.uiowa.edu/cdm/ref/collection/duffy/id/308"" target=""_blank"">View this item in its source respository</a>",,,,,,,,,,,,,,,,,,,,,,,,,,,,,https://www.iowaheritage.org/files/original/50837da179c32601d8fb34e18dc37afe.jpg,"Remote Item","Editorial Cartoons of Brian Duffy",1,0
64466,https://www.iowaheritage.org/items/show/64466,"Clouds moving in again?","Mosquitoes|United States|Men|1990-2000|Mosquito control|Outdoors|Pests|Insects|Women|Yards|Mosquitoes|Shadows|Lawn mowers|Lawns|Fences","Mosquitoes; They're back!","Duffy, Brian, 1955-",,"University of Iowa. Libraries. Special Collections Dept.",1993-09-12|2011-04,,"Educational use only, no other permissions given. Copyright to this digital object is owned by The Des Moines Register; it may not be downloaded, reproduced, or distributed without written permission. For more information, contact the Special Collections Department.","Editorial Cartoons of Brian Duffy; Des Moines Register Cartoonists|Papers of Brian Duffy|Des Moines Register",,English,"Still image|Editorial cartoons",MSC916|duffy-930912|http://digital.lib.uiowa.edu/cdm/ref/collection/duffy/id/304,,,,,,,,,,,,,,,,,,,,,,,,,,,,,,,,,,,,,,,,,,,,,,,,"<a href=""http://digital.lib.uiowa.edu/cdm/ref/collection/duffy/id/304"" target=""_blank"">View this item in its source respository</a>",,,,,,,,,,,,,,,,,,,,,,,,,,,,,https://www.iowaheritage.org/files/original/64f020438632e9623b6c31bc1ddfeacd.jpg,"Remote Item","Editorial Cartoons of Brian Duffy",1,0
64461,https://www.iowaheritage.org/items/show/64461,"OK everyone, back on the boat","Floods|Iowa|Arks|1990-2000|Flood relief|Rain|Weather|Weather forecasting|Water|Noah's ark|Men|Women|Cows|Pigs|Rain|Farmers",@#*H2O,"Duffy, Brian, 1955-",,"University of Iowa. Libraries. Special Collections Dept.",1993-08-13|2011-04,,"Educational use only, no other permissions given. Copyright to this digital object is owned by The Des Moines Register; it may not be downloaded, reproduced, or distributed without written permission. For more information, contact the Special Collections Department.","Editorial Cartoons of Brian Duffy; Des Moines Register Cartoonists|Papers of Brian Duffy|Des Moines Register",,English,"Still image|Editorial cartoons",MSC916|duffy-930813|http://digital.lib.uiowa.edu/cdm/ref/collection/duffy/id/299,,,,,,,,,,,,,,,,,,,,,,,,,,,,,,,,,,,,,,,,,,,,,,,,"<a href=""http://digital.lib.uiowa.edu/cdm/ref/collection/duffy/id/299"" target=""_blank"">View this item in its source respository</a>",,,,,,,,,,,,,,,,,,,,,,,,,,,,,https://www.iowaheritage.org/files/original/c1fc5753d1c5861f9bec5324a355bbec.jpg,"Remote Item","Editorial Cartoons of Brian Duffy",1,0
64458,https://www.iowaheritage.org/items/show/64458,"I put my constituent first!","Politicians|Brooks, Archie|Des Moines (Iowa)|Men|1990-2000|Politics|Floods|Communications|City government|Cities|Police -- Des Moines (Iowa)|Disasters, natural|Safety|Desks|Offices|Signs|Wire|Scissors & shears|Bow ties","City councilman; Snip; Brooks; Police communication; Ruan Building manager","Duffy, Brian, 1955-",,"University of Iowa. Libraries. Special Collections Dept.",1993-07-22|2011-04,,"Educational use only, no other permissions given. Copyright to this digital object is owned by The Des Moines Register; it may not be downloaded, reproduced, or distributed without written permission. For more information, contact the Special Collections Department.","Editorial Cartoons of Brian Duffy; Des Moines Register Cartoonists|Papers of Brian Duffy|Des Moines Register",,English,"Still image|Editorial cartoons",MSC916|duffy-930722|http://digital.lib.uiowa.edu/cdm/ref/collection/duffy/id/296,,,,,,,,,,,,,,,,,,,,,,,,,,,,,,,,,,,,,,,,,,,,,,,,"<a href=""http://digital.lib.uiowa.edu/cdm/ref/collection/duffy/id/296"" target=""_blank"">View this item in its source respository</a>",,,,,,,,,,,,,,,,,,,,,,,,,,,,,https://www.iowaheritage.org/files/original/09bb240ca131127aac2356b05b0cf475.jpg,"Remote Item","Editorial Cartoons of Brian Duffy",1,0
64457,https://www.iowaheritage.org/items/show/64457,"And if you think I'm gonna go away, you're crazier than that aunt in the attic!","Presidents|Clinton, Bill, 1946-|United States|Men|1990-2000|Opinions|Advice|Advisors|Perot, H. Ross, 1930-|Presidents|Candidates|Politicians",,"Duffy, Brian, 1955-",,"University of Iowa. Libraries. Special Collections Dept.",1993-07-09|2011-04,,"Educational use only, no other permissions given. Copyright to this digital object is owned by The Des Moines Register; it may not be downloaded, reproduced, or distributed without written permission. For more information, contact the Special Collections Department.","Editorial Cartoons of Brian Duffy; Des Moines Register Cartoonists|Papers of Brian Duffy|Des Moines Register",,English,"Still image|Editorial cartoons",MSC916|duffy-930709|http://digital.lib.uiowa.edu/cdm/ref/collection/duffy/id/295,,,,,,,,,,,,,,,,,,,,,,,,,,,,,,,,,,,,,,,,,,,,,,,,"<a href=""http://digital.lib.uiowa.edu/cdm/ref/collection/duffy/id/295"" target=""_blank"">View this item in its source respository</a>",,,,,,,,,,,,,,,,,,,,,,,,,,,,,https://www.iowaheritage.org/files/original/717012b8c69e054b078c1e552a34b825.jpg,"Remote Item","Editorial Cartoons of Brian Duffy",1,0
64453,https://www.iowaheritage.org/items/show/64453,"Duffy 1993","Cartoonists|Duffy, Brian, 1955-|Iowa|Signatures|1990-2000|Floods|Men|Boats|Rain|Rowboats|Oars",,"Duffy, Brian, 1955-",,"University of Iowa. Libraries. Special Collections Dept.",1993|2011-04,,"Educational use only, no other permissions given. Copyright to this digital object is owned by The Des Moines Register; it may not be downloaded, reproduced, or distributed without written permission. For more information, contact the Special Collections Department.","Editorial Cartoons of Brian Duffy; Des Moines Register Cartoonists|Papers of Brian Duffy|Des Moines Register",,English,"Still image|Editorial cartoons",MSC916|duffy-93xxxx|http://digital.lib.uiowa.edu/cdm/ref/collection/duffy/id/291,,,,,,,,,,,,,,,,,,,,,,,,,,,,,,,,,,,,,,,,,,,,,,,,"<a href=""http://digital.lib.uiowa.edu/cdm/ref/collection/duffy/id/291"" target=""_blank"">View this item in its source respository</a>",,,,,,,,,,,,,,,,,,,,,,,,,,,,,https://www.iowaheritage.org/files/original/4bb37258b4dd1900912b2a9dfd5688f0.jpg,"Remote Item","Editorial Cartoons of Brian Duffy",1,0
64452,https://www.iowaheritage.org/items/show/64452,"Special session on gambling","Gambling|Iowa|Men|1990-2000|Legislature|State governments|Issues|Opposition|Hammers|Nails|Coffins","Opponents; Proponents; Bang bang bang; Yank yank yank","Duffy, Brian, 1955-",,"University of Iowa. Libraries. Special Collections Dept.",1993-06-27|2011-04,,"Educational use only, no other permissions given. Copyright to this digital object is owned by The Des Moines Register; it may not be downloaded, reproduced, or distributed without written permission. For more information, contact the Special Collections Department.","Editorial Cartoons of Brian Duffy; Des Moines Register Cartoonists|Papers of Brian Duffy|Des Moines Register",,English,"Still image|Editorial cartoons",MSC916|duffy-930627|http://digital.lib.uiowa.edu/cdm/ref/collection/duffy/id/290,,,,,,,,,,,,,,,,,,,,,,,,,,,,,,,,,,,,,,,,,,,,,,,,"<a href=""http://digital.lib.uiowa.edu/cdm/ref/collection/duffy/id/290"" target=""_blank"">View this item in its source respository</a>",,,,,,,,,,,,,,,,,,,,,,,,,,,,,https://www.iowaheritage.org/files/original/3ddd7c53aed29a698ada53a933bfacdb.jpg,"Remote Item","Editorial Cartoons of Brian Duffy",1,0
64449,https://www.iowaheritage.org/items/show/64449,"Stop smoking programs","Laws|United States|Men|1990-2000|Legislation|Smoking|Cigarettes|Women|Psychiatrists|Cigarettes|Smoking|Smoke|Watches","Hypnosis; You are getting sleepy, and you don't want to smoke anymore; The patch; Federally mandated child-proof lighters; How does this @#*! thing work!; Flick flick flick flick flick flick flick flick","Duffy, Brian, 1955-",,"University of Iowa. Libraries. Special Collections Dept.",1993-06-11|2011-04,,"Educational use only, no other permissions given. Copyright to this digital object is owned by The Des Moines Register; it may not be downloaded, reproduced, or distributed without written permission. For more information, contact the Special Collections Department.","Editorial Cartoons of Brian Duffy; Des Moines Register Cartoonists|Papers of Brian Duffy|Des Moines Register",,English,"Still image|Editorial cartoons",MSC916|duffy-930611|http://digital.lib.uiowa.edu/cdm/ref/collection/duffy/id/287,,,,,,,,,,,,,,,,,,,,,,,,,,,,,,,,,,,,,,,,,,,,,,,,"<a href=""http://digital.lib.uiowa.edu/cdm/ref/collection/duffy/id/287"" target=""_blank"">View this item in its source respository</a>",,,,,,,,,,,,,,,,,,,,,,,,,,,,,https://www.iowaheritage.org/files/original/82ab16db22ffcb96c2378afda1d14403.jpg,"Remote Item","Editorial Cartoons of Brian Duffy",1,0
