 




﻿"Item Id","Item URI","Dublin Core:Title","Dublin Core:Subject","Dublin Core:Description","Dublin Core:Creator","Dublin Core:Source","Dublin Core:Publisher","Dublin Core:Date","Dublin Core:Contributor","Dublin Core:Rights","Dublin Core:Relation","Dublin Core:Format","Dublin Core:Language","Dublin Core:Type","Dublin Core:Identifier","Dublin Core:Coverage","Item Type Metadata:Text","Item Type Metadata:Interviewer","Item Type Metadata:Interviewee","Item Type Metadata:Location","Item Type Metadata:Transcription","Item Type Metadata:Local URL","Item Type Metadata:Original Format","Item Type Metadata:Physical Dimensions","Item Type Metadata:Duration","Item Type Metadata:Compression","Item Type Metadata:Producer","Item Type Metadata:Director","Item Type Metadata:Bit Rate/Frequency","Item Type Metadata:Time Summary","Item Type Metadata:Email Body","Item Type Metadata:Subject Line","Item Type Metadata:From","Item Type Metadata:To","Item Type Metadata:CC","Item Type Metadata:BCC","Item Type Metadata:Number of Attachments","Item Type Metadata:Standards","Item Type Metadata:Objectives","Item Type Metadata:Materials","Item Type Metadata:Lesson Plan Text","Item Type Metadata:URL","Item Type Metadata:Event Type","Item Type Metadata:Participants","Item Type Metadata:Birth Date","Item Type Metadata:Birthplace","Item Type Metadata:Death Date","Item Type Metadata:Occupation","Item Type Metadata:Biographical Text","Item Type Metadata:Bibliography","Item Type Metadata:Digital Reproduction Information","Item Type Metadata:Repository","Item Type Metadata:Repository Collection","Item Type Metadata:Contact information.","Item Type Metadata:File Name","Item Type Metadata:Notes","Item Type Metadata:Digital item created","Item Type Metadata:Digital item modified","Item Type Metadata:Executive Orders","Item Type Metadata:Record Created","Item Type Metadata:Record Modified","Item Type Metadata:Transcription2","Item Type Metadata:Source URL","Omeka Legacy File:Additional Creator","Omeka Legacy File:Transcriber","Omeka Legacy File:Producer","Omeka Legacy File:Render Device","Omeka Legacy File:Render Details","Omeka Legacy File:Capture Date","Omeka Legacy File:Capture Device","Omeka Legacy File:Capture Details","Omeka Legacy File:Change History","Omeka Legacy File:Watermark","Omeka Legacy File:Encryption","Omeka Legacy File:Compression","Omeka Legacy File:Post Processing","Omeka Image File:Width","Omeka Image File:Height","Omeka Image File:Bit Depth","Omeka Image File:Channels","Omeka Image File:Exif String","Omeka Image File:Exif Array","Omeka Image File:IPTC String","Omeka Image File:IPTC Array","Omeka Video File:Bitrate","Omeka Video File:Duration","Omeka Video File:Sample Rate","Omeka Video File:Codec","Omeka Video File:Width","Omeka Video File:Height",tags,file,itemType,collection,public,featured
2221,https://www.iowaheritage.org/items/show/2221,"Drake Relays, 1951, Rachel Marie Nordberg","Track athletics--Iowa--Des Moines|Queens--Drake Relays|","1951 Drake Relays Queen Rachel Marie Nordberg from the University of Miami Ohio, with Drake President Henry G. Harmon.","Clinton, John D.","Special Collections, Cowles Library -- Drake University.",,1951,,"U.S. and International copyright laws protect this digital image. Commercial use or distribution of the image is not permitted without prior permission of the copyright holder. For permission to use the digital image, please contact: bart.schmidt@drake.edu","Drake Relays Digital Archive","35 mm color slide",,Image,"dr00146|http://ddr.lib.drake.edu/u?/du-relays,323",,,,,,,,,,,,,,,,,,,,,,,,,,,,,,,,,,,,,,,,,,,,,,,,"<a href=""http://ddr.lib.drake.edu/u?/du-relays,323"" target=""_blank"">View this item in its source respository</a>",,,,,,,,,,,,,,,,,,,,,,,,,,,,,https://www.iowaheritage.org/files/original/9f6157e04feb370087fc629ee91a730f.jpg,"Remote Item","Drake Relays Digital Archive",1,0
2222,https://www.iowaheritage.org/items/show/2222,"Drake Relays, 1951, Rachel Marie Nordberg","Track athletics--Iowa--Des Moines|Queens--Drake Relays|Athletes--Ohio","Rachel Marie Nordberg of University of Miami Ohio was the 1951 Relays Queen.  Here she presents a runner from her school with an award.","Clinton, John D.","Special Collections, Cowles Library -- Drake University.",,1951,,"U.S. and International copyright laws protect this digital image. Commercial use or distribution of the image is not permitted without prior permission of the copyright holder. For permission to use the digital image, please contact: bart.schmidt@drake.edu","Drake Relays Digital Archive","35 mm color slide",,Image,"dr00147|http://ddr.lib.drake.edu/u?/du-relays,324",,,,,,,,,,,,,,,,,,,,,,,,,,,,,,,,,,,,,,,,,,,,,,,,"<a href=""http://ddr.lib.drake.edu/u?/du-relays,324"" target=""_blank"">View this item in its source respository</a>",,,,,,,,,,,,,,,,,,,,,,,,,,,,,https://www.iowaheritage.org/files/original/ffcbb154c1f4fd2db7c880f923bf5433.jpg,"Remote Item","Drake Relays Digital Archive",1,0
2223,https://www.iowaheritage.org/items/show/2223,"Drake Relays Parade, 1953, Emily Lou Bonham","Track athletics--Iowa--Des Moines|Queens--Drake Relays","Relays Queen Emily Lou  Bonham of North Texas State College in the Relays parade.","Clinton, John D.","Special Collections, Cowles Library -- Drake University.",,1953,,"U.S. and International copyright laws protect this digital image. Commercial use or distribution of the image is not permitted without prior permission of the copyright holder. For permission to use the digital image, please contact: bart.schmidt@drake.edu","Drake Relays Digital Archive","35 mm color slide",,Image,"dr00148|http://ddr.lib.drake.edu/u?/du-relays,325",,,,,,,,,,,,,,,,,,,,,,,,,,,,,,,,,,,,,,,,,,,,,,,,"<a href=""http://ddr.lib.drake.edu/u?/du-relays,325"" target=""_blank"">View this item in its source respository</a>",,,,,,,,,,,,,,,,,,,,,,,,,,,,,https://www.iowaheritage.org/files/original/96a51dcd473c72d3e506f1486158b657.jpg,"Remote Item","Drake Relays Digital Archive",1,0
2224,https://www.iowaheritage.org/items/show/2224,"Drake Relays, 1953, Emily Lou Bonham","Track athletics--Iowa--Des Moines|Queens--Drake Relays","Emily Lou Bonham of North Texas State College is crowned by Drake President H.G. Harmon.","Clinton, John D.","Special Collections, Cowles Library -- Drake University.",,,,"U.S. and International copyright laws protect this digital image. Commercial use or distribution of the image is not permitted without prior permission of the copyright holder. For permission to use the digital image, please contact: bart.schmidt@drake.edu","Drake Relays Digital Archive","35 mm color slide",,Image,"dr00412|http://ddr.lib.drake.edu/u?/du-relays,326",,,,,,,,,,,,,,,,,,,,,,,,,,,,,,,,,,,,,,,,,,,,,,,,"<a href=""http://ddr.lib.drake.edu/u?/du-relays,326"" target=""_blank"">View this item in its source respository</a>",,,,,,,,,,,,,,,,,,,,,,,,,,,,,https://www.iowaheritage.org/files/original/d5fa87d35e44a8096973671f2f05b7e5.jpg,"Remote Item","Drake Relays Digital Archive",1,0
2225,https://www.iowaheritage.org/items/show/2225,"Drake Relays, 1953, Emily Lou Bonham","Track athletics--Iowa--Des Moines|Queens--Drake Relays","Emily Lou Bonham of North Texas State College, the 1953 Relays Queen, sits on her throne in Drake Stadium.","Clinton, John D.","Special Collections, Cowles Library -- Drake University.",,1953,,"U.S. and International copyright laws protect this digital image. Commercial use or distribution of the image is not permitted without prior permission of the copyright holder. For permission to use the digital image, please contact: bart.schmidt@drake.edu","Drake Relays Digital Archive","35 mm color slide",,Image,"dr00149|http://ddr.lib.drake.edu/u?/du-relays,327",,,,,,,,,,,,,,,,,,,,,,,,,,,,,,,,,,,,,,,,,,,,,,,,"<a href=""http://ddr.lib.drake.edu/u?/du-relays,327"" target=""_blank"">View this item in its source respository</a>",,,,,,,,,,,,,,,,,,,,,,,,,,,,,https://www.iowaheritage.org/files/original/6186a30507ead602aa932b1feaf34034.jpg,"Remote Item","Drake Relays Digital Archive",1,0
2226,https://www.iowaheritage.org/items/show/2226,"Drake Relays, 1953, Emily Lou Bonham","Track athletics--Iowa--Des Moines|Queens--Drake Relays|Athletes--Illinois","Emily Lou Bonham of North Texas State College, 1953 Relays Queen, with a runner from the University of Illinois.","Clinton, John D.","Special Collections, Cowles Library -- Drake University.",,1953,,"U.S. and International copyright laws protect this digital image. Commercial use or distribution of the image is not permitted without prior permission of the copyright holder. For permission to use the digital image, please contact: bart.schmidt@drake.edu","Drake Relays Digital Archive","35 mm color slide",,Image,"dr00150|http://ddr.lib.drake.edu/u?/du-relays,328",,,,,,,,,,,,,,,,,,,,,,,,,,,,,,,,,,,,,,,,,,,,,,,,"<a href=""http://ddr.lib.drake.edu/u?/du-relays,328"" target=""_blank"">View this item in its source respository</a>",,,,,,,,,,,,,,,,,,,,,,,,,,,,,https://www.iowaheritage.org/files/original/c6bd895118b4cda4ab04d2ef1989b64c.jpg,"Remote Item","Drake Relays Digital Archive",1,0
2227,https://www.iowaheritage.org/items/show/2227,"Drake Relays Parade, 1951, Rachel Marie Nordberg","Track athletics--Iowa--Des Moines|Queens--Drake Relays","Relays Queen Rachel Marie Nordberg of the University of Miami Ohio.","Clinton, John D.","Special Collections, Cowles Library -- Drake University.",,1951,,"U.S. and International copyright laws protect this digital image. Commercial use or distribution of the image is not permitted without prior permission of the copyright holder. For permission to use the digital image, please contact: bart.schmidt@drake.edu","Drake Relays Digital Archive","35 mm color slide",,Image,"dr00157|http://ddr.lib.drake.edu/u?/du-relays,329",,,,,,,,,,,,,,,,,,,,,,,,,,,,,,,,,,,,,,,,,,,,,,,,"<a href=""http://ddr.lib.drake.edu/u?/du-relays,329"" target=""_blank"">View this item in its source respository</a>",,,,,,,,,,,,,,,,,,,,,,,,,,,,,https://www.iowaheritage.org/files/original/4653e479d79324a19c1a811c4048e923.jpg,"Remote Item","Drake Relays Digital Archive",1,0
2228,https://www.iowaheritage.org/items/show/2228,"Drake Relays, 1949, Mary Campbell","Track athletics--Iowa--Des Moines|Queens--Drake Relays","Mary Campbell of Southern Methodist University was the 1949 Relays Queen.","Clinton, John D.","Special Collections, Cowles Library -- Drake University.",,1949,,"U.S. and International copyright laws protect this digital image. Commercial use or distribution of the image is not permitted without prior permission of the copyright holder. For permission to use the digital image, please contact: bart.schmidt@drake.edu","Drake Relays Digital Archive","35 mm color slide",,Image,"dr00160|http://ddr.lib.drake.edu/u?/du-relays,331",,,,,,,,,,,,,,,,,,,,,,,,,,,,,,,,,,,,,,,,,,,,,,,,"<a href=""http://ddr.lib.drake.edu/u?/du-relays,331"" target=""_blank"">View this item in its source respository</a>",,,,,,,,,,,,,,,,,,,,,,,,,,,,,https://www.iowaheritage.org/files/original/e434de88115fdd7a3ed038b07b761a35.jpg,"Remote Item","Drake Relays Digital Archive",1,0
2229,https://www.iowaheritage.org/items/show/2229,"Drake Relays, 1955, Angie Branch","Track athletics--Iowa--Des Moines|Queens--Drake Relays|Rites & ceremonies--Iowa--Des Moines","Relays Queen Angie Branch (University of Houston) gets crowned by Drake president  H.G. Harmon.","Clinton, John D.","Special Collections, Cowles Library -- Drake University.",,1955,,"U.S. and International copyright laws protect this digital image. Commercial use or distribution of the image is not permitted without prior permission of the copyright holder. For permission to use the digital image, please contact: bart.schmidt@drake.edu","Drake Relays Digital Archive","35 mm color slide",,Image,"dr00152|http://ddr.lib.drake.edu/u?/du-relays,332",,,,,,,,,,,,,,,,,,,,,,,,,,,,,,,,,,,,,,,,,,,,,,,,"<a href=""http://ddr.lib.drake.edu/u?/du-relays,332"" target=""_blank"">View this item in its source respository</a>",,,,,,,,,,,,,,,,,,,,,,,,,,,,,https://www.iowaheritage.org/files/original/83d43a0857c752caa06363da18a7b2ca.jpg,"Remote Item","Drake Relays Digital Archive",1,0
2230,https://www.iowaheritage.org/items/show/2230,"Drake Relays, 1955, Angie Branch","Track athletics--Iowa--Des Moines|Queens--Drake Relays","Relays Queen Angie Branch of the University of Houston.","Clinton, John D.","Special Collections, Cowles Library -- Drake University.",,1955,,"U.S. and International copyright laws protect this digital image. Commercial use or distribution of the image is not permitted without prior permission of the copyright holder. For permission to use the digital image, please contact: bart.schmidt@drake.edu","Drake Relays Digital Archive","35 mm color slide",,Image,"dr00155|http://ddr.lib.drake.edu/u?/du-relays,333",,,,,,,,,,,,,,,,,,,,,,,,,,,,,,,,,,,,,,,,,,,,,,,,"<a href=""http://ddr.lib.drake.edu/u?/du-relays,333"" target=""_blank"">View this item in its source respository</a>",,,,,,,,,,,,,,,,,,,,,,,,,,,,,https://www.iowaheritage.org/files/original/10cda05fb630c9eabc764a6328eedc18.jpg,"Remote Item","Drake Relays Digital Archive",1,0
