 




﻿"Item Id","Item URI","Dublin Core:Title","Dublin Core:Subject","Dublin Core:Description","Dublin Core:Creator","Dublin Core:Source","Dublin Core:Publisher","Dublin Core:Date","Dublin Core:Contributor","Dublin Core:Rights","Dublin Core:Relation","Dublin Core:Format","Dublin Core:Language","Dublin Core:Type","Dublin Core:Identifier","Dublin Core:Coverage","Item Type Metadata:Text","Item Type Metadata:Interviewer","Item Type Metadata:Interviewee","Item Type Metadata:Location","Item Type Metadata:Transcription","Item Type Metadata:Local URL","Item Type Metadata:Original Format","Item Type Metadata:Physical Dimensions","Item Type Metadata:Duration","Item Type Metadata:Compression","Item Type Metadata:Producer","Item Type Metadata:Director","Item Type Metadata:Bit Rate/Frequency","Item Type Metadata:Time Summary","Item Type Metadata:Email Body","Item Type Metadata:Subject Line","Item Type Metadata:From","Item Type Metadata:To","Item Type Metadata:CC","Item Type Metadata:BCC","Item Type Metadata:Number of Attachments","Item Type Metadata:Standards","Item Type Metadata:Objectives","Item Type Metadata:Materials","Item Type Metadata:Lesson Plan Text","Item Type Metadata:URL","Item Type Metadata:Event Type","Item Type Metadata:Participants","Item Type Metadata:Birth Date","Item Type Metadata:Birthplace","Item Type Metadata:Death Date","Item Type Metadata:Occupation","Item Type Metadata:Biographical Text","Item Type Metadata:Bibliography","Item Type Metadata:Digital Reproduction Information","Item Type Metadata:Repository","Item Type Metadata:Repository Collection","Item Type Metadata:Contact information.","Item Type Metadata:File Name","Item Type Metadata:Notes","Item Type Metadata:Digital item created","Item Type Metadata:Digital item modified","Item Type Metadata:Executive Orders","Item Type Metadata:Record Created","Item Type Metadata:Record Modified","Item Type Metadata:Transcription2","Item Type Metadata:Source URL","Omeka Legacy File:Additional Creator","Omeka Legacy File:Transcriber","Omeka Legacy File:Producer","Omeka Legacy File:Render Device","Omeka Legacy File:Render Details","Omeka Legacy File:Capture Date","Omeka Legacy File:Capture Device","Omeka Legacy File:Capture Details","Omeka Legacy File:Change History","Omeka Legacy File:Watermark","Omeka Legacy File:Encryption","Omeka Legacy File:Compression","Omeka Legacy File:Post Processing","Omeka Image File:Width","Omeka Image File:Height","Omeka Image File:Bit Depth","Omeka Image File:Channels","Omeka Image File:Exif String","Omeka Image File:Exif Array","Omeka Image File:IPTC String","Omeka Image File:IPTC Array","Omeka Video File:Bitrate","Omeka Video File:Duration","Omeka Video File:Sample Rate","Omeka Video File:Codec","Omeka Video File:Width","Omeka Video File:Height",tags,file,itemType,collection,public,featured
79124,https://www.iowaheritage.org/items/show/79124,"Daniel Nelson Barn, Glendale Road","Mahaska County|Iowa","Daniel Nelson Barn, Glendale Road. This photo was taken for the Heritage Documentation Programs, a division of the National Parks Services. The Heritage Documentation Programs is responsible for administering the Historic American Buildings Survey, Historic American Engineering Record, and Historic American Landscapes Survey. All information from the Heritage Documentation Programs is archived in the Library of Congress.","Library of Congress",http://www.loc.gov/search/?q=mahaska%20county%20ia&fa=digitized:true,,,,,,image/jpeg,,image,"http://cdm16125.contentdm.oclc.org/u?/p270701coll6,309",,,,,,,,,,,,,,,,,,,,,,,,,,,,,,,,,,,,,,,,,,,,,,,,"<a href=""http://cdm16125.contentdm.oclc.org/u?/p270701coll6,309"" target=""_blank"">View this item in its source respository</a>",,,,,,,,,,,,,,,,,,,,,,,,,,,,,https://www.iowaheritage.org/files/original/f617ce95122e1e419d65ba1f6e68c005.jpg,"Remote Item","Mahaska History",1,0
79122,https://www.iowaheritage.org/items/show/79122,"Daniel Nelson Barn, Glendale Road","Mahaska County|Iowa","Daniel Nelson Barn, Glendale Road. This photo was taken for the Heritage Documentation Programs, a division of the National Parks Services. The Heritage Documentation Programs is responsible for administering the Historic American Buildings Survey, Historic American Engineering Record, and Historic American Landscapes Survey. All information from the Heritage Documentation Programs is archived in the Library of Congress.","Library of Congress",http://www.loc.gov/search/?q=mahaska%20county%20ia&fa=digitized:true,,,,,,image/jpeg,,image,"http://cdm16125.contentdm.oclc.org/u?/p270701coll6,308",,,,,,,,,,,,,,,,,,,,,,,,,,,,,,,,,,,,,,,,,,,,,,,,"<a href=""http://cdm16125.contentdm.oclc.org/u?/p270701coll6,308"" target=""_blank"">View this item in its source respository</a>",,,,,,,,,,,,,,,,,,,,,,,,,,,,,https://www.iowaheritage.org/files/original/d8be4f05cfea73843632181b99bf3c58.jpg,"Remote Item","Mahaska History",1,0
79120,https://www.iowaheritage.org/items/show/79120,"Daniel Nelson Barn, Glendale Road","Mahaska County|Iowa","This photo was taken for the Heritage Documentation Programs, a division of the National Parks Services. The Heritage Documentation Programs is responsible for administering the Historic American Buildings Survey, Historic American Engineering Record, and Historic American Landscapes Survey. All information from the Heritage Documentation Programs is archived in the Library of Congress.","Library of Congress",http://www.loc.gov/search/?q=mahaska%20county%20ia&fa=digitized:true,,,,,,image/jpeg,,image,"http://cdm16125.contentdm.oclc.org/u?/p270701coll6,307",,,,,,,,,,,,,,,,,,,,,,,,,,,,,,,,,,,,,,,,,,,,,,,,"<a href=""http://cdm16125.contentdm.oclc.org/u?/p270701coll6,307"" target=""_blank"">View this item in its source respository</a>",,,,,,,,,,,,,,,,,,,,,,,,,,,,,https://www.iowaheritage.org/files/original/d868d6fb59dd2f009a0abb335b8069aa.jpg,"Remote Item","Mahaska History",1,0
79118,https://www.iowaheritage.org/items/show/79118,"Daniel Nelson Barn, Glendale Road","Mahaska County|Iowa","Daniel Nelson Barn, Glendale Road. This photo was taken for the Heritage Documentation Programs, a division of the National Parks Services. The Heritage Documentation Programs is responsible for administering the Historic American Buildings Survey, Historic American Engineering Record, and Historic American Landscapes Survey. All information from the Heritage Documentation Programs is archived in the Library of Congress.","Library of Congress",http://www.loc.gov/search/?q=mahaska%20county%20ia&fa=digitized:true,,,,,,image/jpeg,,image,"http://cdm16125.contentdm.oclc.org/u?/p270701coll6,306",,,,,,,,,,,,,,,,,,,,,,,,,,,,,,,,,,,,,,,,,,,,,,,,"<a href=""http://cdm16125.contentdm.oclc.org/u?/p270701coll6,306"" target=""_blank"">View this item in its source respository</a>",,,,,,,,,,,,,,,,,,,,,,,,,,,,,https://www.iowaheritage.org/files/original/33cda688becc1affd0d203804ef7c432.jpg,"Remote Item","Mahaska History",1,0
79116,https://www.iowaheritage.org/items/show/79116,"Daniel Nelson Barn, Glendale Road","Mahaska County|Iowa","Daniel Nelson Barn, Glendale Road. This photo was taken for the Heritage Documentation Programs, a division of the National Parks Services. The Heritage Documentation Programs is responsible for administering the Historic American Buildings Survey, Historic American Engineering Record, and Historic American Landscapes Survey. All information from the Heritage Documentation Programs is archived in the Library of Congress.","Library of Congress",http://www.loc.gov/search/?q=mahaska%20county%20ia&fa=digitized:true,,,,,,image/jpeg,,image,"http://cdm16125.contentdm.oclc.org/u?/p270701coll6,305",,,,,,,,,,,,,,,,,,,,,,,,,,,,,,,,,,,,,,,,,,,,,,,,"<a href=""http://cdm16125.contentdm.oclc.org/u?/p270701coll6,305"" target=""_blank"">View this item in its source respository</a>",,,,,,,,,,,,,,,,,,,,,,,,,,,,,https://www.iowaheritage.org/files/original/327cf6d78605e272e04dab94ee7ce873.jpg,"Remote Item","Mahaska History",1,0
79114,https://www.iowaheritage.org/items/show/79114,"Daniel Nelson Barn, Glendale Road","Mahaska County|Iowa","Daniel Nelson Barn, Glendale Road. This photo was taken for the Heritage Documentation Programs, a division of the National Parks Services. The Heritage Documentation Programs is responsible for administering the Historic American Buildings Survey, Historic American Engineering Record, and Historic American Landscapes Survey. All information from the Heritage Documentation Programs is archived in the Library of Congress.","Library of Congress",http://www.loc.gov/search/?q=mahaska%20county%20ia&fa=digitized:true,,,,,,image/jpeg,,image,"http://cdm16125.contentdm.oclc.org/u?/p270701coll6,304",,,,,,,,,,,,,,,,,,,,,,,,,,,,,,,,,,,,,,,,,,,,,,,,"<a href=""http://cdm16125.contentdm.oclc.org/u?/p270701coll6,304"" target=""_blank"">View this item in its source respository</a>",,,,,,,,,,,,,,,,,,,,,,,,,,,,,https://www.iowaheritage.org/files/original/78015ee8639ca26fb663aa19b4c2f35f.jpg,"Remote Item","Mahaska History",1,0
79112,https://www.iowaheritage.org/items/show/79112,"Daniel Nelson Barn, Glendale Road","Mahaska County|Iowa","Daniel Nelson Barn, Glendale Road. This photo was taken for the Heritage Documentation Programs, a division of the National Parks Services. The Heritage Documentation Programs is responsible for administering the Historic American Buildings Survey, Historic American Engineering Record, and Historic American Landscapes Survey. All information from the Heritage Documentation Programs is archived in the Library of Congress.","Library of Congress",http://www.loc.gov/search/?q=mahaska%20county%20ia&fa=digitized:true,,,,,,image/jpeg,,image,"http://cdm16125.contentdm.oclc.org/u?/p270701coll6,303",,,,,,,,,,,,,,,,,,,,,,,,,,,,,,,,,,,,,,,,,,,,,,,,"<a href=""http://cdm16125.contentdm.oclc.org/u?/p270701coll6,303"" target=""_blank"">View this item in its source respository</a>",,,,,,,,,,,,,,,,,,,,,,,,,,,,,https://www.iowaheritage.org/files/original/eb855d68add35ff80f19fd2359bef76b.jpg,"Remote Item","Mahaska History",1,0
79110,https://www.iowaheritage.org/items/show/79110,"Daniel Nelson Barn, Glendale Road","Mahaska County|Iowa","Daniel Nelson Barn, Glendale Road. This photo was taken for the Heritage Documentation Programs, a division of the National Parks Services. The Heritage Documentation Programs is responsible for administering the Historic American Buildings Survey, Historic American Engineering Record, and Historic American Landscapes Survey. All information from the Heritage Documentation Programs is archived in the Library of Congress.","Library of Congress",http://www.loc.gov/search/?q=mahaska%20county%20ia&fa=digitized:true,,,,,,image/jpeg,,image,"http://cdm16125.contentdm.oclc.org/u?/p270701coll6,302",,,,,,,,,,,,,,,,,,,,,,,,,,,,,,,,,,,,,,,,,,,,,,,,"<a href=""http://cdm16125.contentdm.oclc.org/u?/p270701coll6,302"" target=""_blank"">View this item in its source respository</a>",,,,,,,,,,,,,,,,,,,,,,,,,,,,,https://www.iowaheritage.org/files/original/e89df888ddc81be93d0bdd112efaca53.jpg,"Remote Item","Mahaska History",1,0
78428,https://www.iowaheritage.org/items/show/78428,"Daniel Nelson (b. 1812-04-13, d. 1887-12-24); Farmer; Investor; Pioneer; Oskaloosa; Mahaska County; Iowa","Farming|Farmer|Pioneer|Investor|19th Century|Midwest|Oskaloosa|Mahaska County|Iowa","Daniel Nelson is one of the most remarkable people of Oskaloosa, Iowa, in Mahaska County.  Born on April 13, 1812, in Butler County, Ohio, Nelson moved west to Iowa during the late 1840's to begin a new life in farming with his wife, Margaret, and four children, William, John, James, and Martha.  Nelson and his family worked hard when first arriving in Iowa, as Nelson built a log cabin with his two bear hands and endured the harsh Iowa winters with little to spare.  After enjoying success in farming, Nelson earned enough money to build a brick home on the opposite side of his estate.  Eventually, Nelson was earning enough money to begin investing it in such commodities as coal.  Nelson died on Christmas Eve, 1887, at the age of 75.","Mahaska County Historical Society","Historical Archives","Mahaska County Historical Society",1879?|2008-08-05,"John Nelson",www.nelsonpioneer.org,,"still image/jpeg",,image,"Mahaska County Historical Society|http://cdm16125.contentdm.oclc.org/u?/p270701coll7,88",,,,,,,,,,,,,,,,,,,,,,,,,,,,,,,,,,,,,,,,,,,,,,,,"<a href=""http://cdm16125.contentdm.oclc.org/u?/p270701coll7,88"" target=""_blank"">View this item in its source respository</a>",,,,,,,,,,,,,,,,,,,,,,,,,,,,,https://www.iowaheritage.org/files/original/46f5b31e6139251e8cd876453c1afbf3.jpg,"Remote Item","Mahaska County Historical Society",1,0
78425,https://www.iowaheritage.org/items/show/78425,"Daniel and Margaret Nelson Home, Mahaska County, Iowa, mid 19th Century","Farming|Farm Houses|19th Century|Midwest|Mahaska County|Iowa","Much of the livelihood of Mahaska County, and for that matter, Iowa, has depended on farming, and the success each year brings.  Many came to Iowa to make a fresh start and begin farming on soil that hadn't been used over and over again.  This held true for Daniel and Margaret Nelson, whose home is depicted here.  Prior to this beautiful brick home being built, Daniel and Margaret Nelson, along with their four children, lived in a log cabin, built by Daniel Nelson.  As Nelson began enjoying success in farming in Mahaska County, he built the home pictured here, which was revered by many at the time as one of the finest homes in all of Mahaska County.  Today, one can visit the Nelson home and see it as lived in during pioneer days.  Situated in Oskaloosa, the Nelson Pioneer Farm offers visitors a chance to see what life on a farm during pioneer days meant to those who had endured it for several generations.","Mahaska County Historical Society","Historical Archives","Mahaska County Historical Society","Mid-19th Century|2008-08-05",,www.nelsonpioneer.org,,"still image/jpeg",,image,"Mahaska County Historical Society|http://cdm16125.contentdm.oclc.org/u?/p270701coll7,85",,,,,,,,,,,,,,,,,,,,,,,,,,,,,,,,,,,,,,,,,,,,,,,,"<a href=""http://cdm16125.contentdm.oclc.org/u?/p270701coll7,85"" target=""_blank"">View this item in its source respository</a>",,,,,,,,,,,,,,,,,,,,,,,,,,,,,https://www.iowaheritage.org/files/original/2fc14d185b62fce22cc673a8477fd685.jpg,"Remote Item","Mahaska County Historical Society",1,0
