 




﻿"Item Id","Item URI","Dublin Core:Title","Dublin Core:Subject","Dublin Core:Description","Dublin Core:Creator","Dublin Core:Source","Dublin Core:Publisher","Dublin Core:Date","Dublin Core:Contributor","Dublin Core:Rights","Dublin Core:Relation","Dublin Core:Format","Dublin Core:Language","Dublin Core:Type","Dublin Core:Identifier","Dublin Core:Coverage","Item Type Metadata:Text","Item Type Metadata:Interviewer","Item Type Metadata:Interviewee","Item Type Metadata:Location","Item Type Metadata:Transcription","Item Type Metadata:Local URL","Item Type Metadata:Original Format","Item Type Metadata:Physical Dimensions","Item Type Metadata:Duration","Item Type Metadata:Compression","Item Type Metadata:Producer","Item Type Metadata:Director","Item Type Metadata:Bit Rate/Frequency","Item Type Metadata:Time Summary","Item Type Metadata:Email Body","Item Type Metadata:Subject Line","Item Type Metadata:From","Item Type Metadata:To","Item Type Metadata:CC","Item Type Metadata:BCC","Item Type Metadata:Number of Attachments","Item Type Metadata:Standards","Item Type Metadata:Objectives","Item Type Metadata:Materials","Item Type Metadata:Lesson Plan Text","Item Type Metadata:URL","Item Type Metadata:Event Type","Item Type Metadata:Participants","Item Type Metadata:Birth Date","Item Type Metadata:Birthplace","Item Type Metadata:Death Date","Item Type Metadata:Occupation","Item Type Metadata:Biographical Text","Item Type Metadata:Bibliography","Item Type Metadata:Digital Reproduction Information","Item Type Metadata:Repository","Item Type Metadata:Repository Collection","Item Type Metadata:Contact information.","Item Type Metadata:File Name","Item Type Metadata:Notes","Item Type Metadata:Digital item created","Item Type Metadata:Digital item modified","Item Type Metadata:Executive Orders","Item Type Metadata:Record Created","Item Type Metadata:Record Modified","Item Type Metadata:Transcription2","Item Type Metadata:Source URL","Omeka Legacy File:Additional Creator","Omeka Legacy File:Transcriber","Omeka Legacy File:Producer","Omeka Legacy File:Render Device","Omeka Legacy File:Render Details","Omeka Legacy File:Capture Date","Omeka Legacy File:Capture Device","Omeka Legacy File:Capture Details","Omeka Legacy File:Change History","Omeka Legacy File:Watermark","Omeka Legacy File:Encryption","Omeka Legacy File:Compression","Omeka Legacy File:Post Processing","Omeka Image File:Width","Omeka Image File:Height","Omeka Image File:Bit Depth","Omeka Image File:Channels","Omeka Image File:Exif String","Omeka Image File:Exif Array","Omeka Image File:IPTC String","Omeka Image File:IPTC Array","Omeka Video File:Bitrate","Omeka Video File:Duration","Omeka Video File:Sample Rate","Omeka Video File:Codec","Omeka Video File:Width","Omeka Video File:Height",tags,file,itemType,collection,public,featured
64414,https://www.iowaheritage.org/items/show/64414,"Gas prices","War|United States|Automobiles|1990-2000|Oil|Oil -- Prices|Oil industry|Wars|Gasoline|Consumers|Consumption|Supply and demand|Supply|Men|Signs|Ladders|Gas pumps|Gas stations|Barrels|Shoes|Hoses","Unleaded; 3; 4; 1; 6.9","Duffy, Brian, 1955-",,"University of Iowa. Libraries. Special Collections Dept.",1991-01-19|2011-04,,"Educational use only, no other permissions given. Copyright to this digital object is owned by The Des Moines Register; it may not be downloaded, reproduced, or distributed without written permission. For more information, contact the Special Collections Department.","Editorial Cartoons of Brian Duffy; Des Moines Register Cartoonists|Papers of Brian Duffy|Des Moines Register",,English,"Still image|Editorial cartoons",MSC916|duffy-910119|http://digital.lib.uiowa.edu/cdm/ref/collection/duffy/id/252,,,,,,,,,,,,,,,,,,,,,,,,,,,,,,,,,,,,,,,,,,,,,,,,"<a href=""http://digital.lib.uiowa.edu/cdm/ref/collection/duffy/id/252"" target=""_blank"">View this item in its source respository</a>",,,,,,,,,,,,,,,,,,,,,,,,,,,,,https://www.iowaheritage.org/files/original/8fbbdcfb5f079bf6104ae95da438cfe3.jpg,"Remote Item","Editorial Cartoons of Brian Duffy",1,0
18410,https://www.iowaheritage.org/items/show/18410,"George Mills interview about journalism career [part 1], Iowa City, Iowa, April 23, 1998","Journalists|Mills, George, 1906-|Des Moines Register and Tribune Company|United States -- Iowa -- Iowa City|1990-2000|||","Section 1: Memorable Stories -- Section 2: Getting Started -- Section 3: Getting Started, Memorable Stories, Changes in Journalism -- Section 4: Memorable Stories -- Section 5: Memorable Stories -- Section 6: Memorable Stories, Cold War -- Section 7: Memorable Stories -- Section 8: Memorable Stories -- Section 9: Ethics and Objectivity, Memorable Stories -- Section 10: Memorable Stories -- Section 11: Ethics and Objectivity, Memorable Stories, Job Description -- Section 12: Changes in Journalism, Newspaper Policies, Effects of Ownership -- Section 13: Changes in Journalism, Effects of Ownership -- Section 14: Impact of Technology on Journalism, Changes in Journalism","Mills, George, 1906-",,"University of Iowa. School of Journalism and Mass Communication;",1998-04-23|2002-08-28,"Bloom, Stephen G.","Educational use only, no other permissions given. U.S. and international copyright laws may protect this digital object. Commercial use or distribution of the image is not permitted without prior permission of the copyright holder.","Iowa Journalists Oral Histories",x-flv|00:57:24,English,"Moving image;|Oral histories (Document genres); Interviews;",Bloom_Mills1_218kbps.flv|https://digital.lib.uiowa.edu/,,,,,,,,,,,,,,,,,,,,,,,,,,,,,,,,,,,,,,,,,,,,,,,,"<a href=""https://digital.lib.uiowa.edu/"" target=""_blank"">View this item in its source respository</a>",,,,,,,,,,,,,,,,,,,,,,,,,,,,,https://www.iowaheritage.org/files/original/c7d1def22ab32328e4e3a5c78a771354.jpg,"Remote Item","Iowa Journalists Oral Histories",1,1
18412,https://www.iowaheritage.org/items/show/18412,"George Mills interview about journalism career [part 2], Iowa City, Iowa, April 23, 1998","Journalists|Mills, George, 1906-|Des Moines Register and Tribune Company|United States -- Iowa -- Iowa City|1990-2000||||","Section 1: Impact of Technology on Journalism, Changes in Journalism -- Section 2: Job Description, Professional Advice -- Section 3: Getting Started -- Section 4: Memorable Stories, Changes in Journalism -- Section 5: Newspaper Lingo -- Section 6: Women in the Newsroom, Memorable Stories, Changes in Journalism, Professional Advice, World War II -- Section 7: Sacred Cows, Memorable Stories, Newspaper Policies, Cold War -- Section 8: Ethics and Objectivity, Professional Advice -- Section 9: Memorable Stories -- Section 10: Memorable Stories","Mills, George, 1906-",,"University of Iowa. School of Journalism and Mass Communication;",1998-04-23|2002-08-30,"Bloom, Stephen G.","Educational use only, no other permissions given. U.S. and international copyright laws may protect this digital object. Commercial use or distribution of the image is not permitted without prior permission of the copyright holder.","Iowa Journalists Oral Histories",x-flv|00:54:51,English,"Moving image;|Oral histories (Document genres); Interviews;",Bloom_Mills2_218kbps.flv|https://digital.lib.uiowa.edu/,,,,,,,,,,,,,,,,,,,,,,,,,,,,,,,,,,,,,,,,,,,,,,,,"<a href=""https://digital.lib.uiowa.edu/"" target=""_blank"">View this item in its source respository</a>",,,,,,,,,,,,,,,,,,,,,,,,,,,,,https://www.iowaheritage.org/files/original/e20a125104584645c9dfa826e58fb856.jpg,"Remote Item","Iowa Journalists Oral Histories",1,0
18415,https://www.iowaheritage.org/items/show/18415,"George Mills interview about journalism career [part 3], Iowa City, Iowa, April 23, 1998","Journalists|Mills, George, 1906-|Des Moines Register and Tribune Company|United States -- Iowa -- Iowa City|1990-2000||||","Section 1: Memorable Stories, Changes in Journalism, Effects of Ownership -- Section 2: Impact of Technology on Journalism, Changes in Journalism -- Section 3: Job Description, Professional Advice -- Section 4: Memorable Stories, Changes in Journalism, Job Description -- Section 5: Memorable Stories -- Section 6: Ethics and Objectivity, Memorable Stories, Changes in Journalism, Newspaper Policies -- Section 7: Ethics and Objectivity, Changes in Journalism, Newspaper Policies, Effects of Ownership -- Section 8: Memorable Stories, Changes in Journalism, Newspaper Policies, Effects of Ownership","Mills, George, 1906-",,"University of Iowa. School of Journalism and Mass Communication;",1998-04-23|2002-09-04,"Bloom, Stephen G.","Educational use only, no other permissions given. U.S. and international copyright laws may protect this digital object. Commercial use or distribution of the image is not permitted without prior permission of the copyright holder.","Iowa Journalists Oral Histories",x-flv|00:57:47,English,"Moving image;|Oral histories (Document genres); Interviews;",Bloom_Mills3_218kbps.flv|https://digital.lib.uiowa.edu/,,,,,,,,,,,,,,,,,,,,,,,,,,,,,,,,,,,,,,,,,,,,,,,,"<a href=""https://digital.lib.uiowa.edu/"" target=""_blank"">View this item in its source respository</a>",,,,,,,,,,,,,,,,,,,,,,,,,,,,,https://www.iowaheritage.org/files/original/0b1217170d35338e36368fec8aef80ca.jpg,"Remote Item","Iowa Journalists Oral Histories",1,0
18418,https://www.iowaheritage.org/items/show/18418,"George Mills interview about journalism career [part 4], Iowa City, Iowa, April 23, 1998","Journalists|Mills, George, 1906-|Des Moines Register and Tribune Company|United States -- Iowa -- Iowa City|1990-2000||||","Section 1: Labor Issues, Newspaper Policies, Effects of Ownership -- Section 2: Impact of Technology on Journalism, Changes in Journalism -- Section 3: Memorable Stories -- Section 4: Memorable Stories, Changes in Journalism, Effects of Ownership","Mills, George, 1906-",,"University of Iowa. School of Journalism and Mass Communication;",1998-04-23|2002-09-05,"Bloom, Stephen G.","Educational use only, no other permissions given. U.S. and international copyright laws may protect this digital object. Commercial use or distribution of the image is not permitted without prior permission of the copyright holder.","Iowa Journalists Oral Histories",x-flv|00:21:31,English,"Moving image;|Oral histories (Document genres); Interviews;",Bloom_Mills4_218kbps.flv|https://digital.lib.uiowa.edu/,,,,,,,,,,,,,,,,,,,,,,,,,,,,,,,,,,,,,,,,,,,,,,,,"<a href=""https://digital.lib.uiowa.edu/"" target=""_blank"">View this item in its source respository</a>",,,,,,,,,,,,,,,,,,,,,,,,,,,,,https://www.iowaheritage.org/files/original/59d7907c9663638d728f080e629d0f78.jpg,"Remote Item","Iowa Journalists Oral Histories",1,0
64681,https://www.iowaheritage.org/items/show/64681,Germany,"Germany -- Politics and government|Hitler, Adolf, 1889-1945|Germany|Arms|1990-2000|Antisemitism -- Germany|Xenophobia -- Germany|Nazism|Graves|Tombstones|Cemeteries|Trees|Moon",,"Duffy, Brian, 1955-",,"University of Iowa. Libraries. Special Collections Dept.",1992-11-25|2011-04,,"Educational use only, no other permissions given. Copyright to this digital object is owned by The Des Moines Register; it may not be downloaded, reproduced, or distributed without written permission. For more information, contact the Special Collections Department.","Editorial Cartoons of Brian Duffy; Des Moines Register Cartoonists|Papers of Brian Duffy|Des Moines Register",,English,"Still image|Editorial cartoons",MSC916|duffy-921125|http://digital.lib.uiowa.edu/cdm/ref/collection/duffy/id/519,,,,,,,,,,,,,,,,,,,,,,,,,,,,,,,,,,,,,,,,,,,,,,,,"<a href=""http://digital.lib.uiowa.edu/cdm/ref/collection/duffy/id/519"" target=""_blank"">View this item in its source respository</a>",,,,,,,,,,,,,,,,,,,,,,,,,,,,,https://www.iowaheritage.org/files/original/8a3086d311a6c05a975ae3ae6d205872.jpg,"Remote Item","Editorial Cartoons of Brian Duffy",1,0
18309,https://www.iowaheritage.org/items/show/18309,"Gil Cranberg interview about journalism career [part 1], Iowa City, Iowa, November 2, 1999","Journalists|Cranberg, Gil, 1925-|Des Moines Register and Tribune Company|United States -- Iowa -- Iowa City|1990-2000||","Section 1: Getting Started -- Section 2: Job Description,Professional Advice, Newspaper Policies -- Section 3: Memorable Stories, Newspaper Policies, Effects of Ownership, Cold War -- Section 4: Politics in the Newsroom, Ethics and Objectivity, Memorable Stories, Newspaper Policies, Effects of Ownership -- Section 5: Ethics and Objectivity, Newspaper Policies -- Section 6: Job Description -- Section 7: Ethics and Objectivity, Memorable Stories, Job Description, Newspaper Policies","Cranberg, Gil, 1925-",,"University of Iowa. School of Journalism and Mass Communication;",1999-11-02|2002-07-09,"Thomas, Brian","Educational use only, no other permissions given. U.S. and international copyright laws may protect this digital object. Commercial use or distribution of the image is not permitted without prior permission of the copyright holder.","Iowa Journalists Oral Histories",x-flv|00:54:52,English,"Moving image|Oral histories (Document genres); Interviews;",Bloom_Cranberg1_218kbps.flv|https://digital.lib.uiowa.edu/,,,,,,,,,,,,,,,,,,,,,,,,,,,,,,,,,,,,,,,,,,,,,,,,"<a href=""https://digital.lib.uiowa.edu/"" target=""_blank"">View this item in its source respository</a>",,,,,,,,,,,,,,,,,,,,,,,,,,,,,https://www.iowaheritage.org/files/original/7e942afdd0d06b9e14fbec4bcf76bd1d.jpg,"Remote Item","Iowa Journalists Oral Histories",1,0
18313,https://www.iowaheritage.org/items/show/18313,"Gil Cranberg interview about journalism career [part 2], Iowa City, Iowa, November 2, 1999 & December 7 1999","Journalists|Cranberg, Gil, 1925-|Des Moines Register and Tribune Company|United States -- Iowa -- Iowa City|1990-2000|","Section 1: Job Description,Effects of Ownership -- Section 2: Changes in Journalism, Job Description -- Section 3: Minority Issues, Women in the Newsroom -- Section 4: Politics in the Newsroom, Job Description -- Section 5: Minority Issues, Ethics and Objectivity, Job Description, Professional Advice -- Section 6: Memorable Stories, Cold War -- Section 7: Job Description -- Section 8: Changes in Journalism, Job Description -- Section 9: Impact of Technology on Journalism","Cranberg, Gil, 1925-",,"University of Iowa. School of Journalism and Mass Communication;","1999-11-02; 1999-12-07|2002-06-14","Thomas, Brian","Educational use only, no other permissions given. U.S. and international copyright laws may protect this digital object. Commercial use or distribution of the image is not permitted without prior permission of the copyright holder.","Iowa Journalists Oral Histories",x-flv|00:58:30,English,"Moving image|Oral histories (Document genres); Interviews;",Bloom_Cranberg2_218kbps.flv|https://digital.lib.uiowa.edu/,,,,,,,,,,,,,,,,,,,,,,,,,,,,,,,,,,,,,,,,,,,,,,,,"<a href=""https://digital.lib.uiowa.edu/"" target=""_blank"">View this item in its source respository</a>",,,,,,,,,,,,,,,,,,,,,,,,,,,,,https://www.iowaheritage.org/files/original/ad01f3d25f8505c10bab1629cf8cb140.jpg,"Remote Item","Iowa Journalists Oral Histories",1,0
18316,https://www.iowaheritage.org/items/show/18316,"Gil Cranberg interview about journalism career [part 3], Iowa City, Iowa, December 7, 1999","Journalists|Cranberg, Gil, 1925-|Des Moines Register and Tribune Company|United States -- Iowa -- Iowa City|1990-2000|","Section 1: Impact of Technology on Journalism -- Section 2: Labor Issues, Changes in Journalism, Professional Advice","Cranberg, Gil, 1925-",,"University of Iowa. School of Journalism and Mass Communication;",1999-12-07|2002-06-14,"Thomas, Brian","Educational use only, no other permissions given. U.S. and international copyright laws may protect this digital object. Commercial use or distribution of the image is not permitted without prior permission of the copyright holder.","Iowa Journalists Oral Histories",x-flv|00:05:30,English,"Moving image|Oral histories (Document genres); Interviews;",Bloom_Cranberg3_218kbps.flv|https://digital.lib.uiowa.edu/,,,,,,,,,,,,,,,,,,,,,,,,,,,,,,,,,,,,,,,,,,,,,,,,"<a href=""https://digital.lib.uiowa.edu/"" target=""_blank"">View this item in its source respository</a>",,,,,,,,,,,,,,,,,,,,,,,,,,,,,https://www.iowaheritage.org/files/original/2ad151ffb99ef168da7d6496519241db.jpg,"Remote Item","Iowa Journalists Oral Histories",1,0
64439,https://www.iowaheritage.org/items/show/64439,"Gorbachev's peace plan","Peace|?Azi?z, T?a?riq|Iraq|Missiles|1990-2000|War|Occupation|Resolutions|Gorbachev, Mikhail Sergeevich, 1931-|Men|Clouds|Smoke|Scarves","Aziz; Patriot","Duffy, Brian, 1955-",,"University of Iowa. Libraries. Special Collections Dept.",1991-02-20|2011-04,,"Educational use only, no other permissions given. Copyright to this digital object is owned by The Des Moines Register; it may not be downloaded, reproduced, or distributed without written permission. For more information, contact the Special Collections Department.","Editorial Cartoons of Brian Duffy; Des Moines Register Cartoonists|Papers of Brian Duffy|Des Moines Register",,English,"Still image|Editorial cartoons",MSC916|duffy-910220|http://digital.lib.uiowa.edu/cdm/ref/collection/duffy/id/277,,,,,,,,,,,,,,,,,,,,,,,,,,,,,,,,,,,,,,,,,,,,,,,,"<a href=""http://digital.lib.uiowa.edu/cdm/ref/collection/duffy/id/277"" target=""_blank"">View this item in its source respository</a>",,,,,,,,,,,,,,,,,,,,,,,,,,,,,https://www.iowaheritage.org/files/original/7db2075f53dd338ff98d99d397a976b1.jpg,"Remote Item","Editorial Cartoons of Brian Duffy",1,0
