 




﻿"Item Id","Item URI","Dublin Core:Title","Dublin Core:Subject","Dublin Core:Description","Dublin Core:Creator","Dublin Core:Source","Dublin Core:Publisher","Dublin Core:Date","Dublin Core:Contributor","Dublin Core:Rights","Dublin Core:Relation","Dublin Core:Format","Dublin Core:Language","Dublin Core:Type","Dublin Core:Identifier","Dublin Core:Coverage","Item Type Metadata:Text","Item Type Metadata:Interviewer","Item Type Metadata:Interviewee","Item Type Metadata:Location","Item Type Metadata:Transcription","Item Type Metadata:Local URL","Item Type Metadata:Original Format","Item Type Metadata:Physical Dimensions","Item Type Metadata:Duration","Item Type Metadata:Compression","Item Type Metadata:Producer","Item Type Metadata:Director","Item Type Metadata:Bit Rate/Frequency","Item Type Metadata:Time Summary","Item Type Metadata:Email Body","Item Type Metadata:Subject Line","Item Type Metadata:From","Item Type Metadata:To","Item Type Metadata:CC","Item Type Metadata:BCC","Item Type Metadata:Number of Attachments","Item Type Metadata:Standards","Item Type Metadata:Objectives","Item Type Metadata:Materials","Item Type Metadata:Lesson Plan Text","Item Type Metadata:URL","Item Type Metadata:Event Type","Item Type Metadata:Participants","Item Type Metadata:Birth Date","Item Type Metadata:Birthplace","Item Type Metadata:Death Date","Item Type Metadata:Occupation","Item Type Metadata:Biographical Text","Item Type Metadata:Bibliography","Item Type Metadata:Digital Reproduction Information","Item Type Metadata:Repository","Item Type Metadata:Repository Collection","Item Type Metadata:Contact information.","Item Type Metadata:File Name","Item Type Metadata:Notes","Item Type Metadata:Digital item created","Item Type Metadata:Digital item modified","Item Type Metadata:Executive Orders","Item Type Metadata:Record Created","Item Type Metadata:Record Modified","Item Type Metadata:Transcription2","Item Type Metadata:Source URL","Omeka Legacy File:Additional Creator","Omeka Legacy File:Transcriber","Omeka Legacy File:Producer","Omeka Legacy File:Render Device","Omeka Legacy File:Render Details","Omeka Legacy File:Capture Date","Omeka Legacy File:Capture Device","Omeka Legacy File:Capture Details","Omeka Legacy File:Change History","Omeka Legacy File:Watermark","Omeka Legacy File:Encryption","Omeka Legacy File:Compression","Omeka Legacy File:Post Processing","Omeka Image File:Width","Omeka Image File:Height","Omeka Image File:Bit Depth","Omeka Image File:Channels","Omeka Image File:Exif String","Omeka Image File:Exif Array","Omeka Image File:IPTC String","Omeka Image File:IPTC Array","Omeka Video File:Bitrate","Omeka Video File:Duration","Omeka Video File:Sample Rate","Omeka Video File:Codec","Omeka Video File:Width","Omeka Video File:Height",tags,file,itemType,collection,public,featured
79296,https://www.iowaheritage.org/items/show/79296,"Kalbach & Son Building","Mahaska County|Iowa","This photo was taken for the Heritage Documentation Programs, a division of the National Parks Services. The Heritage Documentation Programs is responsible for administering the Historic American Buildings Survey, Historic American Engineering Record, and Historic American Landscapes Survey. All information from the Heritage Documentation Programs is archived in the Library of Congress.","Library of Congress",http://www.loc.gov/search/?q=mahaska%20county%20ia&fa=digitized:true,,,,,,image/jpeg,,image,"http://cdm16125.contentdm.oclc.org/u?/p270701coll6,398",,,,,,,,,,,,,,,,,,,,,,,,,,,,,,,,,,,,,,,,,,,,,,,,"<a href=""http://cdm16125.contentdm.oclc.org/u?/p270701coll6,398"" target=""_blank"">View this item in its source respository</a>",,,,,,,,,,,,,,,,,,,,,,,,,,,,,https://www.iowaheritage.org/files/original/6f829da222af5a370773bcb5f471c3a2.jpg,"Remote Item","Mahaska History",1,0
79298,https://www.iowaheritage.org/items/show/79298,"Kalbach & Son Building","Mahaska County|Iowa","This photo was taken for the Heritage Documentation Programs, a division of the National Parks Services. The Heritage Documentation Programs is responsible for administering the Historic American Buildings Survey, Historic American Engineering Record, and Historic American Landscapes Survey. All information from the Heritage Documentation Programs is archived in the Library of Congress.","Library of Congress",http://www.loc.gov/search/?q=mahaska%20county%20ia&fa=digitized:true,,,,,,image/jpeg,,image,"http://cdm16125.contentdm.oclc.org/u?/p270701coll6,399",,,,,,,,,,,,,,,,,,,,,,,,,,,,,,,,,,,,,,,,,,,,,,,,"<a href=""http://cdm16125.contentdm.oclc.org/u?/p270701coll6,399"" target=""_blank"">View this item in its source respository</a>",,,,,,,,,,,,,,,,,,,,,,,,,,,,,https://www.iowaheritage.org/files/original/64bfbae1f65d23a6084829249d829bfc.jpg,"Remote Item","Mahaska History",1,0
79300,https://www.iowaheritage.org/items/show/79300,"Kalbach & Son Building","Mahaska County|Iowa","This photo was taken for the Heritage Documentation Programs, a division of the National Parks Services. The Heritage Documentation Programs is responsible for administering the Historic American Buildings Survey, Historic American Engineering Record, and Historic American Landscapes Survey. All information from the Heritage Documentation Programs is archived in the Library of Congress.","Library of Congress",http://www.loc.gov/search/?q=mahaska%20county%20ia&fa=digitized:true,,,,,,image/jpeg,,image,"http://cdm16125.contentdm.oclc.org/u?/p270701coll6,400",,,,,,,,,,,,,,,,,,,,,,,,,,,,,,,,,,,,,,,,,,,,,,,,"<a href=""http://cdm16125.contentdm.oclc.org/u?/p270701coll6,400"" target=""_blank"">View this item in its source respository</a>",,,,,,,,,,,,,,,,,,,,,,,,,,,,,https://www.iowaheritage.org/files/original/f49e1ccf07ba1e44e7b617de834ceec0.jpg,"Remote Item","Mahaska History",1,0
79302,https://www.iowaheritage.org/items/show/79302,"Middle Creek Bridge","Mahaska County|Iowa","This photo was taken for the Heritage Documentation Programs, a division of the National Parks Services. The Heritage Documentation Programs is responsible for administering the Historic American Buildings Survey, Historic American Engineering Record, and Historic American Landscapes Survey. All information from the Heritage Documentation Programs is archived in the Library of Congress.","Library of Congress",http://www.loc.gov/search/?q=mahaska%20county%20ia&fa=digitized:true,,,,,,image/jpeg,,image,"http://cdm16125.contentdm.oclc.org/u?/p270701coll6,401",,,,,,,,,,,,,,,,,,,,,,,,,,,,,,,,,,,,,,,,,,,,,,,,"<a href=""http://cdm16125.contentdm.oclc.org/u?/p270701coll6,401"" target=""_blank"">View this item in its source respository</a>",,,,,,,,,,,,,,,,,,,,,,,,,,,,,https://www.iowaheritage.org/files/original/ab878ea09b06d98a1cb5bf2dab04a945.jpg,"Remote Item","Mahaska History",1,0
79304,https://www.iowaheritage.org/items/show/79304,"Middle Creek Bridge","Mahaska County|Iowa","This photo was taken for the Heritage Documentation Programs, a division of the National Parks Services. The Heritage Documentation Programs is responsible for administering the Historic American Buildings Survey, Historic American Engineering Record, and Historic American Landscapes Survey. All information from the Heritage Documentation Programs is archived in the Library of Congress.","Library of Congress",http://www.loc.gov/search/?q=mahaska%20county%20ia&fa=digitized:true,,,,,,image/jpeg,,image,"http://cdm16125.contentdm.oclc.org/u?/p270701coll6,402",,,,,,,,,,,,,,,,,,,,,,,,,,,,,,,,,,,,,,,,,,,,,,,,"<a href=""http://cdm16125.contentdm.oclc.org/u?/p270701coll6,402"" target=""_blank"">View this item in its source respository</a>",,,,,,,,,,,,,,,,,,,,,,,,,,,,,https://www.iowaheritage.org/files/original/5c3bdb5284bf1850de2c0863ccfd5443.jpg,"Remote Item","Mahaska History",1,0
79306,https://www.iowaheritage.org/items/show/79306,"Middle Creek Bridge","Mahaska County|Iowa","This photo was taken for the Heritage Documentation Programs, a division of the National Parks Services. The Heritage Documentation Programs is responsible for administering the Historic American Buildings Survey, Historic American Engineering Record, and Historic American Landscapes Survey. All information from the Heritage Documentation Programs is archived in the Library of Congress.","Library of Congress",http://www.loc.gov/search/?q=mahaska%20county%20ia&fa=digitized:true,,,,,,image/jpeg,,image,"http://cdm16125.contentdm.oclc.org/u?/p270701coll6,403",,,,,,,,,,,,,,,,,,,,,,,,,,,,,,,,,,,,,,,,,,,,,,,,"<a href=""http://cdm16125.contentdm.oclc.org/u?/p270701coll6,403"" target=""_blank"">View this item in its source respository</a>",,,,,,,,,,,,,,,,,,,,,,,,,,,,,https://www.iowaheritage.org/files/original/2ca2cd5d4cb22a50b1d2d3c3b387d6ce.jpg,"Remote Item","Mahaska History",1,0
78364,https://www.iowaheritage.org/items/show/78364,"Spanish-American War Grave Memorial; Oskaloosa, Iowa; Mahaska County","Spanish-American War|Memorial|19th/20th Centuries|Veterans|Cuba|Philippines|Puerto Rico|Oskaloosa|Iowa|Mahaska County","This is a photo of a Spanish-American War grave memorial placed by the headstone of a veteran of this conflict from Mahaska County, Iowa.  Many men from Oskaloosa and other communities in Mahaska County gave service in this conflict.  The conflict lasted between 1898 and 1902 and took place in Cuba, Puerto Rico, and the Philippine Islands.  This was the method by which the United States obtained Puerto Rico and had significant influence over actions that took place in the Philippines, Cuba, and other Latin American nations.","Mahaska County Historical Society","Historical Archives","Mahaska County Historical Society",1902?|2008-07-31,,www.nelsonpioneer.org,,"still image/jpeg",,image,"Mahaska County Historical Society|http://cdm16125.contentdm.oclc.org/u?/p270701coll7,0",,,,,,,,,,,,,,,,,,,,,,,,,,,,,,,,,,,,,,,,,,,,,,,,"<a href=""http://cdm16125.contentdm.oclc.org/u?/p270701coll7,0"" target=""_blank"">View this item in its source respository</a>",,,,,,,,,,,,,,,,,,,,,,,,,,,,,https://www.iowaheritage.org/files/original/f6e3a7722fa10a205ccec8da1fcbd72e.jpg,"Remote Item","Mahaska County Historical Society",1,0
78365,https://www.iowaheritage.org/items/show/78365,"Company F, 51st Iowa Regiment, Spanish-American War, 1898; Oskaloosa, Iowa; Mahaska County","Spanish-American War|Company F|51st Iowa Regiment|19th/20th Centuries|Veterans|Cuba|Philippines|Puerto Rico|Oskaloosa|Iowa|Mahaska County","This is a photo of the men from Company F in the 51st Iowa Regiment, who gave service to their country in the Spanish-American War from 1898-1902.  Many men from Oskaloosa and other communities in Mahaska County gave service in this conflict.  The conflict lasted between 1898 and 1902 and took place in Cuba, Puerto Rico, and the Philippine Islands.  This was the method by which the United States obtained Puerto Rico and had significant influence over actions that took place in the Philippines, Cuba, and other Latin American nations.","Mahaska County Historical Society","Historical Archives","Mahaska County Historical Society",1898?|2008-07-31,,www.nelsonpioneer.org,,"still image/jpeg",,image,"Mahaska County Historical Society|http://cdm16125.contentdm.oclc.org/u?/p270701coll7,1",,,,,,,,,,,,,,,,,,,,,,,,,,,,,,,,,,,,,,,,,,,,,,,,"<a href=""http://cdm16125.contentdm.oclc.org/u?/p270701coll7,1"" target=""_blank"">View this item in its source respository</a>",,,,,,,,,,,,,,,,,,,,,,,,,,,,,https://www.iowaheritage.org/files/original/c93cb873574de819f4798c9770a29ede.jpg,"Remote Item","Mahaska County Historical Society",1,0
78366,https://www.iowaheritage.org/items/show/78366,"Company F, 51st Iowa Regiment, Spanish-American War, 1898, at Camp Merrill, California; Oskaloosa, Iowa; Mahaska County","Spanish-American War|Company F|51st Iowa Regiment|Camp Merrill, California|19th/20th Centuries|Veterans|Cuba|Philippines|Puerto Rico|Oskaloosa|Iowa|Mahaska County","This is a photo of the men from Company F in the 51st Iowa Regiment, who gave service to their country in the Spanish-American War from 1898-1902.  This is a photo of the men at Camp Merrill, California, where the men trained prior to being shipped overseas for battle.  Many men from Oskaloosa and other communities in Mahaska County gave service in this conflict.  The conflict lasted between 1898 and 1902 and took place in Cuba, Puerto Rico, and the Philippine Islands.  This was the method by which the United States obtained Puerto Rico and had significant influence over actions that took place in the Philippines, Cuba, and other Latin American nations.","Mahaska County Historical Society","Historical Archives","Mahaska County Historical Society",1898?|2008-07-31,,www.nelsonpioneer.org,,"still image/jpeg",,image,"Mahaska County Historical Society|http://cdm16125.contentdm.oclc.org/u?/p270701coll7,2",,,,,,,,,,,,,,,,,,,,,,,,,,,,,,,,,,,,,,,,,,,,,,,,"<a href=""http://cdm16125.contentdm.oclc.org/u?/p270701coll7,2"" target=""_blank"">View this item in its source respository</a>",,,,,,,,,,,,,,,,,,,,,,,,,,,,,https://www.iowaheritage.org/files/original/e4f9280e0e88970fb6dfc38a1838f66d.jpg,"Remote Item","Mahaska County Historical Society",1,0
78367,https://www.iowaheritage.org/items/show/78367,"Statues to welcome return of Company H from France from World War I, May 14, 1919; Oskaloosa, Iowa; Mahaska County","World War I|Veterans|Company H|Oskaloosa|Iowa|Mahaska County|Statues","These are two statues that were made to welcome home the men from Mahaska County, Iowa, who served in France during World War I.  This photograph dates to May 14, 1919 and was taken near the Rock Island train depot in Oskaloosa, Iowa, looking north on South 1st Street and 6th Avenue East.","Mahaska County Historical Society","Historical Archives","Mahaska County Historical Society",1919-05-14|2008-08-01,,,,"still image/jpeg",,image,"Mahaska County Historical Society|http://cdm16125.contentdm.oclc.org/u?/p270701coll7,3",,,,,,,,,,,,,,,,,,,,,,,,,,,,,,,,,,,,,,,,,,,,,,,,"<a href=""http://cdm16125.contentdm.oclc.org/u?/p270701coll7,3"" target=""_blank"">View this item in its source respository</a>",,,,,,,,,,,,,,,,,,,,,,,,,,,,,https://www.iowaheritage.org/files/original/9136155ec515e318b13bb6d21975cf70.jpg,"Remote Item","Mahaska County Historical Society",1,0
